Package4.06.0+trunk+opt+bench4.08.0+trunk+bench4.06.0+trunk+opt+bench time (s)4.08.0+trunk+bench time (s)
almabench-bench.1.0OKOK0.3530.223
alt-ergo.2.2.0OKOK38.37817.246
async.v0.11.0Aborted-0.000-
async-echo-bench.1.0Aborted-0.000-
async-rpc-bench.1.0Aborted-0.000-
async_extra.v0.11.0Aborted-0.000-
async_kernel.v0.11.0Aborted-0.000-
async_rpc_kernel.v0.11.0Aborted-0.000-
async_unix.v0.11.0Aborted-0.000-
base.v0.11.0Failure (1)-4.042-
base-bytes.baseOKOK0.0000.000
base64.2.2.0OK-0.303-
bdd-bench.1.0OKOK0.3610.250
bin_prot.v0.11.0Aborted-0.000-
biniou.1.2.0OKOK7.0230.859
camlimages.5.0.1Aborted-0.000-
camlpdf.2.2.1OKOK26.19112.968
camlzip.1.07OKOK0.8840.748
chameneos-bench.1.0Aborted-0.000-
cohttp.1.1.0Aborted-0.000-
cohttp-bench.1.0Aborted-0.000-
conf-autoconf.0.1OKOK0.8711.087
conf-gmp.1OKOK0.0790.068
conf-gnomecanvas.2OKOK0.0640.056
conf-gtksourceview.2OKOK0.1021.092
conf-libpcre.1OK-0.898-
conf-m4.1OKOK0.1010.223
conf-perl.1OKOK0.2900.245
conf-pkg-config.1.0OKOK0.4800.419
conf-which.1OKOK0.5220.445
configurator.v0.11.0Aborted-0.000-
core.v0.11.1Aborted-0.000-
core-micro-bench.1.0Aborted-0.000-
core-sequence-bench.1.0Aborted-0.000-
core_bench.v0.11.0Aborted-0.000-
core_extended.v0.11.0Aborted-0.000-
core_kernel.v0.11.0Aborted-0.000-
cpdf.2.2.1Failure (2)Failure (2)1.0110.715
cpdf-bench.1.0AbortedAborted0.0000.000
cppo.1.6.4OKOK2.4901.226
easy-format.1.3.1OKOK0.6300.491
expect_test_helpers.v0.11.0Aborted-0.000-
expect_test_helpers_kernel.v0.11.0Aborted-0.000-
fieldslib.v0.11.0Aborted-0.000-
frama-c.20171101OKOK217.13449.630
frama-c-bench.1.0OKOK0.1210.101
jane-street-headers.v0.11.0OK-0.296-
jbuilder.1.0+beta20OKOK21.4458.522
json-bench-data.1.0OKOK0.0310.025
jsonm.1.0.1OKOK6.6010.874
jsonm-bench.1.0OKOK0.1770.038
kb-bench.1.0OKOK1.4030.453
lablgtk.2.18.6OKOK55.55026.218
lexifi-g2pp-bench.1.0OKOK0.7810.810
lwt.4.0.1OK-14.829-
menhir.20171222OKOK42.99116.882
menhir-bench.1.0OKOK0.3510.163
minilight.1.6OKOK1.3660.815
minilight-bench.1.0OKOK0.0810.085
nbcodec.1.0OKOK1.1670.770
nbcodec-bench.1.0OKOK0.0570.094
num.1.1OKOK2.1381.967
numerical-analysis-bench.1.0OKOK52.63235.306
ocaml.4.06.0OK-0.072-
ocaml.4.08.0-OK-0.070
ocaml-compiler-libs.v0.11.0OK-1.688-
ocaml-migrate-parsetree.1.0.10Failure (1)-1.657-
ocaml-variants.4.06.0+trunk+optOK-386.703-
ocaml-variants.4.08.0+trunk-OK-288.642
ocamlbuild.0.12.0OKOK16.3955.730
ocamlfind.1.8.0OKOK6.4383.506
ocamlgraph.1.8.8OKOK23.57212.618
ocplib-simplex.0.4OKOK4.1984.645
octavius.1.2.0OK-2.496-
parsexp.v0.11.0OK-4.703-
patdiff.v0.11.0Aborted-0.000-
patdiff-bench.1.0Aborted-0.000-
patience_diff.v0.11.0Aborted-0.000-
pcre.7.3.4Aborted-0.000-
ppx_assert.v0.11.0Aborted-0.000-
ppx_base.v0.11.0Aborted-0.000-
ppx_bench.v0.11.0Aborted-0.000-
ppx_bin_prot.v0.11.0Aborted-0.000-
ppx_compare.v0.11.0Aborted-0.000-
ppx_custom_printf.v0.11.0Aborted-0.000-
ppx_derivers.1.0OK-0.326-
ppx_enumerate.v0.11.0Aborted-0.000-
ppx_expect.v0.11.0Aborted-0.000-
ppx_fail.v0.11.0Aborted-0.000-
ppx_fields_conv.v0.11.0Aborted-0.000-
ppx_hash.v0.11.0Aborted-0.000-
ppx_here.v0.11.0Aborted-0.000-
ppx_inline_test.v0.11.0Aborted-0.000-
ppx_jane.v0.11.0Aborted-0.000-
ppx_js_style.v0.11.0Aborted-0.000-
ppx_let.v0.11.0Aborted-0.000-
ppx_optcomp.v0.11.0Aborted-0.000-
ppx_optional.v0.11.0Aborted-0.000-
ppx_pipebang.v0.11.0Aborted-0.000-
ppx_sexp_conv.v0.11.0Aborted-0.000-
ppx_sexp_message.v0.11.0Aborted-0.000-
ppx_sexp_value.v0.11.0Aborted-0.000-
ppx_type_conv.v0.11.0Aborted-0.000-
ppx_typerep_conv.v0.11.0Aborted-0.000-
ppx_variants_conv.v0.11.0Aborted-0.000-
ppxlib.0.2.0Aborted-0.000-
protocol_version_header.v0.11.0Aborted-0.000-
psmt2-frontend.0.1OKOK7.4235.195
re.1.7.3OK-2.905-
re2.v0.11.0Aborted-0.000-
result.1.3OKOK0.5310.281
sauvola-bench.1.0Aborted-0.000-
sequence-bench.1.0OKOK1.0870.606
sexp_pretty.v0.11.0Aborted-0.000-
sexplib.v0.11.0OK-4.928-
sexplib0.v0.11.0OK-0.991-
spawn.v0.12.0OK-0.467-
splittable_random.v0.11.0Aborted-0.000-
stdio.v0.11.0Aborted-0.000-
stringext.1.5.0OK-8.627-
textutils.v0.11.0Aborted-0.000-
textutils_kernel.v0.11.0Aborted-0.000-
thread-bench.1.0Aborted-0.000-
topkg.0.9.1OKOK11.7354.818
typerep.v0.11.0Aborted-0.000-
uchar.0.0.2OKOK0.4360.437
uri.1.9.6Aborted-0.000-
uutf.1.0.1OKOK1.4680.520
variantslib.v0.11.0Aborted-0.000-
yojson.1.4.1OKOK6.7671.931
yojson-bench.1.0Failure (2)Failure (2)2.5200.353
zarith.1.7OKOK3.3473.420
Close

Error on yojson-bench.1.0 (4.08.0+trunk+bench)

Command:

/usr/bin/make -C yojson

Output

make: Entering directory '/home/louis/.opam/4.08.0+trunk+bench/.opam-switch/build/yojson-bench.1.0/yojson'
ocamlfind ocamlopt -I `ocamlfind query yojson` -o ydump_bench -package easy-format,biniou -linkpkg yojson.cmx yojson_biniou.cmx ydump.ml
gcc: error: /home/louis/.opam/4.08.0+trunk+bench/lib/yojson/yojson_biniou.o: No such file or directory
gcc: error: /home/louis/.opam/4.08.0+trunk+bench/lib/yojson/yojson.o: No such file or directory
File "caml_startup", line 1:
Error: Error during linking
Makefile:6: recipe for target 'all' failed
make: *** [all] Error 2
make: Leaving directory '/home/louis/.opam/4.08.0+trunk+bench/.opam-switch/build/yojson-bench.1.0/yojson'
Close

Error on yojson-bench.1.0 (4.06.0+trunk+opt+bench)

Command:

/usr/bin/make -C yojson

Output

make: Entering directory '/home/louis/.opam/4.06.0+trunk+opt+bench/.opam-switch/build/yojson-bench.1.0/yojson'
ocamlfind ocamlopt -I `ocamlfind query yojson` -o ydump_bench -package easy-format,biniou -linkpkg yojson.cmx yojson_biniou.cmx ydump.ml
gcc: error: /home/louis/.opam/4.06.0+trunk+opt+bench/lib/yojson/yojson_biniou.o: No such file or directory
gcc: error: /home/louis/.opam/4.06.0+trunk+opt+bench/lib/yojson/yojson.o: No such file or directory
File "caml_startup", line 1:
Error: Error during linking
Makefile:6: recipe for target 'all' failed
make: *** [all] Error 2
make: Leaving directory '/home/louis/.opam/4.06.0+trunk+opt+bench/.opam-switch/build/yojson-bench.1.0/yojson'
Close

Error on ocaml-migrate-parsetree.1.0.10 (4.06.0+trunk+opt+bench)

Command:

~/.opam/4.06.0+trunk+opt+bench/bin/jbuilder build -p ocaml-migrate-parsetree -j 7

Output

       ocaml src/ast-version,src/compiler-functions-file (exit 1)
(cd _build/default/src && /home/louis/.opam/4.06.0+trunk+opt+bench/bin/ocaml config/gen.ml 4.08.0+dev0-2018-04-09)
Unkown OCaml version 4.08.0+dev0-2018-04-09
Close

Error on cpdf.2.2.1 (4.08.0+trunk+bench)

Command:

/usr/bin/make

Output

make[1]: Entering directory '/home/louis/.opam/4.08.0+trunk+bench/.opam-switch/build/cpdf.2.2.1'
ocamlfind ocamldep -native cpdfcommand.mli > ._ncdi/cpdfcommand.di
ocamlfind ocamldep -native cpdf.mli > ._ncdi/cpdf.di
ocamlfind ocamldep -native cpdfstrftime.mli > ._ncdi/cpdfstrftime.di
ocamlfind ocamldep -native xmlm.mli > ._ncdi/xmlm.di
ocamlfind ocamldep cpdfcommandrun.ml > ._d/cpdfcommandrun.d
ocamlfind ocamldep cpdfcommand.ml > ._d/cpdfcommand.d
ocamlfind ocamldep cpdf.ml > ._d/cpdf.d
ocamlfind ocamldep cpdfstrftime.ml > ._d/cpdfstrftime.d
ocamlfind ocamldep xmlm.ml > ._d/xmlm.d
ocamlfind ocamlc -package camlpdf -c -annot xmlm.mli
ocamlfind ocamlopt -package camlpdf -c -annot -g -w -3 -annot xmlm.ml
File "xmlm.ml", line 965, characters 19-47:
Error: This expression has type string -> int -> int -> unit
       but an expression was expected of type bytes -> int -> int -> unit
       Type string is not compatible with type bytes 
OCamlMakefile:1076: recipe for target 'xmlm.cmx' failed
make[1]: *** [xmlm.cmx] Error 2
make[1]: Leaving directory '/home/louis/.opam/4.08.0+trunk+bench/.opam-switch/build/cpdf.2.2.1'
OCamlMakefile:777: recipe for target 'native-code' failed
make: *** [native-code] Error 2
Close

Error on cpdf.2.2.1 (4.06.0+trunk+opt+bench)

Command:

/usr/bin/make

Output

make[1]: Entering directory '/home/louis/.opam/4.06.0+trunk+opt+bench/.opam-switch/build/cpdf.2.2.1'
ocamlfind ocamldep -native cpdfcommand.mli > ._ncdi/cpdfcommand.di
ocamlfind ocamldep -native cpdf.mli > ._ncdi/cpdf.di
ocamlfind ocamldep -native cpdfstrftime.mli > ._ncdi/cpdfstrftime.di
ocamlfind ocamldep -native xmlm.mli > ._ncdi/xmlm.di
ocamlfind ocamldep cpdfcommandrun.ml > ._d/cpdfcommandrun.d
ocamlfind ocamldep cpdfcommand.ml > ._d/cpdfcommand.d
ocamlfind ocamldep cpdf.ml > ._d/cpdf.d
ocamlfind ocamldep cpdfstrftime.ml > ._d/cpdfstrftime.d
ocamlfind ocamldep xmlm.ml > ._d/xmlm.d
ocamlfind ocamlc -package camlpdf -c -annot xmlm.mli
ocamlfind ocamlopt -package camlpdf -c -annot -g -w -3 -annot xmlm.ml
File "xmlm.ml", line 965, characters 19-47:
Error: This expression has type string -> int -> int -> unit
       but an expression was expected of type bytes -> int -> int -> unit
       Type string is not compatible with type bytes 
OCamlMakefile:1076: recipe for target 'xmlm.cmx' failed
make[1]: *** [xmlm.cmx] Error 2
make[1]: Leaving directory '/home/louis/.opam/4.06.0+trunk+opt+bench/.opam-switch/build/cpdf.2.2.1'
OCamlMakefile:777: recipe for target 'native-code' failed
make: *** [native-code] Error 2
Close

Error on base.v0.11.0 (4.06.0+trunk+opt+bench)

Command:

~/.opam/4.06.0+trunk+opt+bench/bin/jbuilder build -p base -j 7

Output

      ocamlc shadow-stdlib/src/.shadow_stdlib.objs/shadow_stdlib.{cmi,cmti}
File "shadow-stdlib/src/shadow_stdlib.mli", line 371, characters 3-13:
Warning 53: the "deprecated" attribute cannot appear in this context
File "shadow-stdlib/src/shadow_stdlib.mli", line 1395, characters 3-13:
Warning 53: the "deprecated" attribute cannot appear in this context
      ocamlc src/.base.objs/base__Formatter.{cmi,cmti} (exit 2)
(cd _build/default && /home/louis/.opam/4.06.0+trunk+opt+bench/bin/ocamlc.opt -w -40 -safe-string -g -bin-annot -I src/.base.objs -I /home/louis/.opam/4.06.0+trunk+opt+bench/lib/sexplib0 -I compiler-stdlib/src/.caml.objs -I shadow-stdlib/src/.shadow_stdlib.objs -no-alias-deps -open Base__ -o src/.base.objs/base__Formatter.cmi -c -intf src/formatter.mli)
File "src/formatter.mli", line 9, characters 9-30:
Error: Unbound module Caml.Format
      ocamlc src/.base.objs/base__Import0.{cmi,cmo,cmt} (exit 2)
(cd _build/default && /home/louis/.opam/4.06.0+trunk+opt+bench/bin/ocamlc.opt -w -40 -safe-string -g -bin-annot -I src/.base.objs -I /home/louis/.opam/4.06.0+trunk+opt+bench/lib/sexplib0 -I compiler-stdlib/src/.caml.objs -I shadow-stdlib/src/.shadow_stdlib.objs -no-alias-deps -open Base__ -o src/.base.objs/base__Import0.cmo -c -impl src/import0.ml)
File "src/import0.ml", line 7, characters 6-394:
Error: The signature constrained by `with' has no component named Pervasives