Package4.06.0+trunk+opt+bench4.08.0+trunk+bench4.06.0+trunk+opt+bench time (s)4.08.0+trunk+bench time (s)
almabench-bench.1.0OKOK0.3930.297
alt-ergo.2.2.0OKOK38.12817.394
async.v0.11.0Aborted-0.000-
async-echo-bench.1.0Aborted-0.000-
async-rpc-bench.1.0Aborted-0.000-
async_extra.v0.11.0Aborted-0.000-
async_kernel.v0.11.0Aborted-0.000-
async_rpc_kernel.v0.11.0Aborted-0.000-
async_unix.v0.11.0Aborted-0.000-
base.v0.11.0Failure (1)-3.968-
base-bytes.baseOKOK0.0000.000
base64.2.2.0OK-0.307-
bdd-bench.1.0OKOK0.3830.268
bin_prot.v0.11.0Aborted-0.000-
biniou.1.2.0OKOK6.2870.844
camlimages.5.0.1Aborted-0.000-
camlpdf.2.2.1OKOK25.21713.326
camlzip.1.07OKOK0.9130.687
chameneos-bench.1.0Aborted-0.000-
cohttp.1.1.0Aborted-0.000-
cohttp-bench.1.0Aborted-0.000-
conf-autoconf.0.1OKOK0.9410.953
conf-gmp.1OKOK0.0820.071
conf-gnomecanvas.2OKOK0.0660.060
conf-gtksourceview.2OKOK0.1000.959
conf-libpcre.1OK-0.967-
conf-m4.1OKOK0.1030.232
conf-perl.1OKOK0.3000.253
conf-pkg-config.1.0OKOK0.4920.417
conf-which.1OKOK0.5400.449
configurator.v0.11.0Aborted-0.000-
core.v0.11.1Aborted-0.000-
core-micro-bench.1.0Aborted-0.000-
core-sequence-bench.1.0Aborted-0.000-
core_bench.v0.11.0Aborted-0.000-
core_extended.v0.11.0Aborted-0.000-
core_kernel.v0.11.0Aborted-0.000-
cpdf.2.2.1Failure (2)Failure (2)0.9850.725
cpdf-bench.1.0AbortedAborted0.0000.000
cppo.1.6.4OKOK2.4151.227
easy-format.1.3.1OKOK0.6150.387
expect_test_helpers.v0.11.0Aborted-0.000-
expect_test_helpers_kernel.v0.11.0Aborted-0.000-
fieldslib.v0.11.0Aborted-0.000-
frama-c.20171101OKOK217.75448.429
frama-c-bench.1.0OKOK0.0860.089
jane-street-headers.v0.11.0OK-0.272-
jbuilder.1.0+beta20OKOK20.9318.683
json-bench-data.1.0OKOK0.0310.026
jsonm.1.0.1OKOK2.4400.917
jsonm-bench.1.0OKOK0.0340.038
kb-bench.1.0OKOK1.4090.464
lablgtk.2.18.6OKOK54.03126.263
lexifi-g2pp-bench.1.0OKOK0.8070.856
lwt.4.0.1OK-14.622-
menhir.20171222OKOK41.81017.252
menhir-bench.1.0OKOK0.1680.163
minilight.1.6OKOK1.3750.855
minilight-bench.1.0OKOK0.0810.084
nbcodec.1.0OKOK1.1480.737
nbcodec-bench.1.0OKOK0.0880.118
num.1.1OKOK2.1372.214
numerical-analysis-bench.1.0OKOK51.43235.032
ocaml.4.06.0OK-0.076-
ocaml.4.08.0-OK-0.071
ocaml-compiler-libs.v0.11.0OK-1.672-
ocaml-migrate-parsetree.1.0.10Failure (1)-1.913-
ocaml-variants.4.06.0+trunk+optOK-387.552-
ocaml-variants.4.08.0+trunk-OK-289.131
ocamlbuild.0.12.0OKOK16.1555.682
ocamlfind.1.8.0OKOK6.4393.212
ocamlgraph.1.8.8OKOK22.50312.977
ocplib-simplex.0.4OKOK3.9125.048
octavius.1.2.0OK-2.245-
parsexp.v0.11.0OK-3.961-
patdiff.v0.11.0Aborted-0.000-
patdiff-bench.1.0Aborted-0.000-
patience_diff.v0.11.0Aborted-0.000-
pcre.7.3.4Aborted-0.000-
ppx_assert.v0.11.0Aborted-0.000-
ppx_base.v0.11.0Aborted-0.000-
ppx_bench.v0.11.0Aborted-0.000-
ppx_bin_prot.v0.11.0Aborted-0.000-
ppx_compare.v0.11.0Aborted-0.000-
ppx_custom_printf.v0.11.0Aborted-0.000-
ppx_derivers.1.0OK-0.791-
ppx_enumerate.v0.11.0Aborted-0.000-
ppx_expect.v0.11.0Aborted-0.000-
ppx_fail.v0.11.0Aborted-0.000-
ppx_fields_conv.v0.11.0Aborted-0.000-
ppx_hash.v0.11.0Aborted-0.000-
ppx_here.v0.11.0Aborted-0.000-
ppx_inline_test.v0.11.0Aborted-0.000-
ppx_jane.v0.11.0Aborted-0.000-
ppx_js_style.v0.11.0Aborted-0.000-
ppx_let.v0.11.0Aborted-0.000-
ppx_optcomp.v0.11.0Aborted-0.000-
ppx_optional.v0.11.0Aborted-0.000-
ppx_pipebang.v0.11.0Aborted-0.000-
ppx_sexp_conv.v0.11.1Aborted-0.000-
ppx_sexp_message.v0.11.0Aborted-0.000-
ppx_sexp_value.v0.11.0Aborted-0.000-
ppx_type_conv.v0.11.0Aborted-0.000-
ppx_typerep_conv.v0.11.0Aborted-0.000-
ppx_variants_conv.v0.11.0Aborted-0.000-
ppxlib.0.2.0Aborted-0.000-
protocol_version_header.v0.11.0Aborted-0.000-
psmt2-frontend.0.1OKOK7.2845.439
re.1.7.3OK-3.286-
re2.v0.11.0Aborted-0.000-
result.1.3OKOK0.4900.262
sauvola-bench.1.0Aborted-0.000-
sequence-bench.1.0OKOK1.0830.655
sexp_pretty.v0.11.0Aborted-0.000-
sexplib.v0.11.0OK-4.613-
sexplib0.v0.11.0OK-1.050-
spawn.v0.12.0OK-0.419-
splittable_random.v0.11.0Aborted-0.000-
stdio.v0.11.0Aborted-0.000-
stringext.1.5.0OK-8.039-
textutils.v0.11.0Aborted-0.000-
textutils_kernel.v0.11.0Aborted-0.000-
thread-bench.1.0Aborted-0.000-
topkg.0.9.1OKOK11.9104.640
typerep.v0.11.0Aborted-0.000-
uchar.0.0.2OKOK0.3440.407
uri.1.9.6Aborted-0.000-
uutf.1.0.1OKOK5.9430.748
variantslib.v0.11.0Aborted-0.000-
yojson.1.4.1OKOK7.2551.747
yojson-bench.1.0Failure (2)Failure (2)6.9720.434
zarith.1.7OKOK3.4093.073
Close

Error on yojson-bench.1.0 (4.08.0+trunk+bench)

Command:

/usr/bin/make -C yojson

Output

make: Entering directory '/home/louis/.opam/4.08.0+trunk+bench/.opam-switch/build/yojson-bench.1.0/yojson'
ocamlfind ocamlopt -I `ocamlfind query yojson` -o ydump_bench -package easy-format,biniou -linkpkg yojson.cmx yojson_biniou.cmx ydump.ml
gcc: error: /home/louis/.opam/4.08.0+trunk+bench/lib/yojson/yojson_biniou.o: No such file or directory
gcc: error: /home/louis/.opam/4.08.0+trunk+bench/lib/yojson/yojson.o: No such file or directory
File "caml_startup", line 1:
Error: Error during linking
Makefile:6: recipe for target 'all' failed
make: *** [all] Error 2
make: Leaving directory '/home/louis/.opam/4.08.0+trunk+bench/.opam-switch/build/yojson-bench.1.0/yojson'
Close

Error on yojson-bench.1.0 (4.06.0+trunk+opt+bench)

Command:

/usr/bin/make -C yojson

Output

make: Entering directory '/home/louis/.opam/4.06.0+trunk+opt+bench/.opam-switch/build/yojson-bench.1.0/yojson'
ocamlfind ocamlopt -I `ocamlfind query yojson` -o ydump_bench -package easy-format,biniou -linkpkg yojson.cmx yojson_biniou.cmx ydump.ml
gcc: error: /home/louis/.opam/4.06.0+trunk+opt+bench/lib/yojson/yojson_biniou.o: No such file or directory
gcc: error: /home/louis/.opam/4.06.0+trunk+opt+bench/lib/yojson/yojson.o: No such file or directory
File "caml_startup", line 1:
Error: Error during linking
Makefile:6: recipe for target 'all' failed
make: *** [all] Error 2
make: Leaving directory '/home/louis/.opam/4.06.0+trunk+opt+bench/.opam-switch/build/yojson-bench.1.0/yojson'
Close

Error on ocaml-migrate-parsetree.1.0.10 (4.06.0+trunk+opt+bench)

Command:

~/.opam/4.06.0+trunk+opt+bench/bin/jbuilder build -p ocaml-migrate-parsetree -j 7

Output

       ocaml src/ast-version,src/compiler-functions-file (exit 1)
(cd _build/default/src && /home/louis/.opam/4.06.0+trunk+opt+bench/bin/ocaml config/gen.ml 4.08.0+dev0-2018-04-09)
Unkown OCaml version 4.08.0+dev0-2018-04-09
Close

Error on cpdf.2.2.1 (4.08.0+trunk+bench)

Command:

/usr/bin/make

Output

make[1]: Entering directory '/home/louis/.opam/4.08.0+trunk+bench/.opam-switch/build/cpdf.2.2.1'
ocamlfind ocamldep -native cpdfcommand.mli > ._ncdi/cpdfcommand.di
ocamlfind ocamldep -native cpdf.mli > ._ncdi/cpdf.di
ocamlfind ocamldep -native cpdfstrftime.mli > ._ncdi/cpdfstrftime.di
ocamlfind ocamldep -native xmlm.mli > ._ncdi/xmlm.di
ocamlfind ocamldep cpdfcommandrun.ml > ._d/cpdfcommandrun.d
ocamlfind ocamldep cpdfcommand.ml > ._d/cpdfcommand.d
ocamlfind ocamldep cpdf.ml > ._d/cpdf.d
ocamlfind ocamldep cpdfstrftime.ml > ._d/cpdfstrftime.d
ocamlfind ocamldep xmlm.ml > ._d/xmlm.d
ocamlfind ocamlc -package camlpdf -c -annot xmlm.mli
ocamlfind ocamlopt -package camlpdf -c -annot -g -w -3 -annot xmlm.ml
File "xmlm.ml", line 965, characters 19-47:
Error: This expression has type string -> int -> int -> unit
       but an expression was expected of type bytes -> int -> int -> unit
       Type string is not compatible with type bytes 
OCamlMakefile:1076: recipe for target 'xmlm.cmx' failed
make[1]: *** [xmlm.cmx] Error 2
make[1]: Leaving directory '/home/louis/.opam/4.08.0+trunk+bench/.opam-switch/build/cpdf.2.2.1'
OCamlMakefile:777: recipe for target 'native-code' failed
make: *** [native-code] Error 2
Close

Error on cpdf.2.2.1 (4.06.0+trunk+opt+bench)

Command:

/usr/bin/make

Output

make[1]: Entering directory '/home/louis/.opam/4.06.0+trunk+opt+bench/.opam-switch/build/cpdf.2.2.1'
ocamlfind ocamldep -native cpdfcommand.mli > ._ncdi/cpdfcommand.di
ocamlfind ocamldep -native cpdf.mli > ._ncdi/cpdf.di
ocamlfind ocamldep -native cpdfstrftime.mli > ._ncdi/cpdfstrftime.di
ocamlfind ocamldep -native xmlm.mli > ._ncdi/xmlm.di
ocamlfind ocamldep cpdfcommandrun.ml > ._d/cpdfcommandrun.d
ocamlfind ocamldep cpdfcommand.ml > ._d/cpdfcommand.d
ocamlfind ocamldep cpdf.ml > ._d/cpdf.d
ocamlfind ocamldep cpdfstrftime.ml > ._d/cpdfstrftime.d
ocamlfind ocamldep xmlm.ml > ._d/xmlm.d
ocamlfind ocamlc -package camlpdf -c -annot xmlm.mli
ocamlfind ocamlopt -package camlpdf -c -annot -g -w -3 -annot xmlm.ml
File "xmlm.ml", line 965, characters 19-47:
Error: This expression has type string -> int -> int -> unit
       but an expression was expected of type bytes -> int -> int -> unit
       Type string is not compatible with type bytes 
OCamlMakefile:1076: recipe for target 'xmlm.cmx' failed
make[1]: *** [xmlm.cmx] Error 2
make[1]: Leaving directory '/home/louis/.opam/4.06.0+trunk+opt+bench/.opam-switch/build/cpdf.2.2.1'
OCamlMakefile:777: recipe for target 'native-code' failed
make: *** [native-code] Error 2
Close

Error on base.v0.11.0 (4.06.0+trunk+opt+bench)

Command:

~/.opam/4.06.0+trunk+opt+bench/bin/jbuilder build -p base -j 7

Output

      ocamlc shadow-stdlib/src/.shadow_stdlib.objs/shadow_stdlib.{cmi,cmti}
File "shadow-stdlib/src/shadow_stdlib.mli", line 371, characters 3-13:
Warning 53: the "deprecated" attribute cannot appear in this context
File "shadow-stdlib/src/shadow_stdlib.mli", line 1395, characters 3-13:
Warning 53: the "deprecated" attribute cannot appear in this context
      ocamlc src/.base.objs/base__Formatter.{cmi,cmti} (exit 2)
(cd _build/default && /home/louis/.opam/4.06.0+trunk+opt+bench/bin/ocamlc.opt -w -40 -safe-string -g -bin-annot -I src/.base.objs -I /home/louis/.opam/4.06.0+trunk+opt+bench/lib/sexplib0 -I compiler-stdlib/src/.caml.objs -I shadow-stdlib/src/.shadow_stdlib.objs -no-alias-deps -open Base__ -o src/.base.objs/base__Formatter.cmi -c -intf src/formatter.mli)
File "src/formatter.mli", line 9, characters 9-30:
Error: Unbound module Caml.Format
      ocamlc src/.base.objs/base__Import0.{cmi,cmo,cmt} (exit 2)
(cd _build/default && /home/louis/.opam/4.06.0+trunk+opt+bench/bin/ocamlc.opt -w -40 -safe-string -g -bin-annot -I src/.base.objs -I /home/louis/.opam/4.06.0+trunk+opt+bench/lib/sexplib0 -I compiler-stdlib/src/.caml.objs -I shadow-stdlib/src/.shadow_stdlib.objs -no-alias-deps -open Base__ -o src/.base.objs/base__Import0.cmo -c -impl src/import0.ml)
File "src/import0.ml", line 7, characters 6-394:
Error: The signature constrained by `with' has no component named Pervasives