Package4.06.0+trunk+opt+bench4.08.0+trunk+bench4.06.0+trunk+opt+bench time (s)4.08.0+trunk+bench time (s)
almabench-bench.1.0OKOK0.5020.506
alt-ergo.2.2.0OKOK38.41015.110
async.v0.11.0Aborted-0.000-
async-echo-bench.1.0Aborted-0.000-
async-rpc-bench.1.0Aborted-0.000-
async_extra.v0.11.0Aborted-0.000-
async_kernel.v0.11.0Aborted-0.000-
async_rpc_kernel.v0.11.0Aborted-0.000-
async_unix.v0.11.0Aborted-0.000-
base.v0.11.0Failure (1)-3.875-
base-bytes.baseOKOK0.0000.000
base64.2.2.0OK-0.297-
bdd-bench.1.0OKOK0.5010.640
bin_prot.v0.11.0Aborted-0.000-
biniou.1.2.0OKOK7.7110.805
camlimages.5.0.1Aborted-0.000-
camlpdf.2.2.1OKOK25.91613.868
camlzip.1.07OKOK0.8520.685
chameneos-bench.1.0Aborted-0.000-
cohttp.1.0.0Aborted-0.000-
cohttp-bench.1.0Aborted-0.000-
conf-autoconf.0.1OKOK0.9310.908
conf-gmp.1OKOK0.0780.264
conf-gnomecanvas.2OKOK0.0620.038
conf-gtksourceview.2OKOK0.0900.906
conf-libpcre.1OK-0.957-
conf-m4.1OKOK0.1000.035
conf-perl.1OKOK0.4300.066
conf-pkg-config.1.1OKOK0.6330.136
conf-which.1OKOK0.6790.474
configurator.v0.11.0Aborted-0.000-
core.v0.11.1Aborted-0.000-
core-micro-bench.1.0Aborted-0.000-
core-sequence-bench.1.0Aborted-0.000-
core_bench.v0.11.0Aborted-0.000-
core_extended.v0.11.0Aborted-0.000-
core_kernel.v0.11.0Aborted-0.000-
cpdf.2.2.1Failure (2)Failure (2)0.9540.777
cpdf-bench.1.0AbortedAborted0.0000.000
cppo.1.6.4OKOK2.4771.240
easy-format.1.3.1OKOK0.5740.382
expect_test_helpers.v0.11.0Aborted-0.000-
expect_test_helpers_kernel.v0.11.0Aborted-0.000-
fieldslib.v0.11.0Aborted-0.000-
frama-c.20180501OKOK212.61653.630
frama-c-bench.1.0OKOK0.0860.079
jane-street-headers.v0.11.0OK-0.275-
jbuilder.1.0+beta20OKOK20.8528.968
json-bench-data.1.0OKOK0.0330.025
jsonm.1.0.1OKOK2.3300.856
jsonm-bench.1.0OKOK0.0450.046
kb-bench.1.0OKOK1.4510.487
lablgtk.2.18.6OKOK54.37629.167
lexifi-g2pp-bench.1.0OKOK0.7680.834
lwt.4.1.0OK-15.212-
menhir.20180530OKOK42.25117.210
menhir-bench.1.0OKOK0.1660.166
minilight.1.6OKOK1.2760.822
minilight-bench.1.0OKOK0.1010.088
nbcodec.1.0OKOK1.0330.736
nbcodec-bench.1.0OKOK0.0940.063
num.1.1OKOK2.2712.170
numerical-analysis-bench.1.0OKOK52.54234.138
ocaml.4.06.0OK-0.072-
ocaml.4.08.0-OK-0.073
ocaml-compiler-libs.v0.11.0OK-1.665-
ocaml-migrate-parsetree.1.0.11Failure (1)-2.320-
ocaml-variants.4.06.0+trunk+optOK-379.668-
ocaml-variants.4.08.0+trunk-OK-280.134
ocamlbuild.0.12.0OKOK16.4065.614
ocamlfind.1.8.0OKOK6.4303.165
ocamlgraph.1.8.8OKOK24.17210.818
ocplib-simplex.0.4OKOK3.7012.766
octavius.1.2.0OK-2.442-
parsexp.v0.11.0OK-4.510-
patdiff.v0.11.0Aborted-0.000-
patdiff-bench.1.0Aborted-0.000-
patience_diff.v0.11.0Aborted-0.000-
pcre.7.3.4Aborted-0.000-
ppx_assert.v0.11.0Aborted-0.000-
ppx_base.v0.11.0Aborted-0.000-
ppx_bench.v0.11.0Aborted-0.000-
ppx_bin_prot.v0.11.1Aborted-0.000-
ppx_compare.v0.11.1Aborted-0.000-
ppx_custom_printf.v0.11.0Aborted-0.000-
ppx_derivers.1.0OK-0.324-
ppx_enumerate.v0.11.1Aborted-0.000-
ppx_expect.v0.11.0Aborted-0.000-
ppx_fail.v0.11.0Aborted-0.000-
ppx_fields_conv.v0.11.0Aborted-0.000-
ppx_hash.v0.11.1Aborted-0.000-
ppx_here.v0.11.0Aborted-0.000-
ppx_inline_test.v0.11.0Aborted-0.000-
ppx_jane.v0.11.0Aborted-0.000-
ppx_js_style.v0.11.0Aborted-0.000-
ppx_let.v0.11.0Aborted-0.000-
ppx_optcomp.v0.11.0Aborted-0.000-
ppx_optional.v0.11.0Aborted-0.000-
ppx_pipebang.v0.11.0Aborted-0.000-
ppx_sexp_conv.v0.11.2Aborted-0.000-
ppx_sexp_message.v0.11.0Aborted-0.000-
ppx_sexp_value.v0.11.0Aborted-0.000-
ppx_typerep_conv.v0.11.1Aborted-0.000-
ppx_variants_conv.v0.11.1Aborted-0.000-
ppxlib.0.3.0Aborted-0.000-
protocol_version_header.v0.11.0Aborted-0.000-
psmt2-frontend.0.1OKOK7.6585.262
re.1.7.3OK-2.719-
re2.v0.11.0Aborted-0.000-
result.1.3OKOK0.4870.266
sauvola-bench.1.0Aborted-0.000-
sequence-bench.1.0OKOK0.9770.601
sexp_pretty.v0.11.0Aborted-0.000-
sexplib.v0.11.0OK-4.649-
sexplib0.v0.11.0OK-9.818-
spawn.v0.12.0OK-0.423-
splittable_random.v0.11.0Aborted-0.000-
stdio.v0.11.0Aborted-0.000-
stringext.1.5.0OK-0.463-
textutils.v0.11.0Aborted-0.000-
textutils_kernel.v0.11.0Aborted-0.000-
thread-bench.1.0Aborted-0.000-
topkg.0.9.1OKOK12.4604.986
typerep.v0.11.0Aborted-0.000-
uchar.0.0.2OKOK0.3890.490
uri.1.9.7Aborted-0.000-
uutf.1.0.1OKOK5.8220.573
variantslib.v0.11.0Aborted-0.000-
yojson.1.4.1OKOK6.9081.792
yojson-bench.1.0Failure (2)Failure (2)6.9080.330
zarith.1.7OKOK3.3383.171
Close

Error on yojson-bench.1.0 (4.08.0+trunk+bench)

Command:

/usr/bin/make -C yojson

Output

make: Entering directory '/home/louis/.opam/4.08.0+trunk+bench/.opam-switch/build/yojson-bench.1.0/yojson'
ocamlfind ocamlopt -I `ocamlfind query yojson` -o ydump_bench -package easy-format,biniou -linkpkg yojson.cmx yojson_biniou.cmx ydump.ml
gcc: error: /home/louis/.opam/4.08.0+trunk+bench/lib/yojson/yojson_biniou.o: No such file or directory
gcc: error: /home/louis/.opam/4.08.0+trunk+bench/lib/yojson/yojson.o: No such file or directory
File "caml_startup", line 1:
Error: Error during linking
Makefile:6: recipe for target 'all' failed
make: *** [all] Error 2
make: Leaving directory '/home/louis/.opam/4.08.0+trunk+bench/.opam-switch/build/yojson-bench.1.0/yojson'
Close

Error on yojson-bench.1.0 (4.06.0+trunk+opt+bench)

Command:

/usr/bin/make -C yojson

Output

make: Entering directory '/home/louis/.opam/4.06.0+trunk+opt+bench/.opam-switch/build/yojson-bench.1.0/yojson'
ocamlfind ocamlopt -I `ocamlfind query yojson` -o ydump_bench -package easy-format,biniou -linkpkg yojson.cmx yojson_biniou.cmx ydump.ml
gcc: error: /home/louis/.opam/4.06.0+trunk+opt+bench/lib/yojson/yojson_biniou.o: No such file or directory
gcc: error: /home/louis/.opam/4.06.0+trunk+opt+bench/lib/yojson/yojson.o: No such file or directory
File "caml_startup", line 1:
Error: Error during linking
Makefile:6: recipe for target 'all' failed
make: *** [all] Error 2
make: Leaving directory '/home/louis/.opam/4.06.0+trunk+opt+bench/.opam-switch/build/yojson-bench.1.0/yojson'
Close

Error on ocaml-migrate-parsetree.1.0.11 (4.06.0+trunk+opt+bench)

Command:

~/.opam/4.06.0+trunk+opt+bench/bin/jbuilder build -p ocaml-migrate-parsetree -j 7

Output

       ocaml src/ast-version,src/compiler-functions-file (exit 1)
(cd _build/default/src && /home/louis/.opam/4.06.0+trunk+opt+bench/bin/ocaml config/gen.ml 4.08.0+dev0-2018-04-09)
Unkown OCaml version 4.08.0+dev0-2018-04-09
Close

Error on cpdf.2.2.1 (4.08.0+trunk+bench)

Command:

/usr/bin/make

Output

make[1]: Entering directory '/home/louis/.opam/4.08.0+trunk+bench/.opam-switch/build/cpdf.2.2.1'
ocamlfind ocamldep -native cpdfcommand.mli > ._ncdi/cpdfcommand.di
ocamlfind ocamldep -native cpdf.mli > ._ncdi/cpdf.di
ocamlfind ocamldep -native cpdfstrftime.mli > ._ncdi/cpdfstrftime.di
ocamlfind ocamldep -native xmlm.mli > ._ncdi/xmlm.di
ocamlfind ocamldep cpdfcommandrun.ml > ._d/cpdfcommandrun.d
ocamlfind ocamldep cpdfcommand.ml > ._d/cpdfcommand.d
ocamlfind ocamldep cpdf.ml > ._d/cpdf.d
ocamlfind ocamldep cpdfstrftime.ml > ._d/cpdfstrftime.d
ocamlfind ocamldep xmlm.ml > ._d/xmlm.d
ocamlfind ocamlc -package camlpdf -c -annot xmlm.mli
ocamlfind ocamlopt -package camlpdf -c -annot -g -w -3 -annot xmlm.ml
File "xmlm.ml", line 965, characters 19-47:
Error: This expression has type string/2 -> int -> int -> unit
       but an expression was expected of type bytes -> int -> int -> unit
       Type string/2 is not compatible with type bytes 
File "xmlm.ml", line 181, characters 2-24:
  Definition of type string/1
File "_none_", line 1:
  Definition of type string/2
OCamlMakefile:1076: recipe for target 'xmlm.cmx' failed
make[1]: *** [xmlm.cmx] Error 2
make[1]: Leaving directory '/home/louis/.opam/4.08.0+trunk+bench/.opam-switch/build/cpdf.2.2.1'
OCamlMakefile:777: recipe for target 'native-code' failed
make: *** [native-code] Error 2
Close

Error on cpdf.2.2.1 (4.06.0+trunk+opt+bench)

Command:

/usr/bin/make

Output

make[1]: Entering directory '/home/louis/.opam/4.06.0+trunk+opt+bench/.opam-switch/build/cpdf.2.2.1'
ocamlfind ocamldep -native cpdfcommand.mli > ._ncdi/cpdfcommand.di
ocamlfind ocamldep -native cpdf.mli > ._ncdi/cpdf.di
ocamlfind ocamldep -native cpdfstrftime.mli > ._ncdi/cpdfstrftime.di
ocamlfind ocamldep -native xmlm.mli > ._ncdi/xmlm.di
ocamlfind ocamldep cpdfcommandrun.ml > ._d/cpdfcommandrun.d
ocamlfind ocamldep cpdfcommand.ml > ._d/cpdfcommand.d
ocamlfind ocamldep cpdf.ml > ._d/cpdf.d
ocamlfind ocamldep cpdfstrftime.ml > ._d/cpdfstrftime.d
ocamlfind ocamldep xmlm.ml > ._d/xmlm.d
ocamlfind ocamlc -package camlpdf -c -annot xmlm.mli
ocamlfind ocamlopt -package camlpdf -c -annot -g -w -3 -annot xmlm.ml
File "xmlm.ml", line 965, characters 19-47:
Error: This expression has type string/2 -> int -> int -> unit
       but an expression was expected of type bytes -> int -> int -> unit
       Type string/2 is not compatible with type bytes 
File "xmlm.ml", line 181, characters 2-24:
  Definition of type string/1
File "_none_", line 1:
  Definition of type string/2
OCamlMakefile:1076: recipe for target 'xmlm.cmx' failed
make[1]: *** [xmlm.cmx] Error 2
make[1]: Leaving directory '/home/louis/.opam/4.06.0+trunk+opt+bench/.opam-switch/build/cpdf.2.2.1'
OCamlMakefile:777: recipe for target 'native-code' failed
make: *** [native-code] Error 2
Close

Error on base.v0.11.0 (4.06.0+trunk+opt+bench)

Command:

~/.opam/4.06.0+trunk+opt+bench/bin/jbuilder build -p base -j 7

Output

    ocamldep shadow-stdlib/src/shadow_stdlib.mli.d (exit 2)
(cd _build/default && /home/louis/.opam/4.06.0+trunk+opt+bench/bin/ocamldep.opt -modules -intf shadow-stdlib/src/shadow_stdlib.mli) > _build/default/shadow-stdlib/src/shadow_stdlib.mli.d
File "shadow-stdlib/src/shadow_stdlib.mli", line 1325, characters 96-97:
Error: Syntax error