Package4.03.1+bench4.05.0+flambda+opt+bench4.06.1+flambda+bench4.06.1+flambda+opt+bench4.07.1+clambda+bench4.07.1+flambda+bench4.07.1+oclassic+bench4.08.0+gpr2165+bench4.08.0+mutmatch+bench4.08.0+trunk+bench4.08.0+trunk+flambda+bench4.08.0+trunk+flambda+oclassic+bench4.08.0+trunk+flambda+opt+bench4.03.1+bench time (s)4.05.0+flambda+opt+bench time (s)4.06.1+flambda+bench time (s)4.06.1+flambda+opt+bench time (s)4.07.1+clambda+bench time (s)4.07.1+flambda+bench time (s)4.07.1+oclassic+bench time (s)4.08.0+gpr2165+bench time (s)4.08.0+mutmatch+bench time (s)4.08.0+trunk+bench time (s)4.08.0+trunk+flambda+bench time (s)4.08.0+trunk+flambda+oclassic+bench time (s)4.08.0+trunk+flambda+opt+bench time (s)
almabench-bench.1.0-AbortedAbortedAborted------AbortedAbortedAborted-0.0000.0000.000------0.0000.0000.000
alt-ergo.2.3.0-AbortedAbortedAborted---Aborted-AbortedAbortedAbortedAborted-0.0000.0000.000---0.000-0.0000.0000.0000.000
alt-ergo-lib.2.3.0-AbortedAbortedAborted---Failure (1)-AbortedAbortedAbortedAborted-0.0000.0000.000---2.473-0.0000.0000.0000.000
alt-ergo-parsers.2.3.0-AbortedAbortedAborted---Aborted-AbortedAbortedAbortedAborted-0.0000.0000.000---0.000-0.0000.0000.0000.000
async.v0.11.0-AbortedAbortedAborted----------0.0000.0000.000---------
async-echo-bench.1.0Failure (2)AbortedAbortedAbortedFailure (2)Failure (2)Failure (2)------0.4080.0000.0000.0000.4010.4040.405------
async-rpc-bench.1.0Failure (2)AbortedAbortedAbortedFailure (2)Failure (2)Failure (2)------0.4100.0000.0000.0000.4520.4600.466------
async_extra.v0.11.1-AbortedAbortedAborted----------0.0000.0000.000---------
async_kernel.v0.11.1-AbortedAbortedAborted----------0.0000.0000.000---------
async_rpc_kernel.v0.11.0-AbortedAbortedAborted----------0.0000.0000.000---------
async_unix.v0.11.0-AbortedAbortedAborted----------0.0000.0000.000---------
base.v0.11.1-AbortedAbortedAborted----------0.0000.0000.000---------
base-bytes.base-AbortedAbortedAborted------AbortedAbortedAborted-0.0000.0000.000------0.0000.0000.000
base-num.base-Aborted------------0.000-----------
base64.3.1.0-AbortedAbortedAborted----------0.0000.0000.000---------
bdd-bench.1.0-AbortedAbortedAborted------AbortedAbortedAborted-0.0000.0000.000------0.0000.0000.000
bin_prot.v0.11.0-AbortedAbortedAborted----------0.0000.0000.000---------
biniou.1.2.0-AbortedAbortedAborted------AbortedAbortedAborted-0.0000.0000.000------0.0000.0000.000
camlimages.4.2.4-Aborted------------0.000-----------
camlimages.5.0.1--AbortedAborted-----------0.0000.000---------
camlpdf.1.7.1--AbortedAbortedFailure (2)Failure (2)Failure (2)Failure (2)Failure (2)AbortedAbortedAbortedAborted--0.0000.0001.1310.8090.8201.1880.7470.0000.0000.0000.000
camlpdf.2.2.1-Aborted------------0.000-----------
camlzip.1.07-AbortedAbortedAborted-----AbortedAbortedAbortedAborted-0.0000.0000.000-----0.0000.0000.0000.000
chameneos-bench.1.0Failure (2)AbortedAbortedAbortedFailure (2)Failure (2)Failure (2)------0.7720.0000.0000.0001.5260.7010.703------
cohttp.2.0.0-AbortedAbortedAborted----------0.0000.0000.000---------
cohttp-bench.1.0Failure (2)AbortedAbortedAbortedFailure (2)Failure (2)Failure (2)------0.2770.0000.0000.0000.3300.3500.362------
conf-graphviz.0.1Failure (1)Failure (1)Failure (1)Failure (1)Failure (1)Failure (1)Failure (1)Failure (1)Failure (1)Failure (1)Failure (1)Failure (1)Failure (1)0.2170.0410.0420.0430.2580.2760.2860.3590.2140.2880.2190.2900.250
configurator.v0.11.0-AbortedAbortedAborted----------0.0000.0000.000---------
core.v0.11.3-AbortedAbortedAborted----------0.0000.0000.000---------
core-micro-bench.1.0Failure (2)AbortedAbortedAbortedFailure (2)Failure (2)Failure (2)------0.2040.0000.0000.0000.2430.2600.270------
core-sequence-bench.1.0-AbortedAbortedAborted----------0.0000.0000.000---------
core_bench.v0.11.0-AbortedAbortedAborted----------0.0000.0000.000---------
core_extended.v0.11.0-AbortedAbortedAborted----------0.0000.0000.000---------
core_kernel.v0.11.1-AbortedAbortedAborted----------0.0000.0000.000---------
cpdf.1.7--AbortedAbortedAbortedAbortedAbortedAbortedAbortedAbortedAbortedAbortedAborted--0.0000.0000.0000.0000.0000.0000.0000.0000.0000.0000.000
cpdf.2.2.1-Aborted------------0.000-----------
cpdf-bench.1.0-AbortedAbortedAbortedAbortedAbortedAbortedAbortedAbortedAbortedAbortedAbortedAborted-0.0000.0000.0000.0000.0000.0000.0000.0000.0000.0000.0000.000
cppo.1.6.5-AbortedAbortedAborted------AbortedAbortedAborted-0.0000.0000.000------0.0000.0000.000
dune.1.8.2-AbortedAbortedAborted----Failure (2)-AbortedAbortedAborted-0.0000.0000.000----0.428-0.0000.0000.000
easy-format.1.3.1-AbortedAbortedAborted------AbortedAbortedAborted-0.0000.0000.000------0.0000.0000.000
expect_test_helpers.v0.11.0-AbortedAbortedAborted----------0.0000.0000.000---------
expect_test_helpers_kernel.v0.11.0-AbortedAbortedAborted----------0.0000.0000.000---------
fieldslib.v0.11.0-AbortedAbortedAborted----------0.0000.0000.000---------
frama-c.17.1-Aborted------------0.000-----------
frama-c.18.0--AbortedAborted---Aborted-AbortedAbortedAbortedAborted--0.0000.000---0.000-0.0000.0000.0000.000
frama-c-bench.1.0-AbortedAbortedAborted---Aborted-AbortedAbortedAbortedAborted-0.0000.0000.000---0.000-0.0000.0000.0000.000
jane-street-headers.v0.11.0-AbortedAbortedAborted----------0.0000.0000.000---------
jane-street-headers.v0.12.0----------AbortedAbortedAborted----------0.0000.0000.000
jbuilder.transition-AbortedAbortedAborted----Aborted-AbortedAbortedAborted-0.0000.0000.000----0.000-0.0000.0000.000
json-bench-data.1.0-AbortedAbortedAborted------AbortedAbortedAborted-0.0000.0000.000------0.0000.0000.000
jsonm.1.0.1-AbortedAbortedAborted---Aborted-AbortedAbortedAbortedAborted-0.0000.0000.000---0.000-0.0000.0000.0000.000
jsonm-bench.1.0-AbortedAbortedAborted---Aborted-AbortedAbortedAbortedAborted-0.0000.0000.000---0.000-0.0000.0000.0000.000
kb-bench.1.0-AbortedAbortedAborted------AbortedAbortedAborted-0.0000.0000.000------0.0000.0000.000
lablgtk.2.18.5-Aborted------------0.000-----------
lablgtk.2.18.7--AbortedAborted---Failure (2)-AbortedAbortedAbortedAborted--0.0000.000---8.937-0.0000.0000.0000.000
lexifi-g2pp-bench.1.0-AbortedAbortedAborted------AbortedAbortedAborted-0.0000.0000.000------0.0000.0000.000
lwt.4.1.0-AbortedAbortedAborted------AbortedAbortedAborted-0.0000.0000.000------0.0000.0000.000
menhir.20181113-AbortedAbortedAborted-----AbortedAbortedAbortedAborted-0.0000.0000.000-----0.0000.0000.0000.000
menhir-bench.1.0-AbortedAbortedAborted-----AbortedAbortedAbortedAborted-0.0000.0000.000-----0.0000.0000.0000.000
minilight.1.6-AbortedAbortedAborted------AbortedAbortedAborted-0.0000.0000.000------0.0000.0000.000
minilight-bench.1.0-AbortedAbortedAborted------AbortedAbortedAborted-0.0000.0000.000------0.0000.0000.000
nbcodec.1.0-AbortedAbortedAborted-----AbortedAbortedAbortedAborted-0.0000.0000.000-----0.0000.0000.0000.000
nbcodec-bench.1.0-AbortedAbortedAborted-----AbortedAbortedAbortedAborted-0.0000.0000.000-----0.0000.0000.0000.000
num.0-Aborted------------0.000-----------
num.1.1--AbortedAborted-----AbortedAbortedAbortedAborted--0.0000.000-----0.0000.0000.0000.000
numerical-analysis-bench.1.0-AbortedAbortedAborted---Failure (2)-Failure (2)AbortedAbortedAborted-0.0000.0000.000---6.929-6.0250.0000.0000.000
ocaml.4.05.0-Failure (1)------------0.073-----------
ocaml.4.06.1--Failure (1)Failure (1)-----------0.0780.082---------
ocaml.4.08.0----------AbortedAbortedAborted----------0.0000.0000.000
ocaml-compiler-libs.v0.11.0-AbortedAbortedAborted------AbortedAbortedAborted-0.0000.0000.000------0.0000.0000.000
ocaml-migrate-parsetree.1.2.0-AbortedAbortedAborted----------0.0000.0000.000---------
ocaml-variants.4.08.0+trunk+flambda----------Failure (1)------------0.235--
ocaml-variants.4.08.0+trunk+flambda+oclassic-----------Failure (1)------------0.306-
ocaml-variants.4.08.0+trunk+flambda+opt------------Failure (1)------------0.272
ocamlbuild.0.14.0-AbortedAbortedAborted------AbortedAbortedAborted-0.0000.0000.000------0.0000.0000.000
ocamlfind.1.8.0-AbortedAbortedAborted-----Failure (1)AbortedAbortedAborted-0.0000.0000.000-----0.1230.0000.0000.000
ocamlgraph.1.8.8-AbortedAbortedAborted---Aborted-AbortedAbortedAbortedAborted-0.0000.0000.000---0.000-0.0000.0000.0000.000
ocplib-endian.0.8-Aborted------------0.000-----------
ocplib-simplex.0.4-AbortedAbortedAborted-----AbortedAbortedAbortedAborted-0.0000.0000.000-----0.0000.0000.0000.000
octavius.1.2.0-AbortedAbortedAborted----------0.0000.0000.000---------
omake.0.10.3-Aborted------------0.000-----------
parsexp.v0.11.0-AbortedAbortedAborted------AbortedAbortedAborted-0.0000.0000.000------0.0000.0000.000
patdiff.v0.11.0-AbortedAbortedAborted----------0.0000.0000.000---------
patdiff-bench.1.0-AbortedAbortedAborted----------0.0000.0000.000---------
patience_diff.v0.11.0-AbortedAbortedAborted----------0.0000.0000.000---------
pcre.7.4.1-AbortedAbortedAborted----------0.0000.0000.000---------
ppx_assert.v0.11.0-AbortedAbortedAborted----------0.0000.0000.000---------
ppx_base.v0.11.0-AbortedAbortedAborted----------0.0000.0000.000---------
ppx_bench.v0.11.0-AbortedAbortedAborted----------0.0000.0000.000---------
ppx_bin_prot.v0.11.1-AbortedAbortedAborted----------0.0000.0000.000---------
ppx_compare.v0.11.1-AbortedAbortedAborted----------0.0000.0000.000---------
ppx_custom_printf.v0.11.0-AbortedAbortedAborted----------0.0000.0000.000---------
ppx_derivers.1.0-AbortedAbortedAborted------AbortedAbortedAborted-0.0000.0000.000------0.0000.0000.000
ppx_enumerate.v0.11.1-AbortedAbortedAborted----------0.0000.0000.000---------
ppx_expect.v0.11.1-AbortedAbortedAborted----------0.0000.0000.000---------
ppx_fail.v0.11.0-AbortedAbortedAborted----------0.0000.0000.000---------
ppx_fields_conv.v0.11.0-AbortedAbortedAborted----------0.0000.0000.000---------
ppx_hash.v0.11.1-AbortedAbortedAborted----------0.0000.0000.000---------
ppx_here.v0.11.0-AbortedAbortedAborted----------0.0000.0000.000---------
ppx_inline_test.v0.11.0-AbortedAbortedAborted----------0.0000.0000.000---------
ppx_jane.v0.11.0-AbortedAbortedAborted----------0.0000.0000.000---------
ppx_js_style.v0.11.0-AbortedAbortedAborted----------0.0000.0000.000---------
ppx_let.v0.11.0-AbortedAbortedAborted----------0.0000.0000.000---------
ppx_optcomp.v0.11.0-AbortedAbortedAborted----------0.0000.0000.000---------
ppx_optional.v0.11.0-AbortedAbortedAborted----------0.0000.0000.000---------
ppx_pipebang.v0.11.0-AbortedAbortedAborted----------0.0000.0000.000---------
ppx_sexp_conv.v0.11.2-AbortedAbortedAborted----------0.0000.0000.000---------
ppx_sexp_message.v0.11.0-AbortedAbortedAborted----------0.0000.0000.000---------
ppx_sexp_value.v0.11.0-AbortedAbortedAborted----------0.0000.0000.000---------
ppx_typerep_conv.v0.11.1-AbortedAbortedAborted----------0.0000.0000.000---------
ppx_variants_conv.v0.11.1-AbortedAbortedAborted----------0.0000.0000.000---------
ppxlib.0.5.0-AbortedAbortedAborted----------0.0000.0000.000---------
protocol_version_header.v0.11.0-AbortedAbortedAborted----------0.0000.0000.000---------
psmt2-frontend.0.2-AbortedAbortedAborted-----AbortedAbortedAbortedAborted-0.0000.0000.000-----0.0000.0000.0000.000
re.1.8.0-AbortedAbortedAborted------AbortedAbortedAborted-0.0000.0000.000------0.0000.0000.000
re2.v0.11.0-AbortedAbortedAborted----------0.0000.0000.000---------
react.1.2.0-Aborted------------0.000-----------
result.1.3-AbortedAbortedAborted------AbortedAbortedAborted-0.0000.0000.000------0.0000.0000.000
sauvola-bench.1.0-AbortedAbortedAborted----------0.0000.0000.000---------
seq.0.1-AbortedAbortedAborted----------0.0000.0000.000---------
seq.base----------AbortedAbortedAborted----------0.0000.0000.000
sequence-bench.1.0-AbortedAbortedAborted------AbortedAbortedAborted-0.0000.0000.000------0.0000.0000.000
sexp_pretty.v0.11.0-AbortedAbortedAborted----------0.0000.0000.000---------
sexplib.v0.11.0-AbortedAbortedAborted------AbortedAbortedAborted-0.0000.0000.000------0.0000.0000.000
sexplib0.v0.11.0-AbortedAbortedAborted------AbortedAbortedAborted-0.0000.0000.000------0.0000.0000.000
spawn.v0.12.0-AbortedAbortedAborted------AbortedAbortedAborted-0.0000.0000.000------0.0000.0000.000
splittable_random.v0.11.0-AbortedAbortedAborted----------0.0000.0000.000---------
stdio.v0.11.0-AbortedAbortedAborted----------0.0000.0000.000---------
stringext.1.5.0-AbortedAbortedAborted----------0.0000.0000.000---------
textutils.v0.11.0-AbortedAbortedAborted----------0.0000.0000.000---------
textutils_kernel.v0.11.0-AbortedAbortedAborted----------0.0000.0000.000---------
thread-bench.1.0-AbortedAbortedAbortedFailure (2)Failure (2)Failure (2)-------0.0000.0000.0001.2630.6860.647------
topkg.1.0.0-AbortedAbortedAborted---Failure (2)-AbortedAbortedAbortedAborted-0.0000.0000.000---0.413-0.0000.0000.0000.000
typerep.v0.11.0-AbortedAbortedAborted----------0.0000.0000.000---------
uchar.0.0.2-AbortedAbortedAborted------AbortedAbortedAborted-0.0000.0000.000------0.0000.0000.000
uri.2.2.0-AbortedAbortedAborted----------0.0000.0000.000---------
uuidm.0.9.5-Aborted------------0.000-----------
uutf.1.0.2-AbortedAbortedAborted---Aborted-AbortedAbortedAbortedAborted-0.0000.0000.000---0.000-0.0000.0000.0000.000
valet-bench.1.0Failure (2)Aborted-----------0.5670.000-----------
variantslib.v0.11.0-AbortedAbortedAborted----------0.0000.0000.000---------
yojson.1.7.0-AbortedAbortedAborted------AbortedAbortedAborted-0.0000.0000.000------0.0000.0000.000
yojson-bench.1.0Failure (2)AbortedAbortedAbortedFailure (2)Failure (2)Failure (2)Failure (2)Failure (2)Failure (2)AbortedAbortedAborted0.1510.0000.0000.0000.7360.2050.1750.1610.1290.0700.0000.0000.000
zarith.1.7-AbortedAbortedAborted-----AbortedAbortedAbortedAborted-0.0000.0000.000-----0.0000.0000.0000.000
Close

Error on yojson-bench.1.0 (4.08.0+trunk+bench)

Command:

/usr/bin/make -C yojson

Output

make: Entering directory '/home/louis/.opam/4.08.0+trunk+bench/.opam-switch/build/yojson-bench.1.0/yojson'
ocamlfind ocamlopt -I `ocamlfind query yojson` -o ydump_bench -package easy-format,biniou -linkpkg yojson.cmx yojson_biniou.cmx ydump.ml
ocamlfind: Package `yojson' not found
ocamlfind: Package `easy-format' not found
Makefile:6: recipe for target 'all' failed
make: *** [all] Error 2
make: Leaving directory '/home/louis/.opam/4.08.0+trunk+bench/.opam-switch/build/yojson-bench.1.0/yojson'
Close

Error on yojson-bench.1.0 (4.08.0+mutmatch+bench)

Command:

/usr/bin/make -C yojson

Output

make: Entering directory '/home/louis/.opam/4.08.0+mutmatch+bench/.opam-switch/build/yojson-bench.1.0/yojson'
ocamlfind ocamlopt -I `ocamlfind query yojson` -o ydump_bench -package easy-format,biniou -linkpkg yojson.cmx yojson_biniou.cmx ydump.ml
gcc: error: /home/louis/.opam/4.08.0+mutmatch+bench/lib/yojson/yojson_biniou.o: No such file or directory
gcc: error: /home/louis/.opam/4.08.0+mutmatch+bench/lib/yojson/yojson.o: No such file or directory
File "caml_startup", line 1:
Error: Error during linking
Makefile:6: recipe for target 'all' failed
make: *** [all] Error 2
make: Leaving directory '/home/louis/.opam/4.08.0+mutmatch+bench/.opam-switch/build/yojson-bench.1.0/yojson'
Close

Error on yojson-bench.1.0 (4.08.0+gpr2165+bench)

Command:

/usr/bin/make -C yojson

Output

make: Entering directory '/home/louis/.opam/4.08.0+gpr2165+bench/.opam-switch/build/yojson-bench.1.0/yojson'
ocamlfind ocamlopt -I `ocamlfind query yojson` -o ydump_bench -package easy-format,biniou -linkpkg yojson.cmx yojson_biniou.cmx ydump.ml
gcc: error: /home/louis/.opam/4.08.0+gpr2165+bench/lib/yojson/yojson_biniou.o: No such file or directory
gcc: error: /home/louis/.opam/4.08.0+gpr2165+bench/lib/yojson/yojson.o: No such file or directory
File "caml_startup", line 1:
Error: Error during linking
Makefile:6: recipe for target 'all' failed
make: *** [all] Error 2
make: Leaving directory '/home/louis/.opam/4.08.0+gpr2165+bench/.opam-switch/build/yojson-bench.1.0/yojson'
Close

Error on yojson-bench.1.0 (4.07.1+oclassic+bench)

Command:

/usr/bin/make -C yojson

Output

make: Entering directory '/home/louis/.opam/4.07.1+oclassic+bench/.opam-switch/build/yojson-bench.1.0/yojson'
ocamlfind ocamlopt -I `ocamlfind query yojson` -o ydump_bench -package easy-format,biniou -linkpkg yojson.cmx yojson_biniou.cmx ydump.ml
gcc: error: /home/louis/.opam/4.07.1+oclassic+bench/lib/yojson/yojson_biniou.o: No such file or directory
gcc: error: /home/louis/.opam/4.07.1+oclassic+bench/lib/yojson/yojson.o: No such file or directory
File "caml_startup", line 1:
Error: Error during linking
Makefile:6: recipe for target 'all' failed
make: *** [all] Error 2
make: Leaving directory '/home/louis/.opam/4.07.1+oclassic+bench/.opam-switch/build/yojson-bench.1.0/yojson'
make: Entering directory '/home/louis/.opam/4.07.1+oclassic+bench/.opam-switch/build/yojson-bench.1.0/yojson'
ocamlfind ocamlopt -I `ocamlfind query yojson` -o ydump_bench -package easy-format,biniou -linkpkg yojson.cmx yojson_biniou.cmx ydump.ml
gcc: error: /home/louis/.opam/4.07.1+oclassic+bench/lib/yojson/yojson_biniou.o: No such file or directory
gcc: error: /home/louis/.opam/4.07.1+oclassic+bench/lib/yojson/yojson.o: No such file or directory
File "caml_startup", line 1:
Error: Error during linking
Makefile:6: recipe for target 'all' failed
make: *** [all] Error 2
make: Leaving directory '/home/louis/.opam/4.07.1+oclassic+bench/.opam-switch/build/yojson-bench.1.0/yojson'
Close

Error on yojson-bench.1.0 (4.07.1+flambda+bench)

Command:

/usr/bin/make -C yojson

Output

make: Entering directory '/home/louis/.opam/4.07.1+clambda+bench/.opam-switch/build/yojson-bench.1.0/yojson'
ocamlfind ocamlopt -I `ocamlfind query yojson` -o ydump_bench -package easy-format,biniou -linkpkg yojson.cmx yojson_biniou.cmx ydump.ml
gcc: error: /home/louis/.opam/4.07.1+clambda+bench/lib/yojson/yojson_biniou.o: No such file or directory
gcc: error: /home/louis/.opam/4.07.1+clambda+bench/lib/yojson/yojson.o: No such file or directory
File "caml_startup", line 1:
Error: Error during linking
Makefile:6: recipe for target 'all' failed
make: *** [all] Error 2
make: Leaving directory '/home/louis/.opam/4.07.1+clambda+bench/.opam-switch/build/yojson-bench.1.0/yojson'
make: Entering directory '/home/louis/.opam/4.07.1+flambda+bench/.opam-switch/build/yojson-bench.1.0/yojson'
ocamlfind ocamlopt -I `ocamlfind query yojson` -o ydump_bench -package easy-format,biniou -linkpkg yojson.cmx yojson_biniou.cmx ydump.ml
gcc: error: /home/louis/.opam/4.07.1+flambda+bench/lib/yojson/yojson_biniou.o: No such file or directory
gcc: error: /home/louis/.opam/4.07.1+flambda+bench/lib/yojson/yojson.o: No such file or directory
File "caml_startup", line 1:
Error: Error during linking
Makefile:6: recipe for target 'all' failed
make: *** [all] Error 2
make: Leaving directory '/home/louis/.opam/4.07.1+flambda+bench/.opam-switch/build/yojson-bench.1.0/yojson'
Close

Error on yojson-bench.1.0 (4.07.1+clambda+bench)

Command:

/usr/bin/make -C yojson

Output

make: Entering directory '/home/louis/.opam/4.07.1+clambda+bench/.opam-switch/build/yojson-bench.1.0/yojson'
ocamlfind ocamlopt -I `ocamlfind query yojson` -o ydump_bench -package easy-format,biniou -linkpkg yojson.cmx yojson_biniou.cmx ydump.ml
gcc: error: /home/louis/.opam/4.07.1+clambda+bench/lib/yojson/yojson_biniou.o: No such file or directory
gcc: error: /home/louis/.opam/4.07.1+clambda+bench/lib/yojson/yojson.o: No such file or directory
File "caml_startup", line 1:
Error: Error during linking
Makefile:6: recipe for target 'all' failed
make: *** [all] Error 2
make: Leaving directory '/home/louis/.opam/4.07.1+clambda+bench/.opam-switch/build/yojson-bench.1.0/yojson'
Close

Error on yojson-bench.1.0 (4.03.1+bench)

Command:

/usr/bin/make -C yojson

Output

make: Entering directory '/home/louis/.opam/4.03.1+bench/.opam-switch/build/yojson-bench.1.0/yojson'
ocamlfind ocamlopt -I `ocamlfind query yojson` -o ydump_bench -package easy-format,biniou -linkpkg yojson.cmx yojson_biniou.cmx ydump.ml
gcc: error: /home/louis/.opam/4.03.1+bench/lib/yojson/yojson_biniou.o: No such file or directory
gcc: error: /home/louis/.opam/4.03.1+bench/lib/yojson/yojson.o: No such file or directory
File "caml_startup", line 1:
Error: Error during linking
Makefile:6: recipe for target 'all' failed
make: *** [all] Error 2
make: Leaving directory '/home/louis/.opam/4.03.1+bench/.opam-switch/build/yojson-bench.1.0/yojson'
Close

Error on valet-bench.1.0 (4.03.1+bench)

Command:

/usr/bin/make -C valet

Output

make: Entering directory '/home/louis/.opam/4.03.1+bench/.opam-switch/build/valet-bench.1.0/valet'
ocamlbuild -use-ocamlfind test_lwt.native test_async.native
ocamlfind ocamldep -package react -package uuidm -package unix -package ocplib-endian -package lwt.unix -modules test_lwt.ml > test_lwt.ml.depends
ocamlfind ocamldep -package react -package uuidm -package ocplib-endian -modules test_lib.ml > test_lib.ml.depends
ocamlfind ocamldep -package uuidm -package unix -package ocplib-endian -modules valet_core.ml > valet_core.ml.depends
ocamlfind ocamldep -package react -package uuidm -package ocplib-endian -modules valet_react.ml > valet_react.ml.depends
ocamlfind ocamlc -c -g -bin-annot -package uuidm -package unix -package ocplib-endian -o valet_core.cmo valet_core.ml
ocamlfind ocamlc -c -g -bin-annot -package react -package uuidm -package ocplib-endian -o valet_react.cmo valet_react.ml
ocamlfind ocamlc -c -g -bin-annot -package react -package uuidm -package ocplib-endian -o test_lib.cmo test_lib.ml
ocamlfind ocamlc -c -g -bin-annot -package react -package uuidm -package unix -package ocplib-endian -package lwt.unix -o test_lwt.cmo test_lwt.ml
+ ocamlfind ocamlc -c -g -bin-annot -package react -package uuidm -package unix -package ocplib-endian -package lwt.unix -o test_lwt.cmo test_lwt.ml
ocamlfind: [WARNING] Package `threads': Linking problems may arise because of the missing -thread or -vmthread switch
ocamlfind ocamlopt -c -g -bin-annot -package uuidm -package unix -package ocplib-endian -o valet_core.cmx valet_core.ml
ocamlfind ocamlopt -c -g -bin-annot -package react -package uuidm -package ocplib-endian -o valet_react.cmx valet_react.ml
ocamlfind ocamlopt -c -g -bin-annot -package react -package uuidm -package ocplib-endian -o test_lib.cmx test_lib.ml
ocamlfind ocamlopt -c -g -bin-annot -package react -package uuidm -package unix -package ocplib-endian -package lwt.unix -o test_lwt.cmx test_lwt.ml
+ ocamlfind ocamlopt -c -g -bin-annot -package react -package uuidm -package unix -package ocplib-endian -package lwt.unix -o test_lwt.cmx test_lwt.ml
ocamlfind: [WARNING] Package `threads': Linking problems may arise because of the missing -thread or -vmthread switch
ocamlfind ocamlopt -linkpkg -g -package react -package uuidm -package unix -package ocplib-endian -package lwt.unix valet_core.cmx valet_react.cmx test_lib.cmx test_lwt.cmx -o test_lwt.native
+ ocamlfind ocamlopt -linkpkg -g -package react -package uuidm -package unix -package ocplib-endian -package lwt.unix valet_core.cmx valet_react.cmx test_lib.cmx test_lwt.cmx -o test_lwt.native
ocamlfind: [WARNING] Package `threads': Linking problems may arise because of the missing -thread or -vmthread switch
ocamlfind ocamldep -package react -package uuidm -package unix -package ocplib-endian -package async -modules test_async.ml > test_async.ml.depends
ocamlfind ocamlc -c -g -bin-annot -thread -package react -package uuidm -package unix -package ocplib-endian -package async -o test_async.cmo test_async.ml
+ ocamlfind ocamlc -c -g -bin-annot -thread -package react -package uuidm -package unix -package ocplib-endian -package async -o test_async.cmo test_async.ml
File "test_async.ml", line 3, characters 5-13:
Warning 3: deprecated: module Core.Std
[since 2017-02] Use Core. The Std sub-module is no longer needed
File "test_async.ml", line 4, characters 5-14:
Warning 3: deprecated: module Async.Std
[since 2017-02] use Async. The Std sub-module is no longer needed
File "test_async.ml", line 23, characters 13-22:
Warning 3: deprecated: module Async.Std
[since 2017-02] use Async. The Std sub-module is no longer needed
File "test_async.ml", line 64, characters 5-19:
Error: This expression has type
         [> `Probably_should_not_use_blocking_Core_Printf_functions_with_Async ]
       This is not a function; it cannot be applied.
Command exited with code 2.
Makefile:6: recipe for target 'all' failed
make: *** [all] Error 10
make: Leaving directory '/home/louis/.opam/4.03.1+bench/.opam-switch/build/valet-bench.1.0/valet'
Close

Error on topkg.1.0.0 (4.08.0+gpr2165+bench)

Command:

~/.opam/4.08.0+gpr2165+bench/bin/ocaml pkg/pkg.ml build --pkg-name topkg --dev-pkg false

Output

File "src/topkg_result.ml", line 12, characters 27-40:
12 | type ('a, 'b) r = ('a, 'b) Result.result = Ok of 'a |	Error of 'b
                                ^^^^^^^^^^^^^
Error: Unbound type constructor Result.result
File "src/topkg_log.ml", line 7, characters 5-17:
7 | open Topkg_result
         ^^^^^^^^^^^^
Error: Unbound module Topkg_result
File "src/topkg_cmd.ml", line 24, characters 19-37:
24 | let compare l l' = Pervasives.compare l l'
                        ^^^^^^^^^^^^^^^^^^
Alert deprecated: module Stdlib.Pervasives
Use Stdlib instead.

If you need to stay compatible with OCaml < 4.07, you can use the 
stdlib-shims library: https://github.com/ocaml/stdlib-shims
File "src/topkg_os.ml", line 7, characters 5-17:
7 | open Topkg_result
         ^^^^^^^^^^^^
Error: Unbound module Topkg_result
File "src/topkg_vcs.ml", line 7, characters 5-17:
7 | open Topkg_result
         ^^^^^^^^^^^^
Error: Unbound module Topkg_result
File "src/topkg_codec.ml", line 7, characters 5-17:
7 | open Topkg_result
         ^^^^^^^^^^^^
Error: Unbound module Topkg_result
File "src/topkg_conf.ml", line 7, characters 5-17:
7 | open Topkg_result
         ^^^^^^^^^^^^
Error: Unbound module Topkg_result
File "src/topkg_fexts.ml", line 22, characters 16-40:
22 |   let ext_obj = Topkg_conf.OCaml.ext_obj c in
                     ^^^^^^^^^^^^^^^^^^^^^^^^
Error: Unbound module Topkg_conf
Hint: Did you mean Topkg_cmd?
File "src/topkg_opam.ml", line 7, characters 5-17:
7 | open Topkg_result
         ^^^^^^^^^^^^
Error: Unbound module Topkg_result
File "src/topkg_test.ml", line 23, characters 2-13:
23 |   Topkg_codec.(view ~kind:"test" fields (t4 fpath cmd bool (option fpath)))
       ^^^^^^^^^^^
Error: Unbound module Topkg_codec
Hint: Did you mean Topkg_cmd?
File "src/topkg_install.ml", line 7, characters 5-17:
7 | open Topkg_result
         ^^^^^^^^^^^^
Error: Unbound module Topkg_result
File "src/topkg_build.ml", line 7, characters 5-17:
7 | open Topkg_result
         ^^^^^^^^^^^^
Error: Unbound module Topkg_result
File "src/topkg_distrib.ml", line 7, characters 5-17:
7 | open Topkg_result
         ^^^^^^^^^^^^
Error: Unbound module Topkg_result
File "src/topkg_publish.ml", line 7, characters 5-17:
7 | open Topkg_result
         ^^^^^^^^^^^^
Error: Unbound module Topkg_result
File "src/topkg_pkg.ml", line 7, characters 5-17:
7 | open Topkg_result
         ^^^^^^^^^^^^
Error: Unbound module Topkg_result
File "src/topkg_ipc.ml", line 7, characters 5-17:
7 | open Topkg_result
         ^^^^^^^^^^^^
Error: Unbound module Topkg_result
File "src/topkg_main.ml", line 7, characters 5-17:
7 | open Topkg_result
         ^^^^^^^^^^^^
Error: Unbound module Topkg_result
File "src/topkg.ml", line 9, characters 8-20:
9 | include Topkg_result
            ^^^^^^^^^^^^
Error: Unbound module Topkg_result
File "./pkg/pkg.ml", line 29, characters 5-10:
29 | open Topkg
          ^^^^^
Error: Unbound module Topkg
Close

Error on thread-bench.1.0 (4.07.1+oclassic+bench)

Command:

/usr/bin/make -C thread

Output

make: Entering directory '/home/louis/.opam/4.07.1+oclassic+bench/.opam-switch/build/thread-bench.1.0/thread'
ocamlfind ocamlopt -package lwt.unix -linkpkg -o thread_sleep_lwt thread_sleep_lwt.ml
ocamlfind: [WARNING] Package `threads': Linking problems may arise because of the missing -thread or -vmthread switch
ocamlfind ocamlopt -package lwt.unix -linkpkg -o thread_ring_lwt_mvar thread_ring_lwt_mvar.ml
ocamlfind: [WARNING] Package `threads': Linking problems may arise because of the missing -thread or -vmthread switch
ocamlfind ocamlopt -package lwt.unix -linkpkg -o thread_ring_lwt_stream thread_ring_lwt_stream.ml
ocamlfind: [WARNING] Package `threads': Linking problems may arise because of the missing -thread or -vmthread switch
ocamlfind ocamlopt -thread -package async -linkpkg -o thread_sleep_async thread_sleep_async.ml
File "thread_sleep_async.ml", line 1, characters 5-13:
Warning 3: deprecated: module Core.Std
[since 2017-02] Use Core. The Std sub-module is no longer needed
File "thread_sleep_async.ml", line 2, characters 5-14:
Error: Unbound module Async.Std
Makefile:10: recipe for target 'thread_sleep_async' failed
make: *** [thread_sleep_async] Error 2
make: Leaving directory '/home/louis/.opam/4.07.1+oclassic+bench/.opam-switch/build/thread-bench.1.0/thread'
make: Entering directory '/home/louis/.opam/4.07.1+oclassic+bench/.opam-switch/build/thread-bench.1.0/thread'
ocamlfind ocamlopt -package lwt.unix -linkpkg -o thread_sleep_lwt thread_sleep_lwt.ml
ocamlfind: [WARNING] Package `threads': Linking problems may arise because of the missing -thread or -vmthread switch
ocamlfind ocamlopt -package lwt.unix -linkpkg -o thread_ring_lwt_mvar thread_ring_lwt_mvar.ml
ocamlfind: [WARNING] Package `threads': Linking problems may arise because of the missing -thread or -vmthread switch
ocamlfind ocamlopt -package lwt.unix -linkpkg -o thread_ring_lwt_stream thread_ring_lwt_stream.ml
ocamlfind: [WARNING] Package `threads': Linking problems may arise because of the missing -thread or -vmthread switch
ocamlfind ocamlopt -thread -package async -linkpkg -o thread_sleep_async thread_sleep_async.ml
File "thread_sleep_async.ml", line 1, characters 5-13:
Warning 3: deprecated: module Core.Std
[since 2017-02] Use Core. The Std sub-module is no longer needed
File "thread_sleep_async.ml", line 2, characters 5-14:
Error: Unbound module Async.Std
Makefile:10: recipe for target 'thread_sleep_async' failed
make: *** [thread_sleep_async] Error 2
make: Leaving directory '/home/louis/.opam/4.07.1+oclassic+bench/.opam-switch/build/thread-bench.1.0/thread'
Close

Error on thread-bench.1.0 (4.07.1+flambda+bench)

Command:

/usr/bin/make -C thread

Output

make: Entering directory '/home/louis/.opam/4.07.1+clambda+bench/.opam-switch/build/thread-bench.1.0/thread'
ocamlfind ocamlopt -package lwt.unix -linkpkg -o thread_sleep_lwt thread_sleep_lwt.ml
ocamlfind: [WARNING] Package `threads': Linking problems may arise because of the missing -thread or -vmthread switch
ocamlfind ocamlopt -package lwt.unix -linkpkg -o thread_ring_lwt_mvar thread_ring_lwt_mvar.ml
ocamlfind: [WARNING] Package `threads': Linking problems may arise because of the missing -thread or -vmthread switch
ocamlfind ocamlopt -package lwt.unix -linkpkg -o thread_ring_lwt_stream thread_ring_lwt_stream.ml
ocamlfind: [WARNING] Package `threads': Linking problems may arise because of the missing -thread or -vmthread switch
ocamlfind ocamlopt -thread -package async -linkpkg -o thread_sleep_async thread_sleep_async.ml
File "thread_sleep_async.ml", line 1, characters 5-13:
Warning 3: deprecated: module Core.Std
[since 2017-02] Use Core. The Std sub-module is no longer needed
File "thread_sleep_async.ml", line 2, characters 5-14:
Error: Unbound module Async.Std
Makefile:10: recipe for target 'thread_sleep_async' failed
make: *** [thread_sleep_async] Error 2
make: Leaving directory '/home/louis/.opam/4.07.1+clambda+bench/.opam-switch/build/thread-bench.1.0/thread'
make: Entering directory '/home/louis/.opam/4.07.1+flambda+bench/.opam-switch/build/thread-bench.1.0/thread'
ocamlfind ocamlopt -package lwt.unix -linkpkg -o thread_sleep_lwt thread_sleep_lwt.ml
ocamlfind: [WARNING] Package `threads': Linking problems may arise because of the missing -thread or -vmthread switch
ocamlfind ocamlopt -package lwt.unix -linkpkg -o thread_ring_lwt_mvar thread_ring_lwt_mvar.ml
ocamlfind: [WARNING] Package `threads': Linking problems may arise because of the missing -thread or -vmthread switch
ocamlfind ocamlopt -package lwt.unix -linkpkg -o thread_ring_lwt_stream thread_ring_lwt_stream.ml
ocamlfind: [WARNING] Package `threads': Linking problems may arise because of the missing -thread or -vmthread switch
ocamlfind ocamlopt -thread -package async -linkpkg -o thread_sleep_async thread_sleep_async.ml
File "thread_sleep_async.ml", line 1, characters 5-13:
Warning 3: deprecated: module Core.Std
[since 2017-02] Use Core. The Std sub-module is no longer needed
File "thread_sleep_async.ml", line 2, characters 5-14:
Error: Unbound module Async.Std
Makefile:10: recipe for target 'thread_sleep_async' failed
make: *** [thread_sleep_async] Error 2
make: Leaving directory '/home/louis/.opam/4.07.1+flambda+bench/.opam-switch/build/thread-bench.1.0/thread'
Close

Error on thread-bench.1.0 (4.07.1+clambda+bench)

Command:

/usr/bin/make -C thread

Output

make: Entering directory '/home/louis/.opam/4.07.1+clambda+bench/.opam-switch/build/thread-bench.1.0/thread'
ocamlfind ocamlopt -package lwt.unix -linkpkg -o thread_sleep_lwt thread_sleep_lwt.ml
ocamlfind: [WARNING] Package `threads': Linking problems may arise because of the missing -thread or -vmthread switch
ocamlfind ocamlopt -package lwt.unix -linkpkg -o thread_ring_lwt_mvar thread_ring_lwt_mvar.ml
ocamlfind: [WARNING] Package `threads': Linking problems may arise because of the missing -thread or -vmthread switch
ocamlfind ocamlopt -package lwt.unix -linkpkg -o thread_ring_lwt_stream thread_ring_lwt_stream.ml
ocamlfind: [WARNING] Package `threads': Linking problems may arise because of the missing -thread or -vmthread switch
ocamlfind ocamlopt -thread -package async -linkpkg -o thread_sleep_async thread_sleep_async.ml
File "thread_sleep_async.ml", line 1, characters 5-13:
Warning 3: deprecated: module Core.Std
[since 2017-02] Use Core. The Std sub-module is no longer needed
File "thread_sleep_async.ml", line 2, characters 5-14:
Error: Unbound module Async.Std
Makefile:10: recipe for target 'thread_sleep_async' failed
make: *** [thread_sleep_async] Error 2
make: Leaving directory '/home/louis/.opam/4.07.1+clambda+bench/.opam-switch/build/thread-bench.1.0/thread'
Close

Error on ocamlfind.1.8.0 (4.08.0+trunk+bench)

Command:

~/.opam/4.08.0+trunk+bench/.opam-switch/build/ocamlfind.1.8.0/./configure -bindir /home/louis/.opam/4.08.0+trunk+bench/bin -sitelib /home/louis/.opam/4.08.0+trunk+bench/lib -mandir /home/louis/.opam/4.08.0+trunk+bench/man -config /home/louis/.opam/4.08.0+trunk+bench/lib/findlib.conf -no-custom

Output

Welcome to findlib version 1.8.0
Configuring core...
Checking for #remove_directory...
Testing threading model...
The -vmthread switch is not supported: Your ocaml version is too old!
Close

Error on ocaml-variants.4.08.0+trunk+flambda+opt (4.08.0+trunk+flambda+opt+bench)

Command:

~/.opam/4.08.0+trunk+flambda+opt+bench/.opam-switch/build/ocaml-variants.4.08.0+trunk+flambda+opt/./configure -prefix /home/louis/.opam/4.08.0+trunk+flambda+opt+bench -flambda -with-debug-runtime

Output

configure: error: unrecognized option: `-flambda'
Try `/home/louis/.opam/4.08.0+trunk+flambda+opt+bench/.opam-switch/build/ocaml-variants.4.08.0+trunk+flambda+opt/./configure --help' for more information
Close

Error on ocaml-variants.4.08.0+trunk+flambda+oclassic (4.08.0+trunk+flambda+oclassic+bench)

Command:

~/.opam/4.08.0+trunk+flambda+oclassic+bench/.opam-switch/build/ocaml-variants.4.08.0+trunk+flambda+oclassic/./configure -prefix /home/louis/.opam/4.08.0+trunk+flambda+oclassic+bench -flambda -with-debug-runtime

Output

configure: error: unrecognized option: `-flambda'
Try `/home/louis/.opam/4.08.0+trunk+flambda+oclassic+bench/.opam-switch/build/ocaml-variants.4.08.0+trunk+flambda+oclassic/./configure --help' for more information
Close

Error on ocaml-variants.4.08.0+trunk+flambda (4.08.0+trunk+flambda+bench)

Command:

~/.opam/4.08.0+trunk+flambda+bench/.opam-switch/build/ocaml-variants.4.08.0+trunk+flambda/./configure -prefix /home/louis/.opam/4.08.0+trunk+flambda+bench -flambda -with-debug-runtime

Output

configure: error: unrecognized option: `-flambda'
Try `/home/louis/.opam/4.08.0+trunk+flambda+bench/.opam-switch/build/ocaml-variants.4.08.0+trunk+flambda/./configure --help' for more information
Close

Error on ocaml.4.06.1 (4.06.1+flambda+opt+bench)

Command:

~/.opam/4.06.1+flambda+opt+bench/bin/ocaml /home/louis/.opam/4.06.1+flambda+opt+bench/share/ocaml-config/gen_ocaml_config.ml 4.06.1 ocaml

Output

OCaml version mismatch: 4.06.2, expected 4.06.1
Close

Error on ocaml.4.06.1 (4.06.1+flambda+bench)

Command:

~/.opam/4.06.1+flambda+bench/bin/ocaml /home/louis/.opam/4.06.1+flambda+bench/share/ocaml-config/gen_ocaml_config.ml 4.06.1 ocaml

Output

OCaml version mismatch: 4.06.2, expected 4.06.1
Close

Error on ocaml.4.05.0 (4.05.0+flambda+opt+bench)

Command:

~/.opam/4.05.0+flambda+opt+bench/bin/ocaml /home/louis/.opam/4.05.0+flambda+opt+bench/share/ocaml-config/gen_ocaml_config.ml 4.05.0 ocaml

Output

OCaml version mismatch: 4.05.1, expected 4.05.0
Close

Error on numerical-analysis-bench.1.0 (4.08.0+trunk+bench)

Command:

/usr/bin/make

Output

ulimit -s 98304; ocamlopt.opt  -I simple_access `ocamldep.opt -sort simple_access/*.ml` main_nogcstats.ml -o simple_access.opt
ulimit -s 98304; ocamlopt.opt  -I lu-decomposition `ocamldep.opt -sort lu-decomposition/*.ml` main_nogcstats.ml -o lu-decomposition.opt
ulimit -s 98304; ocamlopt.opt  -I fft `ocamldep.opt -sort fft/*.ml` main_nogcstats.ml -o fft.opt
ulimit -s 98304; ocamlopt.opt  -I rnd_access `ocamldep.opt -sort rnd_access/*.ml` main_nogcstats.ml -o rnd_access.opt
ulimit -s 98304; ocamlopt.opt  -I k-means `ocamldep.opt -sort k-means/*.ml` main_nogcstats.ml -o k-means.opt
Fatal error: exception Stack overflow
Makefile:20: recipe for target 'k-means.opt' failed
make: *** [k-means.opt] Error 2
Close

Error on numerical-analysis-bench.1.0 (4.08.0+gpr2165+bench)

Command:

/usr/bin/make

Output

ulimit -s 98304; ocamlopt.opt  -I simple_access `ocamldep.opt -sort simple_access/*.ml` main_nogcstats.ml -o simple_access.opt
ulimit -s 98304; ocamlopt.opt  -I lu-decomposition `ocamldep.opt -sort lu-decomposition/*.ml` main_nogcstats.ml -o lu-decomposition.opt
ulimit -s 98304; ocamlopt.opt  -I fft `ocamldep.opt -sort fft/*.ml` main_nogcstats.ml -o fft.opt
ulimit -s 98304; ocamlopt.opt  -I rnd_access `ocamldep.opt -sort rnd_access/*.ml` main_nogcstats.ml -o rnd_access.opt
ulimit -s 98304; ocamlopt.opt  -I k-means `ocamldep.opt -sort k-means/*.ml` main_nogcstats.ml -o k-means.opt
Fatal error: exception Stack overflow
Makefile:20: recipe for target 'k-means.opt' failed
make: *** [k-means.opt] Error 2
Close

Error on lablgtk.2.18.7 (4.08.0+gpr2165+bench)

Command:

/usr/bin/make world

Output

/usr/bin/make -C src world
make[1]: Entering directory '/home/louis/.opam/4.08.0+gpr2165+bench/.opam-switch/build/lablgtk.2.18.7/src'
ocamlc.opt   -w s-3+52 -warn-error A-52 -c  varcc.ml
ocamlc.opt   -o varcc varcc.cmo
rm -f *_tags.h *_tags.c
./varcc gdkpixbuf_tags.var
./varcc gdk_tags.var
ocamlc.opt -c -ccopt '-DG_DISABLE_ASSERT -DG_DISABLE_CAST_CHECKS -fno-unwind-tables -pthread -I/usr/include/libglade-2.0 -I/usr/include/librsvg-2.0 -I/usr/include/libgnomecanvas-2.0 -I/usr/include/gail-1.0 -I/usr/include/libart-2.0 -I/usr/include/libxml2 -I/usr/include/gtk-2.0 -I/usr/lib/x86_64-linux-gnu/gtk-2.0/include -I/usr/include/gio-unix-2.0/ -I/usr/include/cairo -I/usr/include/pango-1.0 -I/usr/include/atk-1.0 -I/usr/include/cairo -I/usr/include/pixman-1 -I/usr/include/libpng12 -I/usr/include/gdk-pixbuf-2.0 -I/usr/include/libpng12 -I/usr/include/pango-1.0 -I/usr/include/harfbuzz -I/usr/include/pango-1.0 -I/usr/include/glib-2.0 -I/usr/lib/x86_64-linux-gnu/glib-2.0/include -I/usr/include/freetype2 -I/usr/include/gtkspell-2.0 -I/usr/include/gtksourceview-2.0  -imacros ml_domain.h -O' -verbose ml_gdkpixbuf.c
+ gcc -std=gnu99 -O2 -fno-strict-aliasing -fwrapv -fno-builtin-memcmp -fPIC -D_FILE_OFFSET_BITS=64 -D_REENTRANT   -c  -DG_DISABLE_ASSERT -DG_DISABLE_CAST_CHECKS -fno-unwind-tables -pthread -I/usr/include/libglade-2.0 -I/usr/include/librsvg-2.0 -I/usr/include/libgnomecanvas-2.0 -I/usr/include/gail-1.0 -I/usr/include/libart-2.0 -I/usr/include/libxml2 -I/usr/include/gtk-2.0 -I/usr/lib/x86_64-linux-gnu/gtk-2.0/include -I/usr/include/gio-unix-2.0/ -I/usr/include/cairo -I/usr/include/pango-1.0 -I/usr/include/atk-1.0 -I/usr/include/cairo -I/usr/include/pixman-1 -I/usr/include/libpng12 -I/usr/include/gdk-pixbuf-2.0 -I/usr/include/libpng12 -I/usr/include/pango-1.0 -I/usr/include/harfbuzz -I/usr/include/pango-1.0 -I/usr/include/glib-2.0 -I/usr/lib/x86_64-linux-gnu/glib-2.0/include -I/usr/include/freetype2 -I/usr/include/gtkspell-2.0 -I/usr/include/gtksourceview-2.0  -imacros ml_domain.h -O  -I'/home/louis/.opam/4.08.0+gpr2165+bench/lib/ocaml' 'ml_gdkpixbuf.c'
./varcc pango_tags.var
ocamlc.opt -c -ccopt '-DG_DISABLE_ASSERT -DG_DISABLE_CAST_CHECKS -fno-unwind-tables -pthread -I/usr/include/libglade-2.0 -I/usr/include/librsvg-2.0 -I/usr/include/libgnomecanvas-2.0 -I/usr/include/gail-1.0 -I/usr/include/libart-2.0 -I/usr/include/libxml2 -I/usr/include/gtk-2.0 -I/usr/lib/x86_64-linux-gnu/gtk-2.0/include -I/usr/include/gio-unix-2.0/ -I/usr/include/cairo -I/usr/include/pango-1.0 -I/usr/include/atk-1.0 -I/usr/include/cairo -I/usr/include/pixman-1 -I/usr/include/libpng12 -I/usr/include/gdk-pixbuf-2.0 -I/usr/include/libpng12 -I/usr/include/pango-1.0 -I/usr/include/harfbuzz -I/usr/include/pango-1.0 -I/usr/include/glib-2.0 -I/usr/lib/x86_64-linux-gnu/glib-2.0/include -I/usr/include/freetype2 -I/usr/include/gtkspell-2.0 -I/usr/include/gtksourceview-2.0  -imacros ml_domain.h -O' -verbose ml_gdk.c
+ gcc -std=gnu99 -O2 -fno-strict-aliasing -fwrapv -fno-builtin-memcmp -fPIC -D_FILE_OFFSET_BITS=64 -D_REENTRANT   -c  -DG_DISABLE_ASSERT -DG_DISABLE_CAST_CHECKS -fno-unwind-tables -pthread -I/usr/include/libglade-2.0 -I/usr/include/librsvg-2.0 -I/usr/include/libgnomecanvas-2.0 -I/usr/include/gail-1.0 -I/usr/include/libart-2.0 -I/usr/include/libxml2 -I/usr/include/gtk-2.0 -I/usr/lib/x86_64-linux-gnu/gtk-2.0/include -I/usr/include/gio-unix-2.0/ -I/usr/include/cairo -I/usr/include/pango-1.0 -I/usr/include/atk-1.0 -I/usr/include/cairo -I/usr/include/pixman-1 -I/usr/include/libpng12 -I/usr/include/gdk-pixbuf-2.0 -I/usr/include/libpng12 -I/usr/include/pango-1.0 -I/usr/include/harfbuzz -I/usr/include/pango-1.0 -I/usr/include/glib-2.0 -I/usr/lib/x86_64-linux-gnu/glib-2.0/include -I/usr/include/freetype2 -I/usr/include/gtkspell-2.0 -I/usr/include/gtksourceview-2.0  -imacros ml_domain.h -O  -I'/home/louis/.opam/4.08.0+gpr2165+bench/lib/ocaml' 'ml_gdk.c'
./varcc glib_tags.var
ocamlc.opt -c -ccopt '-DG_DISABLE_ASSERT -DG_DISABLE_CAST_CHECKS -fno-unwind-tables -pthread -I/usr/include/libglade-2.0 -I/usr/include/librsvg-2.0 -I/usr/include/libgnomecanvas-2.0 -I/usr/include/gail-1.0 -I/usr/include/libart-2.0 -I/usr/include/libxml2 -I/usr/include/gtk-2.0 -I/usr/lib/x86_64-linux-gnu/gtk-2.0/include -I/usr/include/gio-unix-2.0/ -I/usr/include/cairo -I/usr/include/pango-1.0 -I/usr/include/atk-1.0 -I/usr/include/cairo -I/usr/include/pixman-1 -I/usr/include/libpng12 -I/usr/include/gdk-pixbuf-2.0 -I/usr/include/libpng12 -I/usr/include/pango-1.0 -I/usr/include/harfbuzz -I/usr/include/pango-1.0 -I/usr/include/glib-2.0 -I/usr/lib/x86_64-linux-gnu/glib-2.0/include -I/usr/include/freetype2 -I/usr/include/gtkspell-2.0 -I/usr/include/gtksourceview-2.0  -imacros ml_domain.h -O' -verbose ml_glib.c
+ gcc -std=gnu99 -O2 -fno-strict-aliasing -fwrapv -fno-builtin-memcmp -fPIC -D_FILE_OFFSET_BITS=64 -D_REENTRANT   -c  -DG_DISABLE_ASSERT -DG_DISABLE_CAST_CHECKS -fno-unwind-tables -pthread -I/usr/include/libglade-2.0 -I/usr/include/librsvg-2.0 -I/usr/include/libgnomecanvas-2.0 -I/usr/include/gail-1.0 -I/usr/include/libart-2.0 -I/usr/include/libxml2 -I/usr/include/gtk-2.0 -I/usr/lib/x86_64-linux-gnu/gtk-2.0/include -I/usr/include/gio-unix-2.0/ -I/usr/include/cairo -I/usr/include/pango-1.0 -I/usr/include/atk-1.0 -I/usr/include/cairo -I/usr/include/pixman-1 -I/usr/include/libpng12 -I/usr/include/gdk-pixbuf-2.0 -I/usr/include/libpng12 -I/usr/include/pango-1.0 -I/usr/include/harfbuzz -I/usr/include/pango-1.0 -I/usr/include/glib-2.0 -I/usr/lib/x86_64-linux-gnu/glib-2.0/include -I/usr/include/freetype2 -I/usr/include/gtkspell-2.0 -I/usr/include/gtksourceview-2.0  -imacros ml_domain.h -O  -I'/home/louis/.opam/4.08.0+gpr2165+bench/lib/ocaml' 'ml_glib.c'
ml_glib.c: In function ‘ml_g_io_channel_read’:
ml_glib.c:370:3: warning: ‘g_io_channel_read’ is deprecated (declared at /usr/include/glib-2.0/glib/giochannel.h:166): Use 'g_io_channel_read_chars' instead [-Wdeprecated-declarations]
   switch (g_io_channel_read(GIOChannel_val(io), 
   ^
./varcc gobject_tags.var
ocamlc.opt -c -ccopt '-DG_DISABLE_ASSERT -DG_DISABLE_CAST_CHECKS -fno-unwind-tables -pthread -I/usr/include/libglade-2.0 -I/usr/include/librsvg-2.0 -I/usr/include/libgnomecanvas-2.0 -I/usr/include/gail-1.0 -I/usr/include/libart-2.0 -I/usr/include/libxml2 -I/usr/include/gtk-2.0 -I/usr/lib/x86_64-linux-gnu/gtk-2.0/include -I/usr/include/gio-unix-2.0/ -I/usr/include/cairo -I/usr/include/pango-1.0 -I/usr/include/atk-1.0 -I/usr/include/cairo -I/usr/include/pixman-1 -I/usr/include/libpng12 -I/usr/include/gdk-pixbuf-2.0 -I/usr/include/libpng12 -I/usr/include/pango-1.0 -I/usr/include/harfbuzz -I/usr/include/pango-1.0 -I/usr/include/glib-2.0 -I/usr/lib/x86_64-linux-gnu/glib-2.0/include -I/usr/include/freetype2 -I/usr/include/gtkspell-2.0 -I/usr/include/gtksourceview-2.0  -imacros ml_domain.h -O' -verbose ml_gobject.c
+ gcc -std=gnu99 -O2 -fno-strict-aliasing -fwrapv -fno-builtin-memcmp -fPIC -D_FILE_OFFSET_BITS=64 -D_REENTRANT   -c  -DG_DISABLE_ASSERT -DG_DISABLE_CAST_CHECKS -fno-unwind-tables -pthread -I/usr/include/libglade-2.0 -I/usr/include/librsvg-2.0 -I/usr/include/libgnomecanvas-2.0 -I/usr/include/gail-1.0 -I/usr/include/libart-2.0 -I/usr/include/libxml2 -I/usr/include/gtk-2.0 -I/usr/lib/x86_64-linux-gnu/gtk-2.0/include -I/usr/include/gio-unix-2.0/ -I/usr/include/cairo -I/usr/include/pango-1.0 -I/usr/include/atk-1.0 -I/usr/include/cairo -I/usr/include/pixman-1 -I/usr/include/libpng12 -I/usr/include/gdk-pixbuf-2.0 -I/usr/include/libpng12 -I/usr/include/pango-1.0 -I/usr/include/harfbuzz -I/usr/include/pango-1.0 -I/usr/include/glib-2.0 -I/usr/lib/x86_64-linux-gnu/glib-2.0/include -I/usr/include/freetype2 -I/usr/include/gtkspell-2.0 -I/usr/include/gtksourceview-2.0  -imacros ml_domain.h -O  -I'/home/louis/.opam/4.08.0+gpr2165+bench/lib/ocaml' 'ml_gobject.c'
ml_gobject.c: In function ‘ml_g_type_init’:
ml_gobject.c:103:1: warning: ‘g_type_init’ is deprecated (declared at /usr/include/glib-2.0/gobject/gtype.h:679) [-Wdeprecated-declarations]
 ML_0 (g_type_init, Unit)
 ^
ocamlc.opt -c -ccopt '-DG_DISABLE_ASSERT -DG_DISABLE_CAST_CHECKS -fno-unwind-tables -pthread -I/usr/include/libglade-2.0 -I/usr/include/librsvg-2.0 -I/usr/include/libgnomecanvas-2.0 -I/usr/include/gail-1.0 -I/usr/include/libart-2.0 -I/usr/include/libxml2 -I/usr/include/gtk-2.0 -I/usr/lib/x86_64-linux-gnu/gtk-2.0/include -I/usr/include/gio-unix-2.0/ -I/usr/include/cairo -I/usr/include/pango-1.0 -I/usr/include/atk-1.0 -I/usr/include/cairo -I/usr/include/pixman-1 -I/usr/include/libpng12 -I/usr/include/gdk-pixbuf-2.0 -I/usr/include/libpng12 -I/usr/include/pango-1.0 -I/usr/include/harfbuzz -I/usr/include/pango-1.0 -I/usr/include/glib-2.0 -I/usr/lib/x86_64-linux-gnu/glib-2.0/include -I/usr/include/freetype2 -I/usr/include/gtkspell-2.0 -I/usr/include/gtksourceview-2.0  -imacros ml_domain.h -O' -verbose ml_gpointer.c
+ gcc -std=gnu99 -O2 -fno-strict-aliasing -fwrapv -fno-builtin-memcmp -fPIC -D_FILE_OFFSET_BITS=64 -D_REENTRANT   -c  -DG_DISABLE_ASSERT -DG_DISABLE_CAST_CHECKS -fno-unwind-tables -pthread -I/usr/include/libglade-2.0 -I/usr/include/librsvg-2.0 -I/usr/include/libgnomecanvas-2.0 -I/usr/include/gail-1.0 -I/usr/include/libart-2.0 -I/usr/include/libxml2 -I/usr/include/gtk-2.0 -I/usr/lib/x86_64-linux-gnu/gtk-2.0/include -I/usr/include/gio-unix-2.0/ -I/usr/include/cairo -I/usr/include/pango-1.0 -I/usr/include/atk-1.0 -I/usr/include/cairo -I/usr/include/pixman-1 -I/usr/include/libpng12 -I/usr/include/gdk-pixbuf-2.0 -I/usr/include/libpng12 -I/usr/include/pango-1.0 -I/usr/include/harfbuzz -I/usr/include/pango-1.0 -I/usr/include/glib-2.0 -I/usr/lib/x86_64-linux-gnu/glib-2.0/include -I/usr/include/freetype2 -I/usr/include/gtkspell-2.0 -I/usr/include/gtksourceview-2.0  -imacros ml_domain.h -O  -I'/home/louis/.opam/4.08.0+gpr2165+bench/lib/ocaml' 'ml_gpointer.c'
ocamlc.opt -c -ccopt '-DG_DISABLE_ASSERT -DG_DISABLE_CAST_CHECKS -fno-unwind-tables -pthread -I/usr/include/libglade-2.0 -I/usr/include/librsvg-2.0 -I/usr/include/libgnomecanvas-2.0 -I/usr/include/gail-1.0 -I/usr/include/libart-2.0 -I/usr/include/libxml2 -I/usr/include/gtk-2.0 -I/usr/lib/x86_64-linux-gnu/gtk-2.0/include -I/usr/include/gio-unix-2.0/ -I/usr/include/cairo -I/usr/include/pango-1.0 -I/usr/include/atk-1.0 -I/usr/include/cairo -I/usr/include/pixman-1 -I/usr/include/libpng12 -I/usr/include/gdk-pixbuf-2.0 -I/usr/include/libpng12 -I/usr/include/pango-1.0 -I/usr/include/harfbuzz -I/usr/include/pango-1.0 -I/usr/include/glib-2.0 -I/usr/lib/x86_64-linux-gnu/glib-2.0/include -I/usr/include/freetype2 -I/usr/include/gtkspell-2.0 -I/usr/include/gtksourceview-2.0  -imacros ml_domain.h -O' -verbose ml_gvaluecaml.c
+ gcc -std=gnu99 -O2 -fno-strict-aliasing -fwrapv -fno-builtin-memcmp -fPIC -D_FILE_OFFSET_BITS=64 -D_REENTRANT   -c  -DG_DISABLE_ASSERT -DG_DISABLE_CAST_CHECKS -fno-unwind-tables -pthread -I/usr/include/libglade-2.0 -I/usr/include/librsvg-2.0 -I/usr/include/libgnomecanvas-2.0 -I/usr/include/gail-1.0 -I/usr/include/libart-2.0 -I/usr/include/libxml2 -I/usr/include/gtk-2.0 -I/usr/lib/x86_64-linux-gnu/gtk-2.0/include -I/usr/include/gio-unix-2.0/ -I/usr/include/cairo -I/usr/include/pango-1.0 -I/usr/include/atk-1.0 -I/usr/include/cairo -I/usr/include/pixman-1 -I/usr/include/libpng12 -I/usr/include/gdk-pixbuf-2.0 -I/usr/include/libpng12 -I/usr/include/pango-1.0 -I/usr/include/harfbuzz -I/usr/include/pango-1.0 -I/usr/include/glib-2.0 -I/usr/lib/x86_64-linux-gnu/glib-2.0/include -I/usr/include/freetype2 -I/usr/include/gtkspell-2.0 -I/usr/include/gtksourceview-2.0  -imacros ml_domain.h -O  -I'/home/louis/.opam/4.08.0+gpr2165+bench/lib/ocaml' 'ml_gvaluecaml.c'
ocamlc.opt -c -ccopt '-DG_DISABLE_ASSERT -DG_DISABLE_CAST_CHECKS -fno-unwind-tables -pthread -I/usr/include/libglade-2.0 -I/usr/include/librsvg-2.0 -I/usr/include/libgnomecanvas-2.0 -I/usr/include/gail-1.0 -I/usr/include/libart-2.0 -I/usr/include/libxml2 -I/usr/include/gtk-2.0 -I/usr/lib/x86_64-linux-gnu/gtk-2.0/include -I/usr/include/gio-unix-2.0/ -I/usr/include/cairo -I/usr/include/pango-1.0 -I/usr/include/atk-1.0 -I/usr/include/cairo -I/usr/include/pixman-1 -I/usr/include/libpng12 -I/usr/include/gdk-pixbuf-2.0 -I/usr/include/libpng12 -I/usr/include/pango-1.0 -I/usr/include/harfbuzz -I/usr/include/pango-1.0 -I/usr/include/glib-2.0 -I/usr/lib/x86_64-linux-gnu/glib-2.0/include -I/usr/include/freetype2 -I/usr/include/gtkspell-2.0 -I/usr/include/gtksourceview-2.0  -imacros ml_domain.h -O' -verbose wrappers.c
+ gcc -std=gnu99 -O2 -fno-strict-aliasing -fwrapv -fno-builtin-memcmp -fPIC -D_FILE_OFFSET_BITS=64 -D_REENTRANT   -c  -DG_DISABLE_ASSERT -DG_DISABLE_CAST_CHECKS -fno-unwind-tables -pthread -I/usr/include/libglade-2.0 -I/usr/include/librsvg-2.0 -I/usr/include/libgnomecanvas-2.0 -I/usr/include/gail-1.0 -I/usr/include/libart-2.0 -I/usr/include/libxml2 -I/usr/include/gtk-2.0 -I/usr/lib/x86_64-linux-gnu/gtk-2.0/include -I/usr/include/gio-unix-2.0/ -I/usr/include/cairo -I/usr/include/pango-1.0 -I/usr/include/atk-1.0 -I/usr/include/cairo -I/usr/include/pixman-1 -I/usr/include/libpng12 -I/usr/include/gdk-pixbuf-2.0 -I/usr/include/libpng12 -I/usr/include/pango-1.0 -I/usr/include/harfbuzz -I/usr/include/pango-1.0 -I/usr/include/glib-2.0 -I/usr/lib/x86_64-linux-gnu/glib-2.0/include -I/usr/include/freetype2 -I/usr/include/gtkspell-2.0 -I/usr/include/gtksourceview-2.0  -imacros ml_domain.h -O  -I'/home/louis/.opam/4.08.0+gpr2165+bench/lib/ocaml' 'wrappers.c'
./varcc gtk_tags.var
ocamlc.opt -c -ccopt '-DG_DISABLE_ASSERT -DG_DISABLE_CAST_CHECKS -fno-unwind-tables -pthread -I/usr/include/libglade-2.0 -I/usr/include/librsvg-2.0 -I/usr/include/libgnomecanvas-2.0 -I/usr/include/gail-1.0 -I/usr/include/libart-2.0 -I/usr/include/libxml2 -I/usr/include/gtk-2.0 -I/usr/lib/x86_64-linux-gnu/gtk-2.0/include -I/usr/include/gio-unix-2.0/ -I/usr/include/cairo -I/usr/include/pango-1.0 -I/usr/include/atk-1.0 -I/usr/include/cairo -I/usr/include/pixman-1 -I/usr/include/libpng12 -I/usr/include/gdk-pixbuf-2.0 -I/usr/include/libpng12 -I/usr/include/pango-1.0 -I/usr/include/harfbuzz -I/usr/include/pango-1.0 -I/usr/include/glib-2.0 -I/usr/lib/x86_64-linux-gnu/glib-2.0/include -I/usr/include/freetype2 -I/usr/include/gtkspell-2.0 -I/usr/include/gtksourceview-2.0  -imacros ml_domain.h -O' -verbose ml_gtk.c
+ gcc -std=gnu99 -O2 -fno-strict-aliasing -fwrapv -fno-builtin-memcmp -fPIC -D_FILE_OFFSET_BITS=64 -D_REENTRANT   -c  -DG_DISABLE_ASSERT -DG_DISABLE_CAST_CHECKS -fno-unwind-tables -pthread -I/usr/include/libglade-2.0 -I/usr/include/librsvg-2.0 -I/usr/include/libgnomecanvas-2.0 -I/usr/include/gail-1.0 -I/usr/include/libart-2.0 -I/usr/include/libxml2 -I/usr/include/gtk-2.0 -I/usr/lib/x86_64-linux-gnu/gtk-2.0/include -I/usr/include/gio-unix-2.0/ -I/usr/include/cairo -I/usr/include/pango-1.0 -I/usr/include/atk-1.0 -I/usr/include/cairo -I/usr/include/pixman-1 -I/usr/include/libpng12 -I/usr/include/gdk-pixbuf-2.0 -I/usr/include/libpng12 -I/usr/include/pango-1.0 -I/usr/include/harfbuzz -I/usr/include/pango-1.0 -I/usr/include/glib-2.0 -I/usr/lib/x86_64-linux-gnu/glib-2.0/include -I/usr/include/freetype2 -I/usr/include/gtkspell-2.0 -I/usr/include/gtksourceview-2.0  -imacros ml_domain.h -O  -I'/home/louis/.opam/4.08.0+gpr2165+bench/lib/ocaml' 'ml_gtk.c'
ocamlc.opt -c -ccopt '-DG_DISABLE_ASSERT -DG_DISABLE_CAST_CHECKS -fno-unwind-tables -pthread -I/usr/include/libglade-2.0 -I/usr/include/librsvg-2.0 -I/usr/include/libgnomecanvas-2.0 -I/usr/include/gail-1.0 -I/usr/include/libart-2.0 -I/usr/include/libxml2 -I/usr/include/gtk-2.0 -I/usr/lib/x86_64-linux-gnu/gtk-2.0/include -I/usr/include/gio-unix-2.0/ -I/usr/include/cairo -I/usr/include/pango-1.0 -I/usr/include/atk-1.0 -I/usr/include/cairo -I/usr/include/pixman-1 -I/usr/include/libpng12 -I/usr/include/gdk-pixbuf-2.0 -I/usr/include/libpng12 -I/usr/include/pango-1.0 -I/usr/include/harfbuzz -I/usr/include/pango-1.0 -I/usr/include/glib-2.0 -I/usr/lib/x86_64-linux-gnu/glib-2.0/include -I/usr/include/freetype2 -I/usr/include/gtkspell-2.0 -I/usr/include/gtksourceview-2.0  -imacros ml_domain.h -O' -verbose ml_pango.c
+ gcc -std=gnu99 -O2 -fno-strict-aliasing -fwrapv -fno-builtin-memcmp -fPIC -D_FILE_OFFSET_BITS=64 -D_REENTRANT   -c  -DG_DISABLE_ASSERT -DG_DISABLE_CAST_CHECKS -fno-unwind-tables -pthread -I/usr/include/libglade-2.0 -I/usr/include/librsvg-2.0 -I/usr/include/libgnomecanvas-2.0 -I/usr/include/gail-1.0 -I/usr/include/libart-2.0 -I/usr/include/libxml2 -I/usr/include/gtk-2.0 -I/usr/lib/x86_64-linux-gnu/gtk-2.0/include -I/usr/include/gio-unix-2.0/ -I/usr/include/cairo -I/usr/include/pango-1.0 -I/usr/include/atk-1.0 -I/usr/include/cairo -I/usr/include/pixman-1 -I/usr/include/libpng12 -I/usr/include/gdk-pixbuf-2.0 -I/usr/include/libpng12 -I/usr/include/pango-1.0 -I/usr/include/harfbuzz -I/usr/include/pango-1.0 -I/usr/include/glib-2.0 -I/usr/lib/x86_64-linux-gnu/glib-2.0/include -I/usr/include/freetype2 -I/usr/include/gtkspell-2.0 -I/usr/include/gtksourceview-2.0  -imacros ml_domain.h -O  -I'/home/louis/.opam/4.08.0+gpr2165+bench/lib/ocaml' 'ml_pango.c'
ocamlc.opt -c -ccopt '-DG_DISABLE_ASSERT -DG_DISABLE_CAST_CHECKS -fno-unwind-tables -pthread -I/usr/include/libglade-2.0 -I/usr/include/librsvg-2.0 -I/usr/include/libgnomecanvas-2.0 -I/usr/include/gail-1.0 -I/usr/include/libart-2.0 -I/usr/include/libxml2 -I/usr/include/gtk-2.0 -I/usr/lib/x86_64-linux-gnu/gtk-2.0/include -I/usr/include/gio-unix-2.0/ -I/usr/include/cairo -I/usr/include/pango-1.0 -I/usr/include/atk-1.0 -I/usr/include/cairo -I/usr/include/pixman-1 -I/usr/include/libpng12 -I/usr/include/gdk-pixbuf-2.0 -I/usr/include/libpng12 -I/usr/include/pango-1.0 -I/usr/include/harfbuzz -I/usr/include/pango-1.0 -I/usr/include/glib-2.0 -I/usr/lib/x86_64-linux-gnu/glib-2.0/include -I/usr/include/freetype2 -I/usr/include/gtkspell-2.0 -I/usr/include/gtksourceview-2.0  -imacros ml_domain.h -O' -verbose ml_gtkaction.c
+ gcc -std=gnu99 -O2 -fno-strict-aliasing -fwrapv -fno-builtin-memcmp -fPIC -D_FILE_OFFSET_BITS=64 -D_REENTRANT   -c  -DG_DISABLE_ASSERT -DG_DISABLE_CAST_CHECKS -fno-unwind-tables -pthread -I/usr/include/libglade-2.0 -I/usr/include/librsvg-2.0 -I/usr/include/libgnomecanvas-2.0 -I/usr/include/gail-1.0 -I/usr/include/libart-2.0 -I/usr/include/libxml2 -I/usr/include/gtk-2.0 -I/usr/lib/x86_64-linux-gnu/gtk-2.0/include -I/usr/include/gio-unix-2.0/ -I/usr/include/cairo -I/usr/include/pango-1.0 -I/usr/include/atk-1.0 -I/usr/include/cairo -I/usr/include/pixman-1 -I/usr/include/libpng12 -I/usr/include/gdk-pixbuf-2.0 -I/usr/include/libpng12 -I/usr/include/pango-1.0 -I/usr/include/harfbuzz -I/usr/include/pango-1.0 -I/usr/include/glib-2.0 -I/usr/lib/x86_64-linux-gnu/glib-2.0/include -I/usr/include/freetype2 -I/usr/include/gtkspell-2.0 -I/usr/include/gtksourceview-2.0  -imacros ml_domain.h -O  -I'/home/louis/.opam/4.08.0+gpr2165+bench/lib/ocaml' 'ml_gtkaction.c'
ocamlc.opt -c -ccopt '-DG_DISABLE_ASSERT -DG_DISABLE_CAST_CHECKS -fno-unwind-tables -pthread -I/usr/include/libglade-2.0 -I/usr/include/librsvg-2.0 -I/usr/include/libgnomecanvas-2.0 -I/usr/include/gail-1.0 -I/usr/include/libart-2.0 -I/usr/include/libxml2 -I/usr/include/gtk-2.0 -I/usr/lib/x86_64-linux-gnu/gtk-2.0/include -I/usr/include/gio-unix-2.0/ -I/usr/include/cairo -I/usr/include/pango-1.0 -I/usr/include/atk-1.0 -I/usr/include/cairo -I/usr/include/pixman-1 -I/usr/include/libpng12 -I/usr/include/gdk-pixbuf-2.0 -I/usr/include/libpng12 -I/usr/include/pango-1.0 -I/usr/include/harfbuzz -I/usr/include/pango-1.0 -I/usr/include/glib-2.0 -I/usr/lib/x86_64-linux-gnu/glib-2.0/include -I/usr/include/freetype2 -I/usr/include/gtkspell-2.0 -I/usr/include/gtksourceview-2.0  -imacros ml_domain.h -O' -verbose ml_gtkbin.c
+ gcc -std=gnu99 -O2 -fno-strict-aliasing -fwrapv -fno-builtin-memcmp -fPIC -D_FILE_OFFSET_BITS=64 -D_REENTRANT   -c  -DG_DISABLE_ASSERT -DG_DISABLE_CAST_CHECKS -fno-unwind-tables -pthread -I/usr/include/libglade-2.0 -I/usr/include/librsvg-2.0 -I/usr/include/libgnomecanvas-2.0 -I/usr/include/gail-1.0 -I/usr/include/libart-2.0 -I/usr/include/libxml2 -I/usr/include/gtk-2.0 -I/usr/lib/x86_64-linux-gnu/gtk-2.0/include -I/usr/include/gio-unix-2.0/ -I/usr/include/cairo -I/usr/include/pango-1.0 -I/usr/include/atk-1.0 -I/usr/include/cairo -I/usr/include/pixman-1 -I/usr/include/libpng12 -I/usr/include/gdk-pixbuf-2.0 -I/usr/include/libpng12 -I/usr/include/pango-1.0 -I/usr/include/harfbuzz -I/usr/include/pango-1.0 -I/usr/include/glib-2.0 -I/usr/lib/x86_64-linux-gnu/glib-2.0/include -I/usr/include/freetype2 -I/usr/include/gtkspell-2.0 -I/usr/include/gtksourceview-2.0  -imacros ml_domain.h -O  -I'/home/louis/.opam/4.08.0+gpr2165+bench/lib/ocaml' 'ml_gtkbin.c'
ocamlc.opt -c -ccopt '-DG_DISABLE_ASSERT -DG_DISABLE_CAST_CHECKS -fno-unwind-tables -pthread -I/usr/include/libglade-2.0 -I/usr/include/librsvg-2.0 -I/usr/include/libgnomecanvas-2.0 -I/usr/include/gail-1.0 -I/usr/include/libart-2.0 -I/usr/include/libxml2 -I/usr/include/gtk-2.0 -I/usr/lib/x86_64-linux-gnu/gtk-2.0/include -I/usr/include/gio-unix-2.0/ -I/usr/include/cairo -I/usr/include/pango-1.0 -I/usr/include/atk-1.0 -I/usr/include/cairo -I/usr/include/pixman-1 -I/usr/include/libpng12 -I/usr/include/gdk-pixbuf-2.0 -I/usr/include/libpng12 -I/usr/include/pango-1.0 -I/usr/include/harfbuzz -I/usr/include/pango-1.0 -I/usr/include/glib-2.0 -I/usr/lib/x86_64-linux-gnu/glib-2.0/include -I/usr/include/freetype2 -I/usr/include/gtkspell-2.0 -I/usr/include/gtksourceview-2.0  -imacros ml_domain.h -O' -verbose ml_gtkbroken.c
+ gcc -std=gnu99 -O2 -fno-strict-aliasing -fwrapv -fno-builtin-memcmp -fPIC -D_FILE_OFFSET_BITS=64 -D_REENTRANT   -c  -DG_DISABLE_ASSERT -DG_DISABLE_CAST_CHECKS -fno-unwind-tables -pthread -I/usr/include/libglade-2.0 -I/usr/include/librsvg-2.0 -I/usr/include/libgnomecanvas-2.0 -I/usr/include/gail-1.0 -I/usr/include/libart-2.0 -I/usr/include/libxml2 -I/usr/include/gtk-2.0 -I/usr/lib/x86_64-linux-gnu/gtk-2.0/include -I/usr/include/gio-unix-2.0/ -I/usr/include/cairo -I/usr/include/pango-1.0 -I/usr/include/atk-1.0 -I/usr/include/cairo -I/usr/include/pixman-1 -I/usr/include/libpng12 -I/usr/include/gdk-pixbuf-2.0 -I/usr/include/libpng12 -I/usr/include/pango-1.0 -I/usr/include/harfbuzz -I/usr/include/pango-1.0 -I/usr/include/glib-2.0 -I/usr/lib/x86_64-linux-gnu/glib-2.0/include -I/usr/include/freetype2 -I/usr/include/gtkspell-2.0 -I/usr/include/gtksourceview-2.0  -imacros ml_domain.h -O  -I'/home/louis/.opam/4.08.0+gpr2165+bench/lib/ocaml' 'ml_gtkbroken.c'
ocamlc.opt -c -ccopt '-DG_DISABLE_ASSERT -DG_DISABLE_CAST_CHECKS -fno-unwind-tables -pthread -I/usr/include/libglade-2.0 -I/usr/include/librsvg-2.0 -I/usr/include/libgnomecanvas-2.0 -I/usr/include/gail-1.0 -I/usr/include/libart-2.0 -I/usr/include/libxml2 -I/usr/include/gtk-2.0 -I/usr/lib/x86_64-linux-gnu/gtk-2.0/include -I/usr/include/gio-unix-2.0/ -I/usr/include/cairo -I/usr/include/pango-1.0 -I/usr/include/atk-1.0 -I/usr/include/cairo -I/usr/include/pixman-1 -I/usr/include/libpng12 -I/usr/include/gdk-pixbuf-2.0 -I/usr/include/libpng12 -I/usr/include/pango-1.0 -I/usr/include/harfbuzz -I/usr/include/pango-1.0 -I/usr/include/glib-2.0 -I/usr/lib/x86_64-linux-gnu/glib-2.0/include -I/usr/include/freetype2 -I/usr/include/gtkspell-2.0 -I/usr/include/gtksourceview-2.0  -imacros ml_domain.h -O' -verbose ml_gtkbutton.c
+ gcc -std=gnu99 -O2 -fno-strict-aliasing -fwrapv -fno-builtin-memcmp -fPIC -D_FILE_OFFSET_BITS=64 -D_REENTRANT   -c  -DG_DISABLE_ASSERT -DG_DISABLE_CAST_CHECKS -fno-unwind-tables -pthread -I/usr/include/libglade-2.0 -I/usr/include/librsvg-2.0 -I/usr/include/libgnomecanvas-2.0 -I/usr/include/gail-1.0 -I/usr/include/libart-2.0 -I/usr/include/libxml2 -I/usr/include/gtk-2.0 -I/usr/lib/x86_64-linux-gnu/gtk-2.0/include -I/usr/include/gio-unix-2.0/ -I/usr/include/cairo -I/usr/include/pango-1.0 -I/usr/include/atk-1.0 -I/usr/include/cairo -I/usr/include/pixman-1 -I/usr/include/libpng12 -I/usr/include/gdk-pixbuf-2.0 -I/usr/include/libpng12 -I/usr/include/pango-1.0 -I/usr/include/harfbuzz -I/usr/include/pango-1.0 -I/usr/include/glib-2.0 -I/usr/lib/x86_64-linux-gnu/glib-2.0/include -I/usr/include/freetype2 -I/usr/include/gtkspell-2.0 -I/usr/include/gtksourceview-2.0  -imacros ml_domain.h -O  -I'/home/louis/.opam/4.08.0+gpr2165+bench/lib/ocaml' 'ml_gtkbutton.c'
ocamlc.opt -c -ccopt '-DG_DISABLE_ASSERT -DG_DISABLE_CAST_CHECKS -fno-unwind-tables -pthread -I/usr/include/libglade-2.0 -I/usr/include/librsvg-2.0 -I/usr/include/libgnomecanvas-2.0 -I/usr/include/gail-1.0 -I/usr/include/libart-2.0 -I/usr/include/libxml2 -I/usr/include/gtk-2.0 -I/usr/lib/x86_64-linux-gnu/gtk-2.0/include -I/usr/include/gio-unix-2.0/ -I/usr/include/cairo -I/usr/include/pango-1.0 -I/usr/include/atk-1.0 -I/usr/include/cairo -I/usr/include/pixman-1 -I/usr/include/libpng12 -I/usr/include/gdk-pixbuf-2.0 -I/usr/include/libpng12 -I/usr/include/pango-1.0 -I/usr/include/harfbuzz -I/usr/include/pango-1.0 -I/usr/include/glib-2.0 -I/usr/lib/x86_64-linux-gnu/glib-2.0/include -I/usr/include/freetype2 -I/usr/include/gtkspell-2.0 -I/usr/include/gtksourceview-2.0  -imacros ml_domain.h -O' -verbose ml_gtkassistant.c
+ gcc -std=gnu99 -O2 -fno-strict-aliasing -fwrapv -fno-builtin-memcmp -fPIC -D_FILE_OFFSET_BITS=64 -D_REENTRANT   -c  -DG_DISABLE_ASSERT -DG_DISABLE_CAST_CHECKS -fno-unwind-tables -pthread -I/usr/include/libglade-2.0 -I/usr/include/librsvg-2.0 -I/usr/include/libgnomecanvas-2.0 -I/usr/include/gail-1.0 -I/usr/include/libart-2.0 -I/usr/include/libxml2 -I/usr/include/gtk-2.0 -I/usr/lib/x86_64-linux-gnu/gtk-2.0/include -I/usr/include/gio-unix-2.0/ -I/usr/include/cairo -I/usr/include/pango-1.0 -I/usr/include/atk-1.0 -I/usr/include/cairo -I/usr/include/pixman-1 -I/usr/include/libpng12 -I/usr/include/gdk-pixbuf-2.0 -I/usr/include/libpng12 -I/usr/include/pango-1.0 -I/usr/include/harfbuzz -I/usr/include/pango-1.0 -I/usr/include/glib-2.0 -I/usr/lib/x86_64-linux-gnu/glib-2.0/include -I/usr/include/freetype2 -I/usr/include/gtkspell-2.0 -I/usr/include/gtksourceview-2.0  -imacros ml_domain.h -O  -I'/home/louis/.opam/4.08.0+gpr2165+bench/lib/ocaml' 'ml_gtkassistant.c'
ocamlc.opt -c -ccopt '-DG_DISABLE_ASSERT -DG_DISABLE_CAST_CHECKS -fno-unwind-tables -pthread -I/usr/include/libglade-2.0 -I/usr/include/librsvg-2.0 -I/usr/include/libgnomecanvas-2.0 -I/usr/include/gail-1.0 -I/usr/include/libart-2.0 -I/usr/include/libxml2 -I/usr/include/gtk-2.0 -I/usr/lib/x86_64-linux-gnu/gtk-2.0/include -I/usr/include/gio-unix-2.0/ -I/usr/include/cairo -I/usr/include/pango-1.0 -I/usr/include/atk-1.0 -I/usr/include/cairo -I/usr/include/pixman-1 -I/usr/include/libpng12 -I/usr/include/gdk-pixbuf-2.0 -I/usr/include/libpng12 -I/usr/include/pango-1.0 -I/usr/include/harfbuzz -I/usr/include/pango-1.0 -I/usr/include/glib-2.0 -I/usr/lib/x86_64-linux-gnu/glib-2.0/include -I/usr/include/freetype2 -I/usr/include/gtkspell-2.0 -I/usr/include/gtksourceview-2.0  -imacros ml_domain.h -O' -verbose ml_gtkedit.c
+ gcc -std=gnu99 -O2 -fno-strict-aliasing -fwrapv -fno-builtin-memcmp -fPIC -D_FILE_OFFSET_BITS=64 -D_REENTRANT   -c  -DG_DISABLE_ASSERT -DG_DISABLE_CAST_CHECKS -fno-unwind-tables -pthread -I/usr/include/libglade-2.0 -I/usr/include/librsvg-2.0 -I/usr/include/libgnomecanvas-2.0 -I/usr/include/gail-1.0 -I/usr/include/libart-2.0 -I/usr/include/libxml2 -I/usr/include/gtk-2.0 -I/usr/lib/x86_64-linux-gnu/gtk-2.0/include -I/usr/include/gio-unix-2.0/ -I/usr/include/cairo -I/usr/include/pango-1.0 -I/usr/include/atk-1.0 -I/usr/include/cairo -I/usr/include/pixman-1 -I/usr/include/libpng12 -I/usr/include/gdk-pixbuf-2.0 -I/usr/include/libpng12 -I/usr/include/pango-1.0 -I/usr/include/harfbuzz -I/usr/include/pango-1.0 -I/usr/include/glib-2.0 -I/usr/lib/x86_64-linux-gnu/glib-2.0/include -I/usr/include/freetype2 -I/usr/include/gtkspell-2.0 -I/usr/include/gtksourceview-2.0  -imacros ml_domain.h -O  -I'/home/louis/.opam/4.08.0+gpr2165+bench/lib/ocaml' 'ml_gtkedit.c'
ocamlc.opt -c -ccopt '-DG_DISABLE_ASSERT -DG_DISABLE_CAST_CHECKS -fno-unwind-tables -pthread -I/usr/include/libglade-2.0 -I/usr/include/librsvg-2.0 -I/usr/include/libgnomecanvas-2.0 -I/usr/include/gail-1.0 -I/usr/include/libart-2.0 -I/usr/include/libxml2 -I/usr/include/gtk-2.0 -I/usr/lib/x86_64-linux-gnu/gtk-2.0/include -I/usr/include/gio-unix-2.0/ -I/usr/include/cairo -I/usr/include/pango-1.0 -I/usr/include/atk-1.0 -I/usr/include/cairo -I/usr/include/pixman-1 -I/usr/include/libpng12 -I/usr/include/gdk-pixbuf-2.0 -I/usr/include/libpng12 -I/usr/include/pango-1.0 -I/usr/include/harfbuzz -I/usr/include/pango-1.0 -I/usr/include/glib-2.0 -I/usr/lib/x86_64-linux-gnu/glib-2.0/include -I/usr/include/freetype2 -I/usr/include/gtkspell-2.0 -I/usr/include/gtksourceview-2.0  -imacros ml_domain.h -O' -verbose ml_gtkfile.c
+ gcc -std=gnu99 -O2 -fno-strict-aliasing -fwrapv -fno-builtin-memcmp -fPIC -D_FILE_OFFSET_BITS=64 -D_REENTRANT   -c  -DG_DISABLE_ASSERT -DG_DISABLE_CAST_CHECKS -fno-unwind-tables -pthread -I/usr/include/libglade-2.0 -I/usr/include/librsvg-2.0 -I/usr/include/libgnomecanvas-2.0 -I/usr/include/gail-1.0 -I/usr/include/libart-2.0 -I/usr/include/libxml2 -I/usr/include/gtk-2.0 -I/usr/lib/x86_64-linux-gnu/gtk-2.0/include -I/usr/include/gio-unix-2.0/ -I/usr/include/cairo -I/usr/include/pango-1.0 -I/usr/include/atk-1.0 -I/usr/include/cairo -I/usr/include/pixman-1 -I/usr/include/libpng12 -I/usr/include/gdk-pixbuf-2.0 -I/usr/include/libpng12 -I/usr/include/pango-1.0 -I/usr/include/harfbuzz -I/usr/include/pango-1.0 -I/usr/include/glib-2.0 -I/usr/lib/x86_64-linux-gnu/glib-2.0/include -I/usr/include/freetype2 -I/usr/include/gtkspell-2.0 -I/usr/include/gtksourceview-2.0  -imacros ml_domain.h -O  -I'/home/louis/.opam/4.08.0+gpr2165+bench/lib/ocaml' 'ml_gtkfile.c'
ocamlc.opt -c -ccopt '-DG_DISABLE_ASSERT -DG_DISABLE_CAST_CHECKS -fno-unwind-tables -pthread -I/usr/include/libglade-2.0 -I/usr/include/librsvg-2.0 -I/usr/include/libgnomecanvas-2.0 -I/usr/include/gail-1.0 -I/usr/include/libart-2.0 -I/usr/include/libxml2 -I/usr/include/gtk-2.0 -I/usr/lib/x86_64-linux-gnu/gtk-2.0/include -I/usr/include/gio-unix-2.0/ -I/usr/include/cairo -I/usr/include/pango-1.0 -I/usr/include/atk-1.0 -I/usr/include/cairo -I/usr/include/pixman-1 -I/usr/include/libpng12 -I/usr/include/gdk-pixbuf-2.0 -I/usr/include/libpng12 -I/usr/include/pango-1.0 -I/usr/include/harfbuzz -I/usr/include/pango-1.0 -I/usr/include/glib-2.0 -I/usr/lib/x86_64-linux-gnu/glib-2.0/include -I/usr/include/freetype2 -I/usr/include/gtkspell-2.0 -I/usr/include/gtksourceview-2.0  -imacros ml_domain.h -O' -verbose ml_gtklist.c
+ gcc -std=gnu99 -O2 -fno-strict-aliasing -fwrapv -fno-builtin-memcmp -fPIC -D_FILE_OFFSET_BITS=64 -D_REENTRANT   -c  -DG_DISABLE_ASSERT -DG_DISABLE_CAST_CHECKS -fno-unwind-tables -pthread -I/usr/include/libglade-2.0 -I/usr/include/librsvg-2.0 -I/usr/include/libgnomecanvas-2.0 -I/usr/include/gail-1.0 -I/usr/include/libart-2.0 -I/usr/include/libxml2 -I/usr/include/gtk-2.0 -I/usr/lib/x86_64-linux-gnu/gtk-2.0/include -I/usr/include/gio-unix-2.0/ -I/usr/include/cairo -I/usr/include/pango-1.0 -I/usr/include/atk-1.0 -I/usr/include/cairo -I/usr/include/pixman-1 -I/usr/include/libpng12 -I/usr/include/gdk-pixbuf-2.0 -I/usr/include/libpng12 -I/usr/include/pango-1.0 -I/usr/include/harfbuzz -I/usr/include/pango-1.0 -I/usr/include/glib-2.0 -I/usr/lib/x86_64-linux-gnu/glib-2.0/include -I/usr/include/freetype2 -I/usr/include/gtkspell-2.0 -I/usr/include/gtksourceview-2.0  -imacros ml_domain.h -O  -I'/home/louis/.opam/4.08.0+gpr2165+bench/lib/ocaml' 'ml_gtklist.c'
ocamlc.opt -c -ccopt '-DG_DISABLE_ASSERT -DG_DISABLE_CAST_CHECKS -fno-unwind-tables -pthread -I/usr/include/libglade-2.0 -I/usr/include/librsvg-2.0 -I/usr/include/libgnomecanvas-2.0 -I/usr/include/gail-1.0 -I/usr/include/libart-2.0 -I/usr/include/libxml2 -I/usr/include/gtk-2.0 -I/usr/lib/x86_64-linux-gnu/gtk-2.0/include -I/usr/include/gio-unix-2.0/ -I/usr/include/cairo -I/usr/include/pango-1.0 -I/usr/include/atk-1.0 -I/usr/include/cairo -I/usr/include/pixman-1 -I/usr/include/libpng12 -I/usr/include/gdk-pixbuf-2.0 -I/usr/include/libpng12 -I/usr/include/pango-1.0 -I/usr/include/harfbuzz -I/usr/include/pango-1.0 -I/usr/include/glib-2.0 -I/usr/lib/x86_64-linux-gnu/glib-2.0/include -I/usr/include/freetype2 -I/usr/include/gtkspell-2.0 -I/usr/include/gtksourceview-2.0  -imacros ml_domain.h -O' -verbose ml_gtkmenu.c
+ gcc -std=gnu99 -O2 -fno-strict-aliasing -fwrapv -fno-builtin-memcmp -fPIC -D_FILE_OFFSET_BITS=64 -D_REENTRANT   -c  -DG_DISABLE_ASSERT -DG_DISABLE_CAST_CHECKS -fno-unwind-tables -pthread -I/usr/include/libglade-2.0 -I/usr/include/librsvg-2.0 -I/usr/include/libgnomecanvas-2.0 -I/usr/include/gail-1.0 -I/usr/include/libart-2.0 -I/usr/include/libxml2 -I/usr/include/gtk-2.0 -I/usr/lib/x86_64-linux-gnu/gtk-2.0/include -I/usr/include/gio-unix-2.0/ -I/usr/include/cairo -I/usr/include/pango-1.0 -I/usr/include/atk-1.0 -I/usr/include/cairo -I/usr/include/pixman-1 -I/usr/include/libpng12 -I/usr/include/gdk-pixbuf-2.0 -I/usr/include/libpng12 -I/usr/include/pango-1.0 -I/usr/include/harfbuzz -I/usr/include/pango-1.0 -I/usr/include/glib-2.0 -I/usr/lib/x86_64-linux-gnu/glib-2.0/include -I/usr/include/freetype2 -I/usr/include/gtkspell-2.0 -I/usr/include/gtksourceview-2.0  -imacros ml_domain.h -O  -I'/home/louis/.opam/4.08.0+gpr2165+bench/lib/ocaml' 'ml_gtkmenu.c'
ocamlc.opt -c -ccopt '-DG_DISABLE_ASSERT -DG_DISABLE_CAST_CHECKS -fno-unwind-tables -pthread -I/usr/include/libglade-2.0 -I/usr/include/librsvg-2.0 -I/usr/include/libgnomecanvas-2.0 -I/usr/include/gail-1.0 -I/usr/include/libart-2.0 -I/usr/include/libxml2 -I/usr/include/gtk-2.0 -I/usr/lib/x86_64-linux-gnu/gtk-2.0/include -I/usr/include/gio-unix-2.0/ -I/usr/include/cairo -I/usr/include/pango-1.0 -I/usr/include/atk-1.0 -I/usr/include/cairo -I/usr/include/pixman-1 -I/usr/include/libpng12 -I/usr/include/gdk-pixbuf-2.0 -I/usr/include/libpng12 -I/usr/include/pango-1.0 -I/usr/include/harfbuzz -I/usr/include/pango-1.0 -I/usr/include/glib-2.0 -I/usr/lib/x86_64-linux-gnu/glib-2.0/include -I/usr/include/freetype2 -I/usr/include/gtkspell-2.0 -I/usr/include/gtksourceview-2.0  -imacros ml_domain.h -O' -verbose ml_gtkmisc.c
+ gcc -std=gnu99 -O2 -fno-strict-aliasing -fwrapv -fno-builtin-memcmp -fPIC -D_FILE_OFFSET_BITS=64 -D_REENTRANT   -c  -DG_DISABLE_ASSERT -DG_DISABLE_CAST_CHECKS -fno-unwind-tables -pthread -I/usr/include/libglade-2.0 -I/usr/include/librsvg-2.0 -I/usr/include/libgnomecanvas-2.0 -I/usr/include/gail-1.0 -I/usr/include/libart-2.0 -I/usr/include/libxml2 -I/usr/include/gtk-2.0 -I/usr/lib/x86_64-linux-gnu/gtk-2.0/include -I/usr/include/gio-unix-2.0/ -I/usr/include/cairo -I/usr/include/pango-1.0 -I/usr/include/atk-1.0 -I/usr/include/cairo -I/usr/include/pixman-1 -I/usr/include/libpng12 -I/usr/include/gdk-pixbuf-2.0 -I/usr/include/libpng12 -I/usr/include/pango-1.0 -I/usr/include/harfbuzz -I/usr/include/pango-1.0 -I/usr/include/glib-2.0 -I/usr/lib/x86_64-linux-gnu/glib-2.0/include -I/usr/include/freetype2 -I/usr/include/gtkspell-2.0 -I/usr/include/gtksourceview-2.0  -imacros ml_domain.h -O  -I'/home/louis/.opam/4.08.0+gpr2165+bench/lib/ocaml' 'ml_gtkmisc.c'
ocamlc.opt -c -ccopt '-DG_DISABLE_ASSERT -DG_DISABLE_CAST_CHECKS -fno-unwind-tables -pthread -I/usr/include/libglade-2.0 -I/usr/include/librsvg-2.0 -I/usr/include/libgnomecanvas-2.0 -I/usr/include/gail-1.0 -I/usr/include/libart-2.0 -I/usr/include/libxml2 -I/usr/include/gtk-2.0 -I/usr/lib/x86_64-linux-gnu/gtk-2.0/include -I/usr/include/gio-unix-2.0/ -I/usr/include/cairo -I/usr/include/pango-1.0 -I/usr/include/atk-1.0 -I/usr/include/cairo -I/usr/include/pixman-1 -I/usr/include/libpng12 -I/usr/include/gdk-pixbuf-2.0 -I/usr/include/libpng12 -I/usr/include/pango-1.0 -I/usr/include/harfbuzz -I/usr/include/pango-1.0 -I/usr/include/glib-2.0 -I/usr/lib/x86_64-linux-gnu/glib-2.0/include -I/usr/include/freetype2 -I/usr/include/gtkspell-2.0 -I/usr/include/gtksourceview-2.0  -imacros ml_domain.h -O' -verbose ml_gtkpack.c
+ gcc -std=gnu99 -O2 -fno-strict-aliasing -fwrapv -fno-builtin-memcmp -fPIC -D_FILE_OFFSET_BITS=64 -D_REENTRANT   -c  -DG_DISABLE_ASSERT -DG_DISABLE_CAST_CHECKS -fno-unwind-tables -pthread -I/usr/include/libglade-2.0 -I/usr/include/librsvg-2.0 -I/usr/include/libgnomecanvas-2.0 -I/usr/include/gail-1.0 -I/usr/include/libart-2.0 -I/usr/include/libxml2 -I/usr/include/gtk-2.0 -I/usr/lib/x86_64-linux-gnu/gtk-2.0/include -I/usr/include/gio-unix-2.0/ -I/usr/include/cairo -I/usr/include/pango-1.0 -I/usr/include/atk-1.0 -I/usr/include/cairo -I/usr/include/pixman-1 -I/usr/include/libpng12 -I/usr/include/gdk-pixbuf-2.0 -I/usr/include/libpng12 -I/usr/include/pango-1.0 -I/usr/include/harfbuzz -I/usr/include/pango-1.0 -I/usr/include/glib-2.0 -I/usr/lib/x86_64-linux-gnu/glib-2.0/include -I/usr/include/freetype2 -I/usr/include/gtkspell-2.0 -I/usr/include/gtksourceview-2.0  -imacros ml_domain.h -O  -I'/home/louis/.opam/4.08.0+gpr2165+bench/lib/ocaml' 'ml_gtkpack.c'
ocamlc.opt -c -ccopt '-DG_DISABLE_ASSERT -DG_DISABLE_CAST_CHECKS -fno-unwind-tables -pthread -I/usr/include/libglade-2.0 -I/usr/include/librsvg-2.0 -I/usr/include/libgnomecanvas-2.0 -I/usr/include/gail-1.0 -I/usr/include/libart-2.0 -I/usr/include/libxml2 -I/usr/include/gtk-2.0 -I/usr/lib/x86_64-linux-gnu/gtk-2.0/include -I/usr/include/gio-unix-2.0/ -I/usr/include/cairo -I/usr/include/pango-1.0 -I/usr/include/atk-1.0 -I/usr/include/cairo -I/usr/include/pixman-1 -I/usr/include/libpng12 -I/usr/include/gdk-pixbuf-2.0 -I/usr/include/libpng12 -I/usr/include/pango-1.0 -I/usr/include/harfbuzz -I/usr/include/pango-1.0 -I/usr/include/glib-2.0 -I/usr/lib/x86_64-linux-gnu/glib-2.0/include -I/usr/include/freetype2 -I/usr/include/gtkspell-2.0 -I/usr/include/gtksourceview-2.0  -imacros ml_domain.h -O' -verbose ml_gtkrange.c
+ gcc -std=gnu99 -O2 -fno-strict-aliasing -fwrapv -fno-builtin-memcmp -fPIC -D_FILE_OFFSET_BITS=64 -D_REENTRANT   -c  -DG_DISABLE_ASSERT -DG_DISABLE_CAST_CHECKS -fno-unwind-tables -pthread -I/usr/include/libglade-2.0 -I/usr/include/librsvg-2.0 -I/usr/include/libgnomecanvas-2.0 -I/usr/include/gail-1.0 -I/usr/include/libart-2.0 -I/usr/include/libxml2 -I/usr/include/gtk-2.0 -I/usr/lib/x86_64-linux-gnu/gtk-2.0/include -I/usr/include/gio-unix-2.0/ -I/usr/include/cairo -I/usr/include/pango-1.0 -I/usr/include/atk-1.0 -I/usr/include/cairo -I/usr/include/pixman-1 -I/usr/include/libpng12 -I/usr/include/gdk-pixbuf-2.0 -I/usr/include/libpng12 -I/usr/include/pango-1.0 -I/usr/include/harfbuzz -I/usr/include/pango-1.0 -I/usr/include/glib-2.0 -I/usr/lib/x86_64-linux-gnu/glib-2.0/include -I/usr/include/freetype2 -I/usr/include/gtkspell-2.0 -I/usr/include/gtksourceview-2.0  -imacros ml_domain.h -O  -I'/home/louis/.opam/4.08.0+gpr2165+bench/lib/ocaml' 'ml_gtkrange.c'
ocamlc.opt -c -ccopt '-DG_DISABLE_ASSERT -DG_DISABLE_CAST_CHECKS -fno-unwind-tables -pthread -I/usr/include/libglade-2.0 -I/usr/include/librsvg-2.0 -I/usr/include/libgnomecanvas-2.0 -I/usr/include/gail-1.0 -I/usr/include/libart-2.0 -I/usr/include/libxml2 -I/usr/include/gtk-2.0 -I/usr/lib/x86_64-linux-gnu/gtk-2.0/include -I/usr/include/gio-unix-2.0/ -I/usr/include/cairo -I/usr/include/pango-1.0 -I/usr/include/atk-1.0 -I/usr/include/cairo -I/usr/include/pixman-1 -I/usr/include/libpng12 -I/usr/include/gdk-pixbuf-2.0 -I/usr/include/libpng12 -I/usr/include/pango-1.0 -I/usr/include/harfbuzz -I/usr/include/pango-1.0 -I/usr/include/glib-2.0 -I/usr/lib/x86_64-linux-gnu/glib-2.0/include -I/usr/include/freetype2 -I/usr/include/gtkspell-2.0 -I/usr/include/gtksourceview-2.0  -imacros ml_domain.h -O' -verbose ml_gtkstock.c
+ gcc -std=gnu99 -O2 -fno-strict-aliasing -fwrapv -fno-builtin-memcmp -fPIC -D_FILE_OFFSET_BITS=64 -D_REENTRANT   -c  -DG_DISABLE_ASSERT -DG_DISABLE_CAST_CHECKS -fno-unwind-tables -pthread -I/usr/include/libglade-2.0 -I/usr/include/librsvg-2.0 -I/usr/include/libgnomecanvas-2.0 -I/usr/include/gail-1.0 -I/usr/include/libart-2.0 -I/usr/include/libxml2 -I/usr/include/gtk-2.0 -I/usr/lib/x86_64-linux-gnu/gtk-2.0/include -I/usr/include/gio-unix-2.0/ -I/usr/include/cairo -I/usr/include/pango-1.0 -I/usr/include/atk-1.0 -I/usr/include/cairo -I/usr/include/pixman-1 -I/usr/include/libpng12 -I/usr/include/gdk-pixbuf-2.0 -I/usr/include/libpng12 -I/usr/include/pango-1.0 -I/usr/include/harfbuzz -I/usr/include/pango-1.0 -I/usr/include/glib-2.0 -I/usr/lib/x86_64-linux-gnu/glib-2.0/include -I/usr/include/freetype2 -I/usr/include/gtkspell-2.0 -I/usr/include/gtksourceview-2.0  -imacros ml_domain.h -O  -I'/home/louis/.opam/4.08.0+gpr2165+bench/lib/ocaml' 'ml_gtkstock.c'
ocamlc.opt -c -ccopt '-DG_DISABLE_ASSERT -DG_DISABLE_CAST_CHECKS -fno-unwind-tables -pthread -I/usr/include/libglade-2.0 -I/usr/include/librsvg-2.0 -I/usr/include/libgnomecanvas-2.0 -I/usr/include/gail-1.0 -I/usr/include/libart-2.0 -I/usr/include/libxml2 -I/usr/include/gtk-2.0 -I/usr/lib/x86_64-linux-gnu/gtk-2.0/include -I/usr/include/gio-unix-2.0/ -I/usr/include/cairo -I/usr/include/pango-1.0 -I/usr/include/atk-1.0 -I/usr/include/cairo -I/usr/include/pixman-1 -I/usr/include/libpng12 -I/usr/include/gdk-pixbuf-2.0 -I/usr/include/libpng12 -I/usr/include/pango-1.0 -I/usr/include/harfbuzz -I/usr/include/pango-1.0 -I/usr/include/glib-2.0 -I/usr/lib/x86_64-linux-gnu/glib-2.0/include -I/usr/include/freetype2 -I/usr/include/gtkspell-2.0 -I/usr/include/gtksourceview-2.0  -imacros ml_domain.h -O' -verbose ml_gtktext.c
+ gcc -std=gnu99 -O2 -fno-strict-aliasing -fwrapv -fno-builtin-memcmp -fPIC -D_FILE_OFFSET_BITS=64 -D_REENTRANT   -c  -DG_DISABLE_ASSERT -DG_DISABLE_CAST_CHECKS -fno-unwind-tables -pthread -I/usr/include/libglade-2.0 -I/usr/include/librsvg-2.0 -I/usr/include/libgnomecanvas-2.0 -I/usr/include/gail-1.0 -I/usr/include/libart-2.0 -I/usr/include/libxml2 -I/usr/include/gtk-2.0 -I/usr/lib/x86_64-linux-gnu/gtk-2.0/include -I/usr/include/gio-unix-2.0/ -I/usr/include/cairo -I/usr/include/pango-1.0 -I/usr/include/atk-1.0 -I/usr/include/cairo -I/usr/include/pixman-1 -I/usr/include/libpng12 -I/usr/include/gdk-pixbuf-2.0 -I/usr/include/libpng12 -I/usr/include/pango-1.0 -I/usr/include/harfbuzz -I/usr/include/pango-1.0 -I/usr/include/glib-2.0 -I/usr/lib/x86_64-linux-gnu/glib-2.0/include -I/usr/include/freetype2 -I/usr/include/gtkspell-2.0 -I/usr/include/gtksourceview-2.0  -imacros ml_domain.h -O  -I'/home/louis/.opam/4.08.0+gpr2165+bench/lib/ocaml' 'ml_gtktext.c'
ocamlc.opt -c -ccopt '-DG_DISABLE_ASSERT -DG_DISABLE_CAST_CHECKS -fno-unwind-tables -pthread -I/usr/include/libglade-2.0 -I/usr/include/librsvg-2.0 -I/usr/include/libgnomecanvas-2.0 -I/usr/include/gail-1.0 -I/usr/include/libart-2.0 -I/usr/include/libxml2 -I/usr/include/gtk-2.0 -I/usr/lib/x86_64-linux-gnu/gtk-2.0/include -I/usr/include/gio-unix-2.0/ -I/usr/include/cairo -I/usr/include/pango-1.0 -I/usr/include/atk-1.0 -I/usr/include/cairo -I/usr/include/pixman-1 -I/usr/include/libpng12 -I/usr/include/gdk-pixbuf-2.0 -I/usr/include/libpng12 -I/usr/include/pango-1.0 -I/usr/include/harfbuzz -I/usr/include/pango-1.0 -I/usr/include/glib-2.0 -I/usr/lib/x86_64-linux-gnu/glib-2.0/include -I/usr/include/freetype2 -I/usr/include/gtkspell-2.0 -I/usr/include/gtksourceview-2.0  -imacros ml_domain.h -O' -verbose ml_gtktree.c
+ gcc -std=gnu99 -O2 -fno-strict-aliasing -fwrapv -fno-builtin-memcmp -fPIC -D_FILE_OFFSET_BITS=64 -D_REENTRANT   -c  -DG_DISABLE_ASSERT -DG_DISABLE_CAST_CHECKS -fno-unwind-tables -pthread -I/usr/include/libglade-2.0 -I/usr/include/librsvg-2.0 -I/usr/include/libgnomecanvas-2.0 -I/usr/include/gail-1.0 -I/usr/include/libart-2.0 -I/usr/include/libxml2 -I/usr/include/gtk-2.0 -I/usr/lib/x86_64-linux-gnu/gtk-2.0/include -I/usr/include/gio-unix-2.0/ -I/usr/include/cairo -I/usr/include/pango-1.0 -I/usr/include/atk-1.0 -I/usr/include/cairo -I/usr/include/pixman-1 -I/usr/include/libpng12 -I/usr/include/gdk-pixbuf-2.0 -I/usr/include/libpng12 -I/usr/include/pango-1.0 -I/usr/include/harfbuzz -I/usr/include/pango-1.0 -I/usr/include/glib-2.0 -I/usr/lib/x86_64-linux-gnu/glib-2.0/include -I/usr/include/freetype2 -I/usr/include/gtkspell-2.0 -I/usr/include/gtksourceview-2.0  -imacros ml_domain.h -O  -I'/home/louis/.opam/4.08.0+gpr2165+bench/lib/ocaml' 'ml_gtktree.c'
ocamlc.opt   -w s-3+52 -warn-error A-52 -c  gaux.ml
ocamlc.opt   -w s-3+52 -warn-error A-52 -c gpointer.mli
ocamlc.opt   -w s-3+52 -warn-error A-52 -c  gpointer.ml
ocamlc.opt   -w s-3+52 -warn-error A-52 -c gutf8.mli
ocamlc.opt   -w s-3+52 -warn-error A-52 -c  gutf8.ml
ocamlc.opt   -w s-3+52 -warn-error A-52 -c glib.mli
ocamlc.opt   -w s-3+52 -warn-error A-52 -c  glib.ml
ocamlc.opt   -w s-3+52 -warn-error A-52 -c gobject.mli
ocamlc.opt   -w s-3+52 -warn-error A-52 -c  gobject.ml
File "gobject.ml", line 140, characters 17-60:
140 |     with Failure ("Gobject.get_int32"|"Gobject.get_pointer") -> `NONE
                       ^^^^^^^^^^^^^^^^^^^^^^^^^^^^^^^^^^^^^^^^^^^
Warning 52: Code should not depend on the actual values of
this constructor's arguments. They are only for information
and may change in future versions. (See manual section 9.5)
ocamlc.opt   -w s-3+52 -warn-error A-52 -c  gdkEnums.ml
ocamlc.opt   -w s-3+52 -warn-error A-52 -c  pangoEnums.ml
ocamlc.opt   -w s-3+52 -warn-error A-52 -c  gtkEnums.ml
ocamlc.opt   -w s-3+52 -warn-error A-52 -c  pango.ml
ocamlc.opt   -w s-3+52 -warn-error A-52 -c gdk.mli
ocamlc.opt   -w s-3+52 -warn-error A-52 -c  gdk.ml
File "gdk.ml", line 346, characters 2-55:
346 |   external create : len:int -> t = "ml_point_array_new"
        ^^^^^^^^^^^^^^^^^^^^^^^^^^^^^^^^^^^^^^^^^^^^^^^^^^^^^
Error (warning 61): This primitive declaration uses type t, which is unannotated and
unboxable. The representation of such types may change in future
versions. You should annotate the declaration of t with [@@boxed]
or [@@unboxed].
File "gdk.ml", line 347, characters 2-78:
347 |   external set : t -> pos:int -> x:int -> y:int -> unit = "ml_point_array_set"
        ^^^^^^^^^^^^^^^^^^^^^^^^^^^^^^^^^^^^^^^^^^^^^^^^^^^^^^^^^^^^^^^^^^^^^^^^^^^^
Error (warning 61): This primitive declaration uses type t, which is unannotated and
unboxable. The representation of such types may change in future
versions. You should annotate the declaration of t with [@@boxed]
or [@@unboxed].
File "gdk.ml", line 355, characters 2-57:
355 |   external create : len:int -> t = "ml_segment_array_new"
        ^^^^^^^^^^^^^^^^^^^^^^^^^^^^^^^^^^^^^^^^^^^^^^^^^^^^^^^
Error (warning 61): This primitive declaration uses type t, which is unannotated and
unboxable. The representation of such types may change in future
versions. You should annotate the declaration of t with [@@boxed]
or [@@unboxed].
File "gdk.ml", line 356, characters 2-129:
356 |   external set : t -> pos:int -> x1:int -> y1:int -> x2:int -> y2: int -> unit = "ml_segment_array_set_bc" "ml_segment_array_set"
        ^^^^^^^^^^^^^^^^^^^^^^^^^^^^^^^^^^^^^^^^^^^^^^^^^^^^^^^^^^^^^^^^^^^^^^^^^^^^^^^^^^^^^^^^^^^^^^^^^^^^^^^^^^^^^^^^^^^^^^^^^^^^^^^
Error (warning 61): This primitive declaration uses type t, which is unannotated and
unboxable. The representation of such types may change in future
versions. You should annotate the declaration of t with [@@boxed]
or [@@unboxed].
File "gdk.ml", line 367, characters 2-91:
367 | ..external polygon : PointArray.t -> gdkFillRule -> region 
368 |       = "ml_gdk_region_polygon"
Error (warning 61): This primitive declaration uses type PointArray.t, which is unannotated and
unboxable. The representation of such types may change in future
versions. You should annotate the declaration of PointArray.t with [@@boxed]
or [@@unboxed].
Makefile:192: recipe for target 'gdk.cmo' failed
make[1]: *** [gdk.cmo] Error 2
make[1]: Leaving directory '/home/louis/.opam/4.08.0+gpr2165+bench/.opam-switch/build/lablgtk.2.18.7/src'
Makefile:5: recipe for target 'world' failed
make: *** [world] Error 2
Close

Error on dune.1.8.2 (4.08.0+mutmatch+bench)

Command:

~/.opam/4.08.0+mutmatch+bench/bin/ocaml bootstrap.ml

Output

/home/louis/.opam/4.08.0+mutmatch+bench/bin/ocamllex.opt -q src/ocamlobjinfo.mll
/home/louis/.opam/4.08.0+mutmatch+bench/bin/ocamllex.opt -q src/meta_lexer.mll
/home/louis/.opam/4.08.0+mutmatch+bench/bin/ocamllex.opt -q src/dune_lexer.mll
/home/louis/.opam/4.08.0+mutmatch+bench/bin/ocamllex.opt -q src/dune_lang/dune_lexer.mll
/home/louis/.opam/4.08.0+mutmatch+bench/bin/ocamldep.opt -modules src/action.ml src/action_ast.ml src/action_dune_lang.ml src/action_exec.ml src/action_intf.ml src/action_to_sh.boot.ml src/action_unexpanded.ml src/arg_spec.ml src/artifacts.ml src/binary_kind.ml src/bindings.ml src/blang.ml src/bootstrap.boot.ml src/build.ml src/build_interpret.ml src/build_system.ml src/c.ml src/c_sources.ml src/check_rules.ml src/clflags.ml src/cm_kind.ml src/colors.ml src/compilation_context.ml src/config.ml src/config0.ml src/console.ml src/context.ml src/dep.ml src/dep_graph.ml src/dep_path.ml src/dir_contents.ml src/dir_status.ml src/dir_with_dune.ml src/dune_env.ml src/dune_file.ml src/dune_lexer.ml src/dune_load.ml src/dune_package.ml src/dune_project.ml vendor/boot/dune_re.ml src/dynlink_supported.ml src/env_node.ml src/errors.ml src/exe.ml src/exe_rules.ml src/expander.ml src/file_bindings.ml src/file_tree.ml src/findlib.ml src/format_dune_lang.ml src/format_rules.ml src/gen_meta.ml src/gen_rules.ml src/glob.ml src/glob_lexer.boot.ml src/hooks.ml src/import.ml src/inline_tests.boot.ml src/install.ml src/install_rules.ml src/installed_dune_file.ml src/js_of_ocaml_rules.boot.ml src/lib.ml src/lib_archives.ml src/lib_deps_info.ml src/lib_file_deps.ml src/lib_info.ml src/lib_kind.ml src/lib_modules.ml src/lib_name.ml src/lib_rules.ml src/link_time_code_gen.ml src/local_package.ml src/log.ml src/main.ml src/menhir.boot.ml src/merlin.ml src/meta.ml src/meta_lexer.ml src/ml_kind.ml src/mode.ml src/module.ml src/module_compilation.ml src/modules_field_evaluator.ml src/obj_dir.ml src/ocaml_flags.ml src/ocaml_version.ml src/ocamldep.ml src/ocamlobjinfo.ml src/odoc.boot.ml vendor/boot/opamBaseParser.ml vendor/boot/opamLexer.ml vendor/boot/opamParserTypes.ml src/opam_file.ml src/ordered_set_lang.ml src/package.ml src/path_dune_lang.ml src/per_item.ml src/pform.ml src/predicate_lang.ml src/preprocessing.ml src/print_diff.ml src/process.ml src/promotion.ml src/report_error.ml src/response_file.ml src/scheduler.ml src/scope.ml src/setup.boot.ml src/simple_rules.ml src/spawn.ml src/stanza.ml src/static_deps.ml src/stats.boot.ml src/string_with_vars.ml src/sub_dirs.ml src/sub_system.ml src/sub_system_info.ml src/sub_system_intf.ml src/sub_system_name.ml src/super_context.ml src/syntax.ml src/test_rules.ml src/top_closure.ml src/toplevel.ml src/upgrader.boot.ml src/utils.ml src/utop.ml src/value.ml src/variant.ml src/versioned_file.ml src/vfile_kind.ml src/vimpl.ml src/virtual_rules.ml src/watermarks.ml src/workspace.ml src/wrapped.ml > boot-depends.txt
File "src/action_ast.ml", line 33, characters 16-20:
Error: Syntax error: operator expected.
File "src/bindings.ml", line 44, characters 9-10:
Error: Syntax error: operator expected.
File "src/config.ml", line 102, characters 7-14:
Error: Syntax error
File "src/dune_env.ml", line 41, characters 9-14:
Error: Syntax error
File "src/dune_file.ml", line 111, characters 9-10:
Error: Syntax error
File "src/dune_package.ml", line 126, characters 11-19:
Error: Syntax error: operator expected.
File "src/dune_project.ml", line 300, characters 11-12:
Error: Syntax error
File "src/file_bindings.ml", line 34, characters 11-18:
Error: Syntax error
File "src/installed_dune_file.ml", line 64, characters 15-30:
Error: Syntax error: operator expected.
File "src/lib_modules.ml", line 233, characters 9-21:
Error: Syntax error: operator expected.
File "src/mode.ml", line 124, characters 13-17:
Error: Syntax error: operator expected.
File "src/module.ml", line 473, characters 9-13:
Error: Syntax error: operator expected.
File "src/obj_dir.ml", line 117, characters 9-16:
Error: Syntax error: operator expected.
File "src/ordered_set_lang.ml", line 95, characters 7-14:
Error: Syntax error
File "src/path_dune_lang.ml", line 47, characters 9-10:
Error: Syntax error
File "src/preprocessing.ml", line 130, characters 16-19:
Error: Syntax error: operator expected.
File "src/string_with_vars.ml", line 133, characters 7-21:
Error: Syntax error
File "src/sub_dirs.ml", line 71, characters 9-16:
Error: Syntax error
File "src/versioned_file.ml", line 93, characters 7-8:
Error: Syntax error
File "src/workspace.ml", line 58, characters 11-14:
Error: Syntax error
Close

Error on core-micro-bench.1.0 (4.07.1+oclassic+bench)

Command:

/usr/bin/make -C core_micro

Output

make: Entering directory '/home/louis/.opam/4.07.1+oclassic+bench/.opam-switch/build/core-micro-bench.1.0/core_micro'
ocamlbuild -use-ocamlfind runner.native
ocamlfind ocamldep -package str -package core -package core_bench.inline_benchmarks -modules runner.ml > runner.ml.depends
ocamlfind ocamlc -c -thread -package str -package core -package core_bench.inline_benchmarks -o runner.cmo runner.ml
+ ocamlfind ocamlc -c -thread -package str -package core -package core_bench.inline_benchmarks -o runner.cmo runner.ml
File "runner.ml", line 1, characters 5-13:
Warning 3: deprecated: module Core.Std
[since 2017-02] Use Core. The Std sub-module is no longer needed
File "runner.ml", line 3, characters 15-55:
Error: Unbound module Pa_bench_lib
Command exited with code 2.
Makefile:4: recipe for target 'all' failed
make: *** [all] Error 10
make: Leaving directory '/home/louis/.opam/4.07.1+oclassic+bench/.opam-switch/build/core-micro-bench.1.0/core_micro'
make: Entering directory '/home/louis/.opam/4.07.1+oclassic+bench/.opam-switch/build/core-micro-bench.1.0/core_micro'
ocamlbuild -use-ocamlfind runner.native
ocamlfind ocamldep -package str -package core -package core_bench.inline_benchmarks -modules runner.ml > runner.ml.depends
ocamlfind ocamlc -c -thread -package str -package core -package core_bench.inline_benchmarks -o runner.cmo runner.ml
+ ocamlfind ocamlc -c -thread -package str -package core -package core_bench.inline_benchmarks -o runner.cmo runner.ml
File "runner.ml", line 1, characters 5-13:
Warning 3: deprecated: module Core.Std
[since 2017-02] Use Core. The Std sub-module is no longer needed
File "runner.ml", line 3, characters 15-55:
Error: Unbound module Pa_bench_lib
Command exited with code 2.
Makefile:4: recipe for target 'all' failed
make: *** [all] Error 10
make: Leaving directory '/home/louis/.opam/4.07.1+oclassic+bench/.opam-switch/build/core-micro-bench.1.0/core_micro'
Close

Error on core-micro-bench.1.0 (4.07.1+flambda+bench)

Command:

/usr/bin/make -C core_micro

Output

make: Entering directory '/home/louis/.opam/4.07.1+clambda+bench/.opam-switch/build/core-micro-bench.1.0/core_micro'
ocamlbuild -use-ocamlfind runner.native
ocamlfind ocamldep -package str -package core -package core_bench.inline_benchmarks -modules runner.ml > runner.ml.depends
ocamlfind ocamlc -c -thread -package str -package core -package core_bench.inline_benchmarks -o runner.cmo runner.ml
+ ocamlfind ocamlc -c -thread -package str -package core -package core_bench.inline_benchmarks -o runner.cmo runner.ml
File "runner.ml", line 1, characters 5-13:
Warning 3: deprecated: module Core.Std
[since 2017-02] Use Core. The Std sub-module is no longer needed
File "runner.ml", line 3, characters 15-55:
Error: Unbound module Pa_bench_lib
Command exited with code 2.
Makefile:4: recipe for target 'all' failed
make: *** [all] Error 10
make: Leaving directory '/home/louis/.opam/4.07.1+clambda+bench/.opam-switch/build/core-micro-bench.1.0/core_micro'
make: Entering directory '/home/louis/.opam/4.07.1+flambda+bench/.opam-switch/build/core-micro-bench.1.0/core_micro'
ocamlbuild -use-ocamlfind runner.native
ocamlfind ocamldep -package str -package core -package core_bench.inline_benchmarks -modules runner.ml > runner.ml.depends
ocamlfind ocamlc -c -thread -package str -package core -package core_bench.inline_benchmarks -o runner.cmo runner.ml
+ ocamlfind ocamlc -c -thread -package str -package core -package core_bench.inline_benchmarks -o runner.cmo runner.ml
File "runner.ml", line 1, characters 5-13:
Warning 3: deprecated: module Core.Std
[since 2017-02] Use Core. The Std sub-module is no longer needed
File "runner.ml", line 3, characters 15-55:
Error: Unbound module Pa_bench_lib
Command exited with code 2.
Makefile:4: recipe for target 'all' failed
make: *** [all] Error 10
make: Leaving directory '/home/louis/.opam/4.07.1+flambda+bench/.opam-switch/build/core-micro-bench.1.0/core_micro'
Close

Error on core-micro-bench.1.0 (4.07.1+clambda+bench)

Command:

/usr/bin/make -C core_micro

Output

make: Entering directory '/home/louis/.opam/4.07.1+clambda+bench/.opam-switch/build/core-micro-bench.1.0/core_micro'
ocamlbuild -use-ocamlfind runner.native
ocamlfind ocamldep -package str -package core -package core_bench.inline_benchmarks -modules runner.ml > runner.ml.depends
ocamlfind ocamlc -c -thread -package str -package core -package core_bench.inline_benchmarks -o runner.cmo runner.ml
+ ocamlfind ocamlc -c -thread -package str -package core -package core_bench.inline_benchmarks -o runner.cmo runner.ml
File "runner.ml", line 1, characters 5-13:
Warning 3: deprecated: module Core.Std
[since 2017-02] Use Core. The Std sub-module is no longer needed
File "runner.ml", line 3, characters 15-55:
Error: Unbound module Pa_bench_lib
Command exited with code 2.
Makefile:4: recipe for target 'all' failed
make: *** [all] Error 10
make: Leaving directory '/home/louis/.opam/4.07.1+clambda+bench/.opam-switch/build/core-micro-bench.1.0/core_micro'
Close

Error on core-micro-bench.1.0 (4.03.1+bench)

Command:

/usr/bin/make -C core_micro

Output

make: Entering directory '/home/louis/.opam/4.03.1+bench/.opam-switch/build/core-micro-bench.1.0/core_micro'
ocamlbuild -use-ocamlfind runner.native
ocamlfind ocamldep -package str -package core -package core_bench.inline_benchmarks -modules runner.ml > runner.ml.depends
ocamlfind ocamlc -c -thread -package str -package core -package core_bench.inline_benchmarks -o runner.cmo runner.ml
+ ocamlfind ocamlc -c -thread -package str -package core -package core_bench.inline_benchmarks -o runner.cmo runner.ml
File "runner.ml", line 1, characters 5-13:
Warning 3: deprecated: module Core.Std
[since 2017-02] Use Core. The Std sub-module is no longer needed
File "runner.ml", line 3, characters 15-55:
Error: Unbound module Pa_bench_lib
Command exited with code 2.
Makefile:4: recipe for target 'all' failed
make: *** [all] Error 10
make: Leaving directory '/home/louis/.opam/4.03.1+bench/.opam-switch/build/core-micro-bench.1.0/core_micro'
Close

Error on conf-graphviz.0.1 (4.08.0+trunk+flambda+opt+bench)

Command:

/usr/bin/which dot

Output


Close

Error on conf-graphviz.0.1 (4.08.0+trunk+flambda+oclassic+bench)

Command:

/usr/bin/which dot

Output


Close

Error on conf-graphviz.0.1 (4.08.0+trunk+flambda+bench)

Command:

/usr/bin/which dot

Output


Close

Error on conf-graphviz.0.1 (4.08.0+trunk+bench)

Command:

/usr/bin/which dot

Output


Close

Error on conf-graphviz.0.1 (4.08.0+mutmatch+bench)

Command:

/usr/bin/which dot

Output


Close

Error on conf-graphviz.0.1 (4.08.0+gpr2165+bench)

Command:

/usr/bin/which dot

Output


Close

Error on conf-graphviz.0.1 (4.07.1+oclassic+bench)

Command:

/usr/bin/which dot

Output


Close

Error on conf-graphviz.0.1 (4.07.1+flambda+bench)

Command:

/usr/bin/which dot

Output


Close

Error on conf-graphviz.0.1 (4.07.1+clambda+bench)

Command:

/usr/bin/which dot

Output


Close

Error on conf-graphviz.0.1 (4.06.1+flambda+opt+bench)

Command:

/usr/bin/which dot

Output


Close

Error on conf-graphviz.0.1 (4.06.1+flambda+bench)

Command:

/usr/bin/which dot

Output


Close

Error on conf-graphviz.0.1 (4.05.0+flambda+opt+bench)

Command:

/usr/bin/which dot

Output


Close

Error on conf-graphviz.0.1 (4.03.1+bench)

Command:

/usr/bin/which dot

Output


Close

Error on cohttp-bench.1.0 (4.07.1+oclassic+bench)

Command:

/usr/bin/make -C cohttp

Output

make: Entering directory '/home/louis/.opam/4.07.1+oclassic+bench/.opam-switch/build/cohttp-bench.1.0/cohttp'
ocamlbuild -use-ocamlfind cohttp_lwt_bench.native cohttp_async_bench.native
ocamlfind ocamldep -package lwt.unix -package cohttp.lwt -modules cohttp_lwt_bench.ml > cohttp_lwt_bench.ml.depends
+ ocamlfind ocamldep -package lwt.unix -package cohttp.lwt -modules cohttp_lwt_bench.ml > cohttp_lwt_bench.ml.depends
ocamlfind: Package `cohttp.lwt' not found
Command exited with code 2.
Makefile:6: recipe for target 'all' failed
make: *** [all] Error 10
make: Leaving directory '/home/louis/.opam/4.07.1+oclassic+bench/.opam-switch/build/cohttp-bench.1.0/cohttp'
make: Entering directory '/home/louis/.opam/4.07.1+oclassic+bench/.opam-switch/build/cohttp-bench.1.0/cohttp'
ocamlbuild -use-ocamlfind cohttp_lwt_bench.native cohttp_async_bench.native
ocamlfind ocamldep -package lwt.unix -package cohttp.lwt -modules cohttp_lwt_bench.ml > cohttp_lwt_bench.ml.depends
+ ocamlfind ocamldep -package lwt.unix -package cohttp.lwt -modules cohttp_lwt_bench.ml > cohttp_lwt_bench.ml.depends
ocamlfind: Package `cohttp.lwt' not found
Command exited with code 2.
Makefile:6: recipe for target 'all' failed
make: *** [all] Error 10
make: Leaving directory '/home/louis/.opam/4.07.1+oclassic+bench/.opam-switch/build/cohttp-bench.1.0/cohttp'
Close

Error on cohttp-bench.1.0 (4.07.1+flambda+bench)

Command:

/usr/bin/make -C cohttp

Output

make: Entering directory '/home/louis/.opam/4.07.1+clambda+bench/.opam-switch/build/cohttp-bench.1.0/cohttp'
ocamlbuild -use-ocamlfind cohttp_lwt_bench.native cohttp_async_bench.native
ocamlfind ocamldep -package lwt.unix -package cohttp.lwt -modules cohttp_lwt_bench.ml > cohttp_lwt_bench.ml.depends
+ ocamlfind ocamldep -package lwt.unix -package cohttp.lwt -modules cohttp_lwt_bench.ml > cohttp_lwt_bench.ml.depends
ocamlfind: Package `cohttp-lwt-unix' not found - required by `cohttp.lwt'
Command exited with code 2.
Makefile:6: recipe for target 'all' failed
make: *** [all] Error 10
make: Leaving directory '/home/louis/.opam/4.07.1+clambda+bench/.opam-switch/build/cohttp-bench.1.0/cohttp'
make: Entering directory '/home/louis/.opam/4.07.1+flambda+bench/.opam-switch/build/cohttp-bench.1.0/cohttp'
ocamlbuild -use-ocamlfind cohttp_lwt_bench.native cohttp_async_bench.native
ocamlfind ocamldep -package lwt.unix -package cohttp.lwt -modules cohttp_lwt_bench.ml > cohttp_lwt_bench.ml.depends
+ ocamlfind ocamldep -package lwt.unix -package cohttp.lwt -modules cohttp_lwt_bench.ml > cohttp_lwt_bench.ml.depends
ocamlfind: Package `cohttp.lwt' not found
Command exited with code 2.
Makefile:6: recipe for target 'all' failed
make: *** [all] Error 10
make: Leaving directory '/home/louis/.opam/4.07.1+flambda+bench/.opam-switch/build/cohttp-bench.1.0/cohttp'
Close

Error on cohttp-bench.1.0 (4.07.1+clambda+bench)

Command:

/usr/bin/make -C cohttp

Output

make: Entering directory '/home/louis/.opam/4.07.1+clambda+bench/.opam-switch/build/cohttp-bench.1.0/cohttp'
ocamlbuild -use-ocamlfind cohttp_lwt_bench.native cohttp_async_bench.native
ocamlfind ocamldep -package lwt.unix -package cohttp.lwt -modules cohttp_lwt_bench.ml > cohttp_lwt_bench.ml.depends
+ ocamlfind ocamldep -package lwt.unix -package cohttp.lwt -modules cohttp_lwt_bench.ml > cohttp_lwt_bench.ml.depends
ocamlfind: Package `cohttp.lwt' not found
Command exited with code 2.
Makefile:6: recipe for target 'all' failed
make: *** [all] Error 10
make: Leaving directory '/home/louis/.opam/4.07.1+clambda+bench/.opam-switch/build/cohttp-bench.1.0/cohttp'
Close

Error on cohttp-bench.1.0 (4.03.1+bench)

Command:

/usr/bin/make -C cohttp

Output

make: Entering directory '/home/louis/.opam/4.03.1+bench/.opam-switch/build/cohttp-bench.1.0/cohttp'
ocamlbuild -use-ocamlfind cohttp_lwt_bench.native cohttp_async_bench.native
ocamlfind ocamldep -package lwt.unix -package cohttp.lwt -modules cohttp_lwt_bench.ml > cohttp_lwt_bench.ml.depends
+ ocamlfind ocamldep -package lwt.unix -package cohttp.lwt -modules cohttp_lwt_bench.ml > cohttp_lwt_bench.ml.depends
ocamlfind: Package `cohttp-lwt-unix' not found - required by `cohttp.lwt'
Command exited with code 2.
Makefile:6: recipe for target 'all' failed
make: *** [all] Error 10
make: Leaving directory '/home/louis/.opam/4.03.1+bench/.opam-switch/build/cohttp-bench.1.0/cohttp'
Close

Error on chameneos-bench.1.0 (4.07.1+oclassic+bench)

Command:

/usr/bin/make -C chameneos-redux

Output

make: Entering directory '/home/louis/.opam/4.07.1+oclassic+bench/.opam-switch/build/chameneos-bench.1.0/chameneos-redux'
ocamlopt -bin-annot -thread unix.cmxa threads.cmxa chameneos_redux_th.ml -o chameneos_redux_th
ocamlopt -bin-annot -thread unix.cmxa threads.cmxa chameneos_redux_evtchn.ml -o chameneos_redux_evtchn
ocamlfind ocamlopt -bin-annot -package lwt.unix -linkpkg chameneos_redux_lwt.ml -o chameneos_redux_lwt
ocamlfind: [WARNING] Package `threads': Linking problems may arise because of the missing -thread or -vmthread switch
ocamlfind ocamlopt -bin-annot  -thread -package async -linkpkg chameneos_redux_async.ml -o chameneos_redux_async
File "chameneos_redux_async.ml", line 7, characters 5-13:
Warning 3: deprecated: module Core.Std
[since 2017-02] Use Core. The Std sub-module is no longer needed
File "chameneos_redux_async.ml", line 8, characters 5-14:
Error: Unbound module Async.Std
Makefile:9: recipe for target 'chameneos_redux_async' failed
make: *** [chameneos_redux_async] Error 2
make: Leaving directory '/home/louis/.opam/4.07.1+oclassic+bench/.opam-switch/build/chameneos-bench.1.0/chameneos-redux'
make: Entering directory '/home/louis/.opam/4.07.1+oclassic+bench/.opam-switch/build/chameneos-bench.1.0/chameneos-redux'
ocamlopt -bin-annot -thread unix.cmxa threads.cmxa chameneos_redux_th.ml -o chameneos_redux_th
ocamlopt -bin-annot -thread unix.cmxa threads.cmxa chameneos_redux_evtchn.ml -o chameneos_redux_evtchn
ocamlfind ocamlopt -bin-annot -package lwt.unix -linkpkg chameneos_redux_lwt.ml -o chameneos_redux_lwt
ocamlfind: [WARNING] Package `threads': Linking problems may arise because of the missing -thread or -vmthread switch
ocamlfind ocamlopt -bin-annot  -thread -package async -linkpkg chameneos_redux_async.ml -o chameneos_redux_async
File "chameneos_redux_async.ml", line 7, characters 5-13:
Warning 3: deprecated: module Core.Std
[since 2017-02] Use Core. The Std sub-module is no longer needed
File "chameneos_redux_async.ml", line 8, characters 5-14:
Error: Unbound module Async.Std
Makefile:9: recipe for target 'chameneos_redux_async' failed
make: *** [chameneos_redux_async] Error 2
make: Leaving directory '/home/louis/.opam/4.07.1+oclassic+bench/.opam-switch/build/chameneos-bench.1.0/chameneos-redux'
Close

Error on chameneos-bench.1.0 (4.07.1+flambda+bench)

Command:

/usr/bin/make -C chameneos-redux

Output

make: Entering directory '/home/louis/.opam/4.07.1+clambda+bench/.opam-switch/build/chameneos-bench.1.0/chameneos-redux'
ocamlopt -bin-annot -thread unix.cmxa threads.cmxa chameneos_redux_th.ml -o chameneos_redux_th
ocamlopt -bin-annot -thread unix.cmxa threads.cmxa chameneos_redux_evtchn.ml -o chameneos_redux_evtchn
ocamlfind ocamlopt -bin-annot -package lwt.unix -linkpkg chameneos_redux_lwt.ml -o chameneos_redux_lwt
ocamlfind: [WARNING] Package `threads': Linking problems may arise because of the missing -thread or -vmthread switch
ocamlfind ocamlopt -bin-annot  -thread -package async -linkpkg chameneos_redux_async.ml -o chameneos_redux_async
File "chameneos_redux_async.ml", line 7, characters 5-13:
Warning 3: deprecated: module Core.Std
[since 2017-02] Use Core. The Std sub-module is no longer needed
File "chameneos_redux_async.ml", line 8, characters 5-14:
Error: Unbound module Async.Std
Makefile:9: recipe for target 'chameneos_redux_async' failed
make: *** [chameneos_redux_async] Error 2
make: Leaving directory '/home/louis/.opam/4.07.1+clambda+bench/.opam-switch/build/chameneos-bench.1.0/chameneos-redux'
make: Entering directory '/home/louis/.opam/4.07.1+flambda+bench/.opam-switch/build/chameneos-bench.1.0/chameneos-redux'
ocamlopt -bin-annot -thread unix.cmxa threads.cmxa chameneos_redux_th.ml -o chameneos_redux_th
ocamlopt -bin-annot -thread unix.cmxa threads.cmxa chameneos_redux_evtchn.ml -o chameneos_redux_evtchn
ocamlfind ocamlopt -bin-annot -package lwt.unix -linkpkg chameneos_redux_lwt.ml -o chameneos_redux_lwt
ocamlfind: [WARNING] Package `threads': Linking problems may arise because of the missing -thread or -vmthread switch
ocamlfind ocamlopt -bin-annot  -thread -package async -linkpkg chameneos_redux_async.ml -o chameneos_redux_async
File "chameneos_redux_async.ml", line 7, characters 5-13:
Warning 3: deprecated: module Core.Std
[since 2017-02] Use Core. The Std sub-module is no longer needed
File "chameneos_redux_async.ml", line 8, characters 5-14:
Error: Unbound module Async.Std
Makefile:9: recipe for target 'chameneos_redux_async' failed
make: *** [chameneos_redux_async] Error 2
make: Leaving directory '/home/louis/.opam/4.07.1+flambda+bench/.opam-switch/build/chameneos-bench.1.0/chameneos-redux'
Close

Error on chameneos-bench.1.0 (4.07.1+clambda+bench)

Command:

/usr/bin/make -C chameneos-redux

Output

make: Entering directory '/home/louis/.opam/4.07.1+clambda+bench/.opam-switch/build/chameneos-bench.1.0/chameneos-redux'
ocamlopt -bin-annot -thread unix.cmxa threads.cmxa chameneos_redux_th.ml -o chameneos_redux_th
ocamlopt -bin-annot -thread unix.cmxa threads.cmxa chameneos_redux_evtchn.ml -o chameneos_redux_evtchn
ocamlfind ocamlopt -bin-annot -package lwt.unix -linkpkg chameneos_redux_lwt.ml -o chameneos_redux_lwt
ocamlfind: [WARNING] Package `threads': Linking problems may arise because of the missing -thread or -vmthread switch
ocamlfind ocamlopt -bin-annot  -thread -package async -linkpkg chameneos_redux_async.ml -o chameneos_redux_async
File "chameneos_redux_async.ml", line 7, characters 5-13:
Warning 3: deprecated: module Core.Std
[since 2017-02] Use Core. The Std sub-module is no longer needed
File "chameneos_redux_async.ml", line 8, characters 5-14:
Error: Unbound module Async.Std
Makefile:9: recipe for target 'chameneos_redux_async' failed
make: *** [chameneos_redux_async] Error 2
make: Leaving directory '/home/louis/.opam/4.07.1+clambda+bench/.opam-switch/build/chameneos-bench.1.0/chameneos-redux'
Close

Error on chameneos-bench.1.0 (4.03.1+bench)

Command:

/usr/bin/make -C chameneos-redux

Output

make: Entering directory '/home/louis/.opam/4.03.1+bench/.opam-switch/build/chameneos-bench.1.0/chameneos-redux'
ocamlopt -bin-annot -thread unix.cmxa threads.cmxa chameneos_redux_th.ml -o chameneos_redux_th
ocamlopt -bin-annot -thread unix.cmxa threads.cmxa chameneos_redux_evtchn.ml -o chameneos_redux_evtchn
ocamlfind ocamlopt -bin-annot -package lwt.unix -linkpkg chameneos_redux_lwt.ml -o chameneos_redux_lwt
ocamlfind: [WARNING] Package `threads': Linking problems may arise because of the missing -thread or -vmthread switch
ocamlfind ocamlopt -bin-annot  -thread -package async -linkpkg chameneos_redux_async.ml -o chameneos_redux_async
File "chameneos_redux_async.ml", line 7, characters 5-13:
Warning 3: deprecated: module Core.Std
[since 2017-02] Use Core. The Std sub-module is no longer needed
File "chameneos_redux_async.ml", line 8, characters 5-14:
Warning 3: deprecated: module Async.Std
[since 2017-02] use Async. The Std sub-module is no longer needed
File "chameneos_redux_async.ml", line 128, characters 10-16:
Error: This expression has type
         [> `Probably_should_not_use_blocking_Core_Printf_functions_with_Async ]
       This is not a function; it cannot be applied.
Makefile:9: recipe for target 'chameneos_redux_async' failed
make: *** [chameneos_redux_async] Error 2
make: Leaving directory '/home/louis/.opam/4.03.1+bench/.opam-switch/build/chameneos-bench.1.0/chameneos-redux'
Close

Error on camlpdf.1.7.1 (4.08.0+mutmatch+bench)

Command:

/usr/bin/make

Output

make[1]: Entering directory '/home/louis/.opam/4.08.0+mutmatch+bench/.opam-switch/build/camlpdf.1.7.1'
ocamlfind ocamldep -native pdfmerge.mli > ._ncdi/pdfmerge.di
ocamlfind ocamldep -native pdftype0.mli > ._ncdi/pdftype0.di
ocamlfind ocamldep -native pdftruetype.mli > ._ncdi/pdftruetype.di
ocamlfind ocamldep -native pdftype1.mli > ._ncdi/pdftype1.di
ocamlfind ocamldep -native pdfcff.mli > ._ncdi/pdfcff.di
ocamlfind ocamldep -native pdfocg.mli > ._ncdi/pdfocg.di
ocamlfind ocamldep -native pdfdate.mli > ._ncdi/pdfdate.di
ocamlfind ocamldep -native pdfshapes.mli > ._ncdi/pdfshapes.di
ocamlfind ocamldep -native pdfgraphics.mli > ._ncdi/pdfgraphics.di
ocamlfind ocamldep -native pdfstandard14.mli > ._ncdi/pdfstandard14.di
ocamlfind ocamldep -native pdftext.mli > ._ncdi/pdftext.di
ocamlfind ocamldep -native pdfglyphlist.mli > ._ncdi/pdfglyphlist.di
ocamlfind ocamldep -native pdfafmdata.mli > ._ncdi/pdfafmdata.di
ocamlfind ocamldep -native pdfafm.mli > ._ncdi/pdfafm.di
ocamlfind ocamldep -native pdfimage.mli > ._ncdi/pdfimage.di
ocamlfind ocamldep -native pdfspace.mli > ._ncdi/pdfspace.di
ocamlfind ocamldep -native pdffun.mli > ._ncdi/pdffun.di
ocamlfind ocamldep -native pdfannot.mli > ._ncdi/pdfannot.di
ocamlfind ocamldep -native pdfpage.mli > ._ncdi/pdfpage.di
ocamlfind ocamldep -native pdfpagelabels.mli > ._ncdi/pdfpagelabels.di
ocamlfind ocamldep -native pdfmarks.mli > ._ncdi/pdfmarks.di
ocamlfind ocamldep -native pdfdest.mli > ._ncdi/pdfdest.di
ocamlfind ocamldep -native pdfops.mli > ._ncdi/pdfops.di
ocamlfind ocamldep -native pdfjpeg.mli > ._ncdi/pdfjpeg.di
ocamlfind ocamldep -native pdfread.mli > ._ncdi/pdfread.di
ocamlfind ocamldep -native pdfgenlex.mli > ._ncdi/pdfgenlex.di
ocamlfind ocamldep -native pdfwrite.mli > ._ncdi/pdfwrite.di
ocamlfind ocamldep -native pdfcodec.mli > ._ncdi/pdfcodec.di
ocamlfind ocamldep -native pdfflate.mli > ._ncdi/pdfflate.di
ocamlfind ocamldep -native pdfcrypt.mli > ._ncdi/pdfcrypt.di
ocamlfind ocamldep -native pdf.mli > ._ncdi/pdf.di
ocamlfind ocamldep -native pdfpaper.mli > ._ncdi/pdfpaper.di
ocamlfind ocamldep -native pdfunits.mli > ._ncdi/pdfunits.di
ocamlfind ocamldep -native pdftransform.mli > ._ncdi/pdftransform.di
ocamlfind ocamldep -native pdfio.mli > ._ncdi/pdfio.di
ocamlfind ocamldep -native pdfutil.mli > ._ncdi/pdfutil.di
ocamlfind ocamldep pdfmerge.ml > ._d/pdfmerge.d
ocamlfind ocamldep pdftype0.ml > ._d/pdftype0.d
ocamlfind ocamldep pdftruetype.ml > ._d/pdftruetype.d
ocamlfind ocamldep pdftype1.ml > ._d/pdftype1.d
ocamlfind ocamldep pdfcff.ml > ._d/pdfcff.d
ocamlfind ocamldep pdfocg.ml > ._d/pdfocg.d
ocamlfind ocamldep pdfdate.ml > ._d/pdfdate.d
ocamlfind ocamldep pdfshapes.ml > ._d/pdfshapes.d
ocamlfind ocamldep pdfgraphics.ml > ._d/pdfgraphics.d
ocamlfind ocamldep pdfstandard14.ml > ._d/pdfstandard14.d
ocamlfind ocamldep pdftext.ml > ._d/pdftext.d
ocamlfind ocamldep pdfglyphlist.ml > ._d/pdfglyphlist.d
ocamlfind ocamldep pdfafmdata.ml > ._d/pdfafmdata.d
ocamlfind ocamldep pdfafm.ml > ._d/pdfafm.d
ocamlfind ocamldep pdfimage.ml > ._d/pdfimage.d
ocamlfind ocamldep pdfspace.ml > ._d/pdfspace.d
ocamlfind ocamldep pdffun.ml > ._d/pdffun.d
ocamlfind ocamldep pdfannot.ml > ._d/pdfannot.d
ocamlfind ocamldep pdfpage.ml > ._d/pdfpage.d
ocamlfind ocamldep pdfpagelabels.ml > ._d/pdfpagelabels.d
ocamlfind ocamldep pdfmarks.ml > ._d/pdfmarks.d
ocamlfind ocamldep pdfdest.ml > ._d/pdfdest.d
ocamlfind ocamldep pdfops.ml > ._d/pdfops.d
ocamlfind ocamldep pdfjpeg.ml > ._d/pdfjpeg.d
ocamlfind ocamldep pdfread.ml > ._d/pdfread.d
ocamlfind ocamldep pdfgenlex.ml > ._d/pdfgenlex.d
ocamlfind ocamldep pdfwrite.ml > ._d/pdfwrite.d
ocamlfind ocamldep pdfcodec.ml > ._d/pdfcodec.d
ocamlfind ocamldep pdfflate.ml > ._d/pdfflate.d
ocamlfind ocamldep pdfcrypt.ml > ._d/pdfcrypt.d
ocamlfind ocamldep pdf.ml > ._d/pdf.d
ocamlfind ocamldep pdfpaper.ml > ._d/pdfpaper.d
ocamlfind ocamldep pdfunits.ml > ._d/pdfunits.d
ocamlfind ocamldep pdftransform.ml > ._d/pdftransform.d
ocamlfind ocamldep pdfio.ml > ._d/pdfio.d
ocamlfind ocamldep pdfutil.ml > ._d/pdfutil.d
ocamlc -c -cc "cc" -ccopt "-fPIC  \
			-DPIC -DNATIVE_CODE   \
			    -o flatestubs.o " flatestubs.c
flatestubs.c: In function ‘camlzip_update_crc32’:
flatestubs.c:173:28: error: ‘uint32’ undeclared (first use in this function)
   return copy_int32(crc32((uint32) Int32_val(crc), 
                            ^
flatestubs.c:173:28: note: each undeclared identifier is reported only once for each function it appears in
In file included from flatestubs.c:20:0:
At top level:
miniz.c:2440:28: warning: always_inline function might not be inlinable [-Wattributes]
 static MZ_FORCEINLINE void tdefl_record_match(tdefl_compressor *d, mz_uint match_len, mz_uint match_dist)
                            ^
miniz.c:2432:28: warning: always_inline function might not be inlinable [-Wattributes]
 static MZ_FORCEINLINE void tdefl_record_literal(tdefl_compressor *d, mz_uint8 lit)
                            ^
miniz.c:2230:28: warning: always_inline function might not be inlinable [-Wattributes]
 static MZ_FORCEINLINE void tdefl_find_match(tdefl_compressor *d, mz_uint lookahead_pos, mz_uint max_dist, mz_uint max_match_len, mz_uint *pMatch_dist, mz_uint *pMatch_len)
                            ^
OCamlMakefile:1132: recipe for target 'flatestubs.o' failed
make[1]: *** [flatestubs.o] Error 2
make[1]: Leaving directory '/home/louis/.opam/4.08.0+mutmatch+bench/.opam-switch/build/camlpdf.1.7.1'
OCamlMakefile:801: recipe for target 'native-code-library' failed
make: *** [native-code-library] Error 2
Close

Error on camlpdf.1.7.1 (4.08.0+gpr2165+bench)

Command:

/usr/bin/make

Output

make[1]: Entering directory '/home/louis/.opam/4.08.0+gpr2165+bench/.opam-switch/build/camlpdf.1.7.1'
ocamlfind ocamldep -native pdfmerge.mli > ._ncdi/pdfmerge.di
ocamlfind ocamldep -native pdftype0.mli > ._ncdi/pdftype0.di
ocamlfind ocamldep -native pdftruetype.mli > ._ncdi/pdftruetype.di
ocamlfind ocamldep -native pdftype1.mli > ._ncdi/pdftype1.di
ocamlfind ocamldep -native pdfcff.mli > ._ncdi/pdfcff.di
ocamlfind ocamldep -native pdfocg.mli > ._ncdi/pdfocg.di
ocamlfind ocamldep -native pdfdate.mli > ._ncdi/pdfdate.di
ocamlfind ocamldep -native pdfshapes.mli > ._ncdi/pdfshapes.di
ocamlfind ocamldep -native pdfgraphics.mli > ._ncdi/pdfgraphics.di
ocamlfind ocamldep -native pdfstandard14.mli > ._ncdi/pdfstandard14.di
ocamlfind ocamldep -native pdftext.mli > ._ncdi/pdftext.di
ocamlfind ocamldep -native pdfglyphlist.mli > ._ncdi/pdfglyphlist.di
ocamlfind ocamldep -native pdfafmdata.mli > ._ncdi/pdfafmdata.di
ocamlfind ocamldep -native pdfafm.mli > ._ncdi/pdfafm.di
ocamlfind ocamldep -native pdfimage.mli > ._ncdi/pdfimage.di
ocamlfind ocamldep -native pdfspace.mli > ._ncdi/pdfspace.di
ocamlfind ocamldep -native pdffun.mli > ._ncdi/pdffun.di
ocamlfind ocamldep -native pdfannot.mli > ._ncdi/pdfannot.di
ocamlfind ocamldep -native pdfpage.mli > ._ncdi/pdfpage.di
ocamlfind ocamldep -native pdfpagelabels.mli > ._ncdi/pdfpagelabels.di
ocamlfind ocamldep -native pdfmarks.mli > ._ncdi/pdfmarks.di
ocamlfind ocamldep -native pdfdest.mli > ._ncdi/pdfdest.di
ocamlfind ocamldep -native pdfops.mli > ._ncdi/pdfops.di
ocamlfind ocamldep -native pdfjpeg.mli > ._ncdi/pdfjpeg.di
ocamlfind ocamldep -native pdfread.mli > ._ncdi/pdfread.di
ocamlfind ocamldep -native pdfgenlex.mli > ._ncdi/pdfgenlex.di
ocamlfind ocamldep -native pdfwrite.mli > ._ncdi/pdfwrite.di
ocamlfind ocamldep -native pdfcodec.mli > ._ncdi/pdfcodec.di
ocamlfind ocamldep -native pdfflate.mli > ._ncdi/pdfflate.di
ocamlfind ocamldep -native pdfcrypt.mli > ._ncdi/pdfcrypt.di
ocamlfind ocamldep -native pdf.mli > ._ncdi/pdf.di
ocamlfind ocamldep -native pdfpaper.mli > ._ncdi/pdfpaper.di
ocamlfind ocamldep -native pdfunits.mli > ._ncdi/pdfunits.di
ocamlfind ocamldep -native pdftransform.mli > ._ncdi/pdftransform.di
ocamlfind ocamldep -native pdfio.mli > ._ncdi/pdfio.di
ocamlfind ocamldep -native pdfutil.mli > ._ncdi/pdfutil.di
ocamlfind ocamldep pdfmerge.ml > ._d/pdfmerge.d
ocamlfind ocamldep pdftype0.ml > ._d/pdftype0.d
ocamlfind ocamldep pdftruetype.ml > ._d/pdftruetype.d
ocamlfind ocamldep pdftype1.ml > ._d/pdftype1.d
ocamlfind ocamldep pdfcff.ml > ._d/pdfcff.d
ocamlfind ocamldep pdfocg.ml > ._d/pdfocg.d
ocamlfind ocamldep pdfdate.ml > ._d/pdfdate.d
ocamlfind ocamldep pdfshapes.ml > ._d/pdfshapes.d
ocamlfind ocamldep pdfgraphics.ml > ._d/pdfgraphics.d
ocamlfind ocamldep pdfstandard14.ml > ._d/pdfstandard14.d
ocamlfind ocamldep pdftext.ml > ._d/pdftext.d
ocamlfind ocamldep pdfglyphlist.ml > ._d/pdfglyphlist.d
ocamlfind ocamldep pdfafmdata.ml > ._d/pdfafmdata.d
ocamlfind ocamldep pdfafm.ml > ._d/pdfafm.d
ocamlfind ocamldep pdfimage.ml > ._d/pdfimage.d
ocamlfind ocamldep pdfspace.ml > ._d/pdfspace.d
ocamlfind ocamldep pdffun.ml > ._d/pdffun.d
ocamlfind ocamldep pdfannot.ml > ._d/pdfannot.d
ocamlfind ocamldep pdfpage.ml > ._d/pdfpage.d
ocamlfind ocamldep pdfpagelabels.ml > ._d/pdfpagelabels.d
ocamlfind ocamldep pdfmarks.ml > ._d/pdfmarks.d
ocamlfind ocamldep pdfdest.ml > ._d/pdfdest.d
ocamlfind ocamldep pdfops.ml > ._d/pdfops.d
ocamlfind ocamldep pdfjpeg.ml > ._d/pdfjpeg.d
ocamlfind ocamldep pdfread.ml > ._d/pdfread.d
ocamlfind ocamldep pdfgenlex.ml > ._d/pdfgenlex.d
ocamlfind ocamldep pdfwrite.ml > ._d/pdfwrite.d
ocamlfind ocamldep pdfcodec.ml > ._d/pdfcodec.d
ocamlfind ocamldep pdfflate.ml > ._d/pdfflate.d
ocamlfind ocamldep pdfcrypt.ml > ._d/pdfcrypt.d
ocamlfind ocamldep pdf.ml > ._d/pdf.d
ocamlfind ocamldep pdfpaper.ml > ._d/pdfpaper.d
ocamlfind ocamldep pdfunits.ml > ._d/pdfunits.d
ocamlfind ocamldep pdftransform.ml > ._d/pdftransform.d
ocamlfind ocamldep pdfio.ml > ._d/pdfio.d
ocamlfind ocamldep pdfutil.ml > ._d/pdfutil.d
ocamlc -c -cc "cc" -ccopt "-fPIC  \
			-DPIC -DNATIVE_CODE   \
			    -o flatestubs.o " flatestubs.c
flatestubs.c: In function ‘camlzip_update_crc32’:
flatestubs.c:173:28: error: ‘uint32’ undeclared (first use in this function)
   return copy_int32(crc32((uint32) Int32_val(crc), 
                            ^
flatestubs.c:173:28: note: each undeclared identifier is reported only once for each function it appears in
In file included from flatestubs.c:20:0:
At top level:
miniz.c:2440:28: warning: always_inline function might not be inlinable [-Wattributes]
 static MZ_FORCEINLINE void tdefl_record_match(tdefl_compressor *d, mz_uint match_len, mz_uint match_dist)
                            ^
miniz.c:2432:28: warning: always_inline function might not be inlinable [-Wattributes]
 static MZ_FORCEINLINE void tdefl_record_literal(tdefl_compressor *d, mz_uint8 lit)
                            ^
miniz.c:2230:28: warning: always_inline function might not be inlinable [-Wattributes]
 static MZ_FORCEINLINE void tdefl_find_match(tdefl_compressor *d, mz_uint lookahead_pos, mz_uint max_dist, mz_uint max_match_len, mz_uint *pMatch_dist, mz_uint *pMatch_len)
                            ^
OCamlMakefile:1132: recipe for target 'flatestubs.o' failed
make[1]: *** [flatestubs.o] Error 2
make[1]: Leaving directory '/home/louis/.opam/4.08.0+gpr2165+bench/.opam-switch/build/camlpdf.1.7.1'
OCamlMakefile:801: recipe for target 'native-code-library' failed
make: *** [native-code-library] Error 2
Close

Error on camlpdf.1.7.1 (4.07.1+oclassic+bench)

Command:

/usr/bin/make

Output

make[1]: Entering directory '/home/louis/.opam/4.07.1+oclassic+bench/.opam-switch/build/camlpdf.1.7.1'
ocamlfind ocamldep -native pdfmerge.mli > ._ncdi/pdfmerge.di
ocamlfind ocamldep -native pdftype0.mli > ._ncdi/pdftype0.di
ocamlfind ocamldep -native pdftruetype.mli > ._ncdi/pdftruetype.di
ocamlfind ocamldep -native pdftype1.mli > ._ncdi/pdftype1.di
ocamlfind ocamldep -native pdfcff.mli > ._ncdi/pdfcff.di
ocamlfind ocamldep -native pdfocg.mli > ._ncdi/pdfocg.di
ocamlfind ocamldep -native pdfdate.mli > ._ncdi/pdfdate.di
ocamlfind ocamldep -native pdfshapes.mli > ._ncdi/pdfshapes.di
ocamlfind ocamldep -native pdfgraphics.mli > ._ncdi/pdfgraphics.di
ocamlfind ocamldep -native pdfstandard14.mli > ._ncdi/pdfstandard14.di
ocamlfind ocamldep -native pdftext.mli > ._ncdi/pdftext.di
ocamlfind ocamldep -native pdfglyphlist.mli > ._ncdi/pdfglyphlist.di
ocamlfind ocamldep -native pdfafmdata.mli > ._ncdi/pdfafmdata.di
ocamlfind ocamldep -native pdfafm.mli > ._ncdi/pdfafm.di
ocamlfind ocamldep -native pdfimage.mli > ._ncdi/pdfimage.di
ocamlfind ocamldep -native pdfspace.mli > ._ncdi/pdfspace.di
ocamlfind ocamldep -native pdffun.mli > ._ncdi/pdffun.di
ocamlfind ocamldep -native pdfannot.mli > ._ncdi/pdfannot.di
ocamlfind ocamldep -native pdfpage.mli > ._ncdi/pdfpage.di
ocamlfind ocamldep -native pdfpagelabels.mli > ._ncdi/pdfpagelabels.di
ocamlfind ocamldep -native pdfmarks.mli > ._ncdi/pdfmarks.di
ocamlfind ocamldep -native pdfdest.mli > ._ncdi/pdfdest.di
ocamlfind ocamldep -native pdfops.mli > ._ncdi/pdfops.di
ocamlfind ocamldep -native pdfjpeg.mli > ._ncdi/pdfjpeg.di
ocamlfind ocamldep -native pdfread.mli > ._ncdi/pdfread.di
ocamlfind ocamldep -native pdfgenlex.mli > ._ncdi/pdfgenlex.di
ocamlfind ocamldep -native pdfwrite.mli > ._ncdi/pdfwrite.di
ocamlfind ocamldep -native pdfcodec.mli > ._ncdi/pdfcodec.di
ocamlfind ocamldep -native pdfflate.mli > ._ncdi/pdfflate.di
ocamlfind ocamldep -native pdfcrypt.mli > ._ncdi/pdfcrypt.di
ocamlfind ocamldep -native pdf.mli > ._ncdi/pdf.di
ocamlfind ocamldep -native pdfpaper.mli > ._ncdi/pdfpaper.di
ocamlfind ocamldep -native pdfunits.mli > ._ncdi/pdfunits.di
ocamlfind ocamldep -native pdftransform.mli > ._ncdi/pdftransform.di
ocamlfind ocamldep -native pdfio.mli > ._ncdi/pdfio.di
ocamlfind ocamldep -native pdfutil.mli > ._ncdi/pdfutil.di
ocamlfind ocamldep pdfmerge.ml > ._d/pdfmerge.d
ocamlfind ocamldep pdftype0.ml > ._d/pdftype0.d
ocamlfind ocamldep pdftruetype.ml > ._d/pdftruetype.d
ocamlfind ocamldep pdftype1.ml > ._d/pdftype1.d
ocamlfind ocamldep pdfcff.ml > ._d/pdfcff.d
ocamlfind ocamldep pdfocg.ml > ._d/pdfocg.d
ocamlfind ocamldep pdfdate.ml > ._d/pdfdate.d
ocamlfind ocamldep pdfshapes.ml > ._d/pdfshapes.d
ocamlfind ocamldep pdfgraphics.ml > ._d/pdfgraphics.d
ocamlfind ocamldep pdfstandard14.ml > ._d/pdfstandard14.d
ocamlfind ocamldep pdftext.ml > ._d/pdftext.d
ocamlfind ocamldep pdfglyphlist.ml > ._d/pdfglyphlist.d
ocamlfind ocamldep pdfafmdata.ml > ._d/pdfafmdata.d
ocamlfind ocamldep pdfafm.ml > ._d/pdfafm.d
ocamlfind ocamldep pdfimage.ml > ._d/pdfimage.d
ocamlfind ocamldep pdfspace.ml > ._d/pdfspace.d
ocamlfind ocamldep pdffun.ml > ._d/pdffun.d
ocamlfind ocamldep pdfannot.ml > ._d/pdfannot.d
ocamlfind ocamldep pdfpage.ml > ._d/pdfpage.d
ocamlfind ocamldep pdfpagelabels.ml > ._d/pdfpagelabels.d
ocamlfind ocamldep pdfmarks.ml > ._d/pdfmarks.d
ocamlfind ocamldep pdfdest.ml > ._d/pdfdest.d
ocamlfind ocamldep pdfops.ml > ._d/pdfops.d
ocamlfind ocamldep pdfjpeg.ml > ._d/pdfjpeg.d
ocamlfind ocamldep pdfread.ml > ._d/pdfread.d
ocamlfind ocamldep pdfgenlex.ml > ._d/pdfgenlex.d
ocamlfind ocamldep pdfwrite.ml > ._d/pdfwrite.d
ocamlfind ocamldep pdfcodec.ml > ._d/pdfcodec.d
ocamlfind ocamldep pdfflate.ml > ._d/pdfflate.d
ocamlfind ocamldep pdfcrypt.ml > ._d/pdfcrypt.d
ocamlfind ocamldep pdf.ml > ._d/pdf.d
ocamlfind ocamldep pdfpaper.ml > ._d/pdfpaper.d
ocamlfind ocamldep pdfunits.ml > ._d/pdfunits.d
ocamlfind ocamldep pdftransform.ml > ._d/pdftransform.d
ocamlfind ocamldep pdfio.ml > ._d/pdfio.d
ocamlfind ocamldep pdfutil.ml > ._d/pdfutil.d
ocamlc -c -cc "cc" -ccopt "-fPIC  \
			-DPIC -DNATIVE_CODE   \
			    -o flatestubs.o " flatestubs.c
flatestubs.c: In function ‘camlzip_update_crc32’:
flatestubs.c:173:28: error: ‘uint32’ undeclared (first use in this function)
   return copy_int32(crc32((uint32) Int32_val(crc), 
                            ^
flatestubs.c:173:28: note: each undeclared identifier is reported only once for each function it appears in
In file included from flatestubs.c:20:0:
At top level:
miniz.c:2440:28: warning: always_inline function might not be inlinable [-Wattributes]
 static MZ_FORCEINLINE void tdefl_record_match(tdefl_compressor *d, mz_uint match_len, mz_uint match_dist)
                            ^
miniz.c:2432:28: warning: always_inline function might not be inlinable [-Wattributes]
 static MZ_FORCEINLINE void tdefl_record_literal(tdefl_compressor *d, mz_uint8 lit)
                            ^
miniz.c:2230:28: warning: always_inline function might not be inlinable [-Wattributes]
 static MZ_FORCEINLINE void tdefl_find_match(tdefl_compressor *d, mz_uint lookahead_pos, mz_uint max_dist, mz_uint max_match_len, mz_uint *pMatch_dist, mz_uint *pMatch_len)
                            ^
OCamlMakefile:1132: recipe for target 'flatestubs.o' failed
make[1]: *** [flatestubs.o] Error 2
make[1]: Leaving directory '/home/louis/.opam/4.07.1+oclassic+bench/.opam-switch/build/camlpdf.1.7.1'
OCamlMakefile:801: recipe for target 'native-code-library' failed
make: *** [native-code-library] Error 2
make[1]: Entering directory '/home/louis/.opam/4.07.1+oclassic+bench/.opam-switch/build/camlpdf.1.7.1'
ocamlfind ocamldep -native pdfmerge.mli > ._ncdi/pdfmerge.di
ocamlfind ocamldep -native pdftype0.mli > ._ncdi/pdftype0.di
ocamlfind ocamldep -native pdftruetype.mli > ._ncdi/pdftruetype.di
ocamlfind ocamldep -native pdftype1.mli > ._ncdi/pdftype1.di
ocamlfind ocamldep -native pdfcff.mli > ._ncdi/pdfcff.di
ocamlfind ocamldep -native pdfocg.mli > ._ncdi/pdfocg.di
ocamlfind ocamldep -native pdfdate.mli > ._ncdi/pdfdate.di
ocamlfind ocamldep -native pdfshapes.mli > ._ncdi/pdfshapes.di
ocamlfind ocamldep -native pdfgraphics.mli > ._ncdi/pdfgraphics.di
ocamlfind ocamldep -native pdfstandard14.mli > ._ncdi/pdfstandard14.di
ocamlfind ocamldep -native pdftext.mli > ._ncdi/pdftext.di
ocamlfind ocamldep -native pdfglyphlist.mli > ._ncdi/pdfglyphlist.di
ocamlfind ocamldep -native pdfafmdata.mli > ._ncdi/pdfafmdata.di
ocamlfind ocamldep -native pdfafm.mli > ._ncdi/pdfafm.di
ocamlfind ocamldep -native pdfimage.mli > ._ncdi/pdfimage.di
ocamlfind ocamldep -native pdfspace.mli > ._ncdi/pdfspace.di
ocamlfind ocamldep -native pdffun.mli > ._ncdi/pdffun.di
ocamlfind ocamldep -native pdfannot.mli > ._ncdi/pdfannot.di
ocamlfind ocamldep -native pdfpage.mli > ._ncdi/pdfpage.di
ocamlfind ocamldep -native pdfpagelabels.mli > ._ncdi/pdfpagelabels.di
ocamlfind ocamldep -native pdfmarks.mli > ._ncdi/pdfmarks.di
ocamlfind ocamldep -native pdfdest.mli > ._ncdi/pdfdest.di
ocamlfind ocamldep -native pdfops.mli > ._ncdi/pdfops.di
ocamlfind ocamldep -native pdfjpeg.mli > ._ncdi/pdfjpeg.di
ocamlfind ocamldep -native pdfread.mli > ._ncdi/pdfread.di
ocamlfind ocamldep -native pdfgenlex.mli > ._ncdi/pdfgenlex.di
ocamlfind ocamldep -native pdfwrite.mli > ._ncdi/pdfwrite.di
ocamlfind ocamldep -native pdfcodec.mli > ._ncdi/pdfcodec.di
ocamlfind ocamldep -native pdfflate.mli > ._ncdi/pdfflate.di
ocamlfind ocamldep -native pdfcrypt.mli > ._ncdi/pdfcrypt.di
ocamlfind ocamldep -native pdf.mli > ._ncdi/pdf.di
ocamlfind ocamldep -native pdfpaper.mli > ._ncdi/pdfpaper.di
ocamlfind ocamldep -native pdfunits.mli > ._ncdi/pdfunits.di
ocamlfind ocamldep -native pdftransform.mli > ._ncdi/pdftransform.di
ocamlfind ocamldep -native pdfio.mli > ._ncdi/pdfio.di
ocamlfind ocamldep -native pdfutil.mli > ._ncdi/pdfutil.di
ocamlfind ocamldep pdfmerge.ml > ._d/pdfmerge.d
ocamlfind ocamldep pdftype0.ml > ._d/pdftype0.d
ocamlfind ocamldep pdftruetype.ml > ._d/pdftruetype.d
ocamlfind ocamldep pdftype1.ml > ._d/pdftype1.d
ocamlfind ocamldep pdfcff.ml > ._d/pdfcff.d
ocamlfind ocamldep pdfocg.ml > ._d/pdfocg.d
ocamlfind ocamldep pdfdate.ml > ._d/pdfdate.d
ocamlfind ocamldep pdfshapes.ml > ._d/pdfshapes.d
ocamlfind ocamldep pdfgraphics.ml > ._d/pdfgraphics.d
ocamlfind ocamldep pdfstandard14.ml > ._d/pdfstandard14.d
ocamlfind ocamldep pdftext.ml > ._d/pdftext.d
ocamlfind ocamldep pdfglyphlist.ml > ._d/pdfglyphlist.d
ocamlfind ocamldep pdfafmdata.ml > ._d/pdfafmdata.d
ocamlfind ocamldep pdfafm.ml > ._d/pdfafm.d
ocamlfind ocamldep pdfimage.ml > ._d/pdfimage.d
ocamlfind ocamldep pdfspace.ml > ._d/pdfspace.d
ocamlfind ocamldep pdffun.ml > ._d/pdffun.d
ocamlfind ocamldep pdfannot.ml > ._d/pdfannot.d
ocamlfind ocamldep pdfpage.ml > ._d/pdfpage.d
ocamlfind ocamldep pdfpagelabels.ml > ._d/pdfpagelabels.d
ocamlfind ocamldep pdfmarks.ml > ._d/pdfmarks.d
ocamlfind ocamldep pdfdest.ml > ._d/pdfdest.d
ocamlfind ocamldep pdfops.ml > ._d/pdfops.d
ocamlfind ocamldep pdfjpeg.ml > ._d/pdfjpeg.d
ocamlfind ocamldep pdfread.ml > ._d/pdfread.d
ocamlfind ocamldep pdfgenlex.ml > ._d/pdfgenlex.d
ocamlfind ocamldep pdfwrite.ml > ._d/pdfwrite.d
ocamlfind ocamldep pdfcodec.ml > ._d/pdfcodec.d
ocamlfind ocamldep pdfflate.ml > ._d/pdfflate.d
ocamlfind ocamldep pdfcrypt.ml > ._d/pdfcrypt.d
ocamlfind ocamldep pdf.ml > ._d/pdf.d
ocamlfind ocamldep pdfpaper.ml > ._d/pdfpaper.d
ocamlfind ocamldep pdfunits.ml > ._d/pdfunits.d
ocamlfind ocamldep pdftransform.ml > ._d/pdftransform.d
ocamlfind ocamldep pdfio.ml > ._d/pdfio.d
ocamlfind ocamldep pdfutil.ml > ._d/pdfutil.d
ocamlc -c -cc "cc" -ccopt "-fPIC  \
			-DPIC -DNATIVE_CODE   \
			    -o flatestubs.o " flatestubs.c
flatestubs.c: In function ‘camlzip_update_crc32’:
flatestubs.c:173:28: error: ‘uint32’ undeclared (first use in this function)
   return copy_int32(crc32((uint32) Int32_val(crc), 
                            ^
flatestubs.c:173:28: note: each undeclared identifier is reported only once for each function it appears in
In file included from flatestubs.c:20:0:
At top level:
miniz.c:2440:28: warning: always_inline function might not be inlinable [-Wattributes]
 static MZ_FORCEINLINE void tdefl_record_match(tdefl_compressor *d, mz_uint match_len, mz_uint match_dist)
                            ^
miniz.c:2432:28: warning: always_inline function might not be inlinable [-Wattributes]
 static MZ_FORCEINLINE void tdefl_record_literal(tdefl_compressor *d, mz_uint8 lit)
                            ^
miniz.c:2230:28: warning: always_inline function might not be inlinable [-Wattributes]
 static MZ_FORCEINLINE void tdefl_find_match(tdefl_compressor *d, mz_uint lookahead_pos, mz_uint max_dist, mz_uint max_match_len, mz_uint *pMatch_dist, mz_uint *pMatch_len)
                            ^
OCamlMakefile:1132: recipe for target 'flatestubs.o' failed
make[1]: *** [flatestubs.o] Error 2
make[1]: Leaving directory '/home/louis/.opam/4.07.1+oclassic+bench/.opam-switch/build/camlpdf.1.7.1'
OCamlMakefile:801: recipe for target 'native-code-library' failed
make: *** [native-code-library] Error 2
Close

Error on camlpdf.1.7.1 (4.07.1+flambda+bench)

Command:

/usr/bin/make

Output

make[1]: Entering directory '/home/louis/.opam/4.07.1+clambda+bench/.opam-switch/build/camlpdf.1.7.1'
ocamlfind ocamldep -native pdfmerge.mli > ._ncdi/pdfmerge.di
ocamlfind ocamldep -native pdftype0.mli > ._ncdi/pdftype0.di
ocamlfind ocamldep -native pdftruetype.mli > ._ncdi/pdftruetype.di
ocamlfind ocamldep -native pdftype1.mli > ._ncdi/pdftype1.di
ocamlfind ocamldep -native pdfcff.mli > ._ncdi/pdfcff.di
ocamlfind ocamldep -native pdfocg.mli > ._ncdi/pdfocg.di
ocamlfind ocamldep -native pdfdate.mli > ._ncdi/pdfdate.di
ocamlfind ocamldep -native pdfshapes.mli > ._ncdi/pdfshapes.di
ocamlfind ocamldep -native pdfgraphics.mli > ._ncdi/pdfgraphics.di
ocamlfind ocamldep -native pdfstandard14.mli > ._ncdi/pdfstandard14.di
ocamlfind ocamldep -native pdftext.mli > ._ncdi/pdftext.di
ocamlfind ocamldep -native pdfglyphlist.mli > ._ncdi/pdfglyphlist.di
ocamlfind ocamldep -native pdfafmdata.mli > ._ncdi/pdfafmdata.di
ocamlfind ocamldep -native pdfafm.mli > ._ncdi/pdfafm.di
ocamlfind ocamldep -native pdfimage.mli > ._ncdi/pdfimage.di
ocamlfind ocamldep -native pdfspace.mli > ._ncdi/pdfspace.di
ocamlfind ocamldep -native pdffun.mli > ._ncdi/pdffun.di
ocamlfind ocamldep -native pdfannot.mli > ._ncdi/pdfannot.di
ocamlfind ocamldep -native pdfpage.mli > ._ncdi/pdfpage.di
ocamlfind ocamldep -native pdfpagelabels.mli > ._ncdi/pdfpagelabels.di
ocamlfind ocamldep -native pdfmarks.mli > ._ncdi/pdfmarks.di
ocamlfind ocamldep -native pdfdest.mli > ._ncdi/pdfdest.di
ocamlfind ocamldep -native pdfops.mli > ._ncdi/pdfops.di
ocamlfind ocamldep -native pdfjpeg.mli > ._ncdi/pdfjpeg.di
ocamlfind ocamldep -native pdfread.mli > ._ncdi/pdfread.di
ocamlfind ocamldep -native pdfgenlex.mli > ._ncdi/pdfgenlex.di
ocamlfind ocamldep -native pdfwrite.mli > ._ncdi/pdfwrite.di
ocamlfind ocamldep -native pdfcodec.mli > ._ncdi/pdfcodec.di
ocamlfind ocamldep -native pdfflate.mli > ._ncdi/pdfflate.di
ocamlfind ocamldep -native pdfcrypt.mli > ._ncdi/pdfcrypt.di
ocamlfind ocamldep -native pdf.mli > ._ncdi/pdf.di
ocamlfind ocamldep -native pdfpaper.mli > ._ncdi/pdfpaper.di
ocamlfind ocamldep -native pdfunits.mli > ._ncdi/pdfunits.di
ocamlfind ocamldep -native pdftransform.mli > ._ncdi/pdftransform.di
ocamlfind ocamldep -native pdfio.mli > ._ncdi/pdfio.di
ocamlfind ocamldep -native pdfutil.mli > ._ncdi/pdfutil.di
ocamlfind ocamldep pdfmerge.ml > ._d/pdfmerge.d
ocamlfind ocamldep pdftype0.ml > ._d/pdftype0.d
ocamlfind ocamldep pdftruetype.ml > ._d/pdftruetype.d
ocamlfind ocamldep pdftype1.ml > ._d/pdftype1.d
ocamlfind ocamldep pdfcff.ml > ._d/pdfcff.d
ocamlfind ocamldep pdfocg.ml > ._d/pdfocg.d
ocamlfind ocamldep pdfdate.ml > ._d/pdfdate.d
ocamlfind ocamldep pdfshapes.ml > ._d/pdfshapes.d
ocamlfind ocamldep pdfgraphics.ml > ._d/pdfgraphics.d
ocamlfind ocamldep pdfstandard14.ml > ._d/pdfstandard14.d
ocamlfind ocamldep pdftext.ml > ._d/pdftext.d
ocamlfind ocamldep pdfglyphlist.ml > ._d/pdfglyphlist.d
ocamlfind ocamldep pdfafmdata.ml > ._d/pdfafmdata.d
ocamlfind ocamldep pdfafm.ml > ._d/pdfafm.d
ocamlfind ocamldep pdfimage.ml > ._d/pdfimage.d
ocamlfind ocamldep pdfspace.ml > ._d/pdfspace.d
ocamlfind ocamldep pdffun.ml > ._d/pdffun.d
ocamlfind ocamldep pdfannot.ml > ._d/pdfannot.d
ocamlfind ocamldep pdfpage.ml > ._d/pdfpage.d
ocamlfind ocamldep pdfpagelabels.ml > ._d/pdfpagelabels.d
ocamlfind ocamldep pdfmarks.ml > ._d/pdfmarks.d
ocamlfind ocamldep pdfdest.ml > ._d/pdfdest.d
ocamlfind ocamldep pdfops.ml > ._d/pdfops.d
ocamlfind ocamldep pdfjpeg.ml > ._d/pdfjpeg.d
ocamlfind ocamldep pdfread.ml > ._d/pdfread.d
ocamlfind ocamldep pdfgenlex.ml > ._d/pdfgenlex.d
ocamlfind ocamldep pdfwrite.ml > ._d/pdfwrite.d
ocamlfind ocamldep pdfcodec.ml > ._d/pdfcodec.d
ocamlfind ocamldep pdfflate.ml > ._d/pdfflate.d
ocamlfind ocamldep pdfcrypt.ml > ._d/pdfcrypt.d
ocamlfind ocamldep pdf.ml > ._d/pdf.d
ocamlfind ocamldep pdfpaper.ml > ._d/pdfpaper.d
ocamlfind ocamldep pdfunits.ml > ._d/pdfunits.d
ocamlfind ocamldep pdftransform.ml > ._d/pdftransform.d
ocamlfind ocamldep pdfio.ml > ._d/pdfio.d
ocamlfind ocamldep pdfutil.ml > ._d/pdfutil.d
ocamlc -c -cc "cc" -ccopt "-fPIC  \
			-DPIC -DNATIVE_CODE   \
			    -o flatestubs.o " flatestubs.c
flatestubs.c: In function ‘camlzip_update_crc32’:
flatestubs.c:173:28: error: ‘uint32’ undeclared (first use in this function)
   return copy_int32(crc32((uint32) Int32_val(crc), 
                            ^
flatestubs.c:173:28: note: each undeclared identifier is reported only once for each function it appears in
In file included from flatestubs.c:20:0:
At top level:
miniz.c:2440:28: warning: always_inline function might not be inlinable [-Wattributes]
 static MZ_FORCEINLINE void tdefl_record_match(tdefl_compressor *d, mz_uint match_len, mz_uint match_dist)
                            ^
miniz.c:2432:28: warning: always_inline function might not be inlinable [-Wattributes]
 static MZ_FORCEINLINE void tdefl_record_literal(tdefl_compressor *d, mz_uint8 lit)
                            ^
miniz.c:2230:28: warning: always_inline function might not be inlinable [-Wattributes]
 static MZ_FORCEINLINE void tdefl_find_match(tdefl_compressor *d, mz_uint lookahead_pos, mz_uint max_dist, mz_uint max_match_len, mz_uint *pMatch_dist, mz_uint *pMatch_len)
                            ^
OCamlMakefile:1132: recipe for target 'flatestubs.o' failed
make[1]: *** [flatestubs.o] Error 2
make[1]: Leaving directory '/home/louis/.opam/4.07.1+clambda+bench/.opam-switch/build/camlpdf.1.7.1'
OCamlMakefile:801: recipe for target 'native-code-library' failed
make: *** [native-code-library] Error 2
make[1]: Entering directory '/home/louis/.opam/4.07.1+flambda+bench/.opam-switch/build/camlpdf.1.7.1'
ocamlfind ocamldep -native pdfmerge.mli > ._ncdi/pdfmerge.di
ocamlfind ocamldep -native pdftype0.mli > ._ncdi/pdftype0.di
ocamlfind ocamldep -native pdftruetype.mli > ._ncdi/pdftruetype.di
ocamlfind ocamldep -native pdftype1.mli > ._ncdi/pdftype1.di
ocamlfind ocamldep -native pdfcff.mli > ._ncdi/pdfcff.di
ocamlfind ocamldep -native pdfocg.mli > ._ncdi/pdfocg.di
ocamlfind ocamldep -native pdfdate.mli > ._ncdi/pdfdate.di
ocamlfind ocamldep -native pdfshapes.mli > ._ncdi/pdfshapes.di
ocamlfind ocamldep -native pdfgraphics.mli > ._ncdi/pdfgraphics.di
ocamlfind ocamldep -native pdfstandard14.mli > ._ncdi/pdfstandard14.di
ocamlfind ocamldep -native pdftext.mli > ._ncdi/pdftext.di
ocamlfind ocamldep -native pdfglyphlist.mli > ._ncdi/pdfglyphlist.di
ocamlfind ocamldep -native pdfafmdata.mli > ._ncdi/pdfafmdata.di
ocamlfind ocamldep -native pdfafm.mli > ._ncdi/pdfafm.di
ocamlfind ocamldep -native pdfimage.mli > ._ncdi/pdfimage.di
ocamlfind ocamldep -native pdfspace.mli > ._ncdi/pdfspace.di
ocamlfind ocamldep -native pdffun.mli > ._ncdi/pdffun.di
ocamlfind ocamldep -native pdfannot.mli > ._ncdi/pdfannot.di
ocamlfind ocamldep -native pdfpage.mli > ._ncdi/pdfpage.di
ocamlfind ocamldep -native pdfpagelabels.mli > ._ncdi/pdfpagelabels.di
ocamlfind ocamldep -native pdfmarks.mli > ._ncdi/pdfmarks.di
ocamlfind ocamldep -native pdfdest.mli > ._ncdi/pdfdest.di
ocamlfind ocamldep -native pdfops.mli > ._ncdi/pdfops.di
ocamlfind ocamldep -native pdfjpeg.mli > ._ncdi/pdfjpeg.di
ocamlfind ocamldep -native pdfread.mli > ._ncdi/pdfread.di
ocamlfind ocamldep -native pdfgenlex.mli > ._ncdi/pdfgenlex.di
ocamlfind ocamldep -native pdfwrite.mli > ._ncdi/pdfwrite.di
ocamlfind ocamldep -native pdfcodec.mli > ._ncdi/pdfcodec.di
ocamlfind ocamldep -native pdfflate.mli > ._ncdi/pdfflate.di
ocamlfind ocamldep -native pdfcrypt.mli > ._ncdi/pdfcrypt.di
ocamlfind ocamldep -native pdf.mli > ._ncdi/pdf.di
ocamlfind ocamldep -native pdfpaper.mli > ._ncdi/pdfpaper.di
ocamlfind ocamldep -native pdfunits.mli > ._ncdi/pdfunits.di
ocamlfind ocamldep -native pdftransform.mli > ._ncdi/pdftransform.di
ocamlfind ocamldep -native pdfio.mli > ._ncdi/pdfio.di
ocamlfind ocamldep -native pdfutil.mli > ._ncdi/pdfutil.di
ocamlfind ocamldep pdfmerge.ml > ._d/pdfmerge.d
ocamlfind ocamldep pdftype0.ml > ._d/pdftype0.d
ocamlfind ocamldep pdftruetype.ml > ._d/pdftruetype.d
ocamlfind ocamldep pdftype1.ml > ._d/pdftype1.d
ocamlfind ocamldep pdfcff.ml > ._d/pdfcff.d
ocamlfind ocamldep pdfocg.ml > ._d/pdfocg.d
ocamlfind ocamldep pdfdate.ml > ._d/pdfdate.d
ocamlfind ocamldep pdfshapes.ml > ._d/pdfshapes.d
ocamlfind ocamldep pdfgraphics.ml > ._d/pdfgraphics.d
ocamlfind ocamldep pdfstandard14.ml > ._d/pdfstandard14.d
ocamlfind ocamldep pdftext.ml > ._d/pdftext.d
ocamlfind ocamldep pdfglyphlist.ml > ._d/pdfglyphlist.d
ocamlfind ocamldep pdfafmdata.ml > ._d/pdfafmdata.d
ocamlfind ocamldep pdfafm.ml > ._d/pdfafm.d
ocamlfind ocamldep pdfimage.ml > ._d/pdfimage.d
ocamlfind ocamldep pdfspace.ml > ._d/pdfspace.d
ocamlfind ocamldep pdffun.ml > ._d/pdffun.d
ocamlfind ocamldep pdfannot.ml > ._d/pdfannot.d
ocamlfind ocamldep pdfpage.ml > ._d/pdfpage.d
ocamlfind ocamldep pdfpagelabels.ml > ._d/pdfpagelabels.d
ocamlfind ocamldep pdfmarks.ml > ._d/pdfmarks.d
ocamlfind ocamldep pdfdest.ml > ._d/pdfdest.d
ocamlfind ocamldep pdfops.ml > ._d/pdfops.d
ocamlfind ocamldep pdfjpeg.ml > ._d/pdfjpeg.d
ocamlfind ocamldep pdfread.ml > ._d/pdfread.d
ocamlfind ocamldep pdfgenlex.ml > ._d/pdfgenlex.d
ocamlfind ocamldep pdfwrite.ml > ._d/pdfwrite.d
ocamlfind ocamldep pdfcodec.ml > ._d/pdfcodec.d
ocamlfind ocamldep pdfflate.ml > ._d/pdfflate.d
ocamlfind ocamldep pdfcrypt.ml > ._d/pdfcrypt.d
ocamlfind ocamldep pdf.ml > ._d/pdf.d
ocamlfind ocamldep pdfpaper.ml > ._d/pdfpaper.d
ocamlfind ocamldep pdfunits.ml > ._d/pdfunits.d
ocamlfind ocamldep pdftransform.ml > ._d/pdftransform.d
ocamlfind ocamldep pdfio.ml > ._d/pdfio.d
ocamlfind ocamldep pdfutil.ml > ._d/pdfutil.d
ocamlc -c -cc "cc" -ccopt "-fPIC  \
			-DPIC -DNATIVE_CODE   \
			    -o flatestubs.o " flatestubs.c
flatestubs.c: In function ‘camlzip_update_crc32’:
flatestubs.c:173:28: error: ‘uint32’ undeclared (first use in this function)
   return copy_int32(crc32((uint32) Int32_val(crc), 
                            ^
flatestubs.c:173:28: note: each undeclared identifier is reported only once for each function it appears in
In file included from flatestubs.c:20:0:
At top level:
miniz.c:2440:28: warning: always_inline function might not be inlinable [-Wattributes]
 static MZ_FORCEINLINE void tdefl_record_match(tdefl_compressor *d, mz_uint match_len, mz_uint match_dist)
                            ^
miniz.c:2432:28: warning: always_inline function might not be inlinable [-Wattributes]
 static MZ_FORCEINLINE void tdefl_record_literal(tdefl_compressor *d, mz_uint8 lit)
                            ^
miniz.c:2230:28: warning: always_inline function might not be inlinable [-Wattributes]
 static MZ_FORCEINLINE void tdefl_find_match(tdefl_compressor *d, mz_uint lookahead_pos, mz_uint max_dist, mz_uint max_match_len, mz_uint *pMatch_dist, mz_uint *pMatch_len)
                            ^
OCamlMakefile:1132: recipe for target 'flatestubs.o' failed
make[1]: *** [flatestubs.o] Error 2
make[1]: Leaving directory '/home/louis/.opam/4.07.1+flambda+bench/.opam-switch/build/camlpdf.1.7.1'
OCamlMakefile:801: recipe for target 'native-code-library' failed
make: *** [native-code-library] Error 2
Close

Error on camlpdf.1.7.1 (4.07.1+clambda+bench)

Command:

/usr/bin/make

Output

make[1]: Entering directory '/home/louis/.opam/4.07.1+clambda+bench/.opam-switch/build/camlpdf.1.7.1'
ocamlfind ocamldep -native pdfmerge.mli > ._ncdi/pdfmerge.di
ocamlfind ocamldep -native pdftype0.mli > ._ncdi/pdftype0.di
ocamlfind ocamldep -native pdftruetype.mli > ._ncdi/pdftruetype.di
ocamlfind ocamldep -native pdftype1.mli > ._ncdi/pdftype1.di
ocamlfind ocamldep -native pdfcff.mli > ._ncdi/pdfcff.di
ocamlfind ocamldep -native pdfocg.mli > ._ncdi/pdfocg.di
ocamlfind ocamldep -native pdfdate.mli > ._ncdi/pdfdate.di
ocamlfind ocamldep -native pdfshapes.mli > ._ncdi/pdfshapes.di
ocamlfind ocamldep -native pdfgraphics.mli > ._ncdi/pdfgraphics.di
ocamlfind ocamldep -native pdfstandard14.mli > ._ncdi/pdfstandard14.di
ocamlfind ocamldep -native pdftext.mli > ._ncdi/pdftext.di
ocamlfind ocamldep -native pdfglyphlist.mli > ._ncdi/pdfglyphlist.di
ocamlfind ocamldep -native pdfafmdata.mli > ._ncdi/pdfafmdata.di
ocamlfind ocamldep -native pdfafm.mli > ._ncdi/pdfafm.di
ocamlfind ocamldep -native pdfimage.mli > ._ncdi/pdfimage.di
ocamlfind ocamldep -native pdfspace.mli > ._ncdi/pdfspace.di
ocamlfind ocamldep -native pdffun.mli > ._ncdi/pdffun.di
ocamlfind ocamldep -native pdfannot.mli > ._ncdi/pdfannot.di
ocamlfind ocamldep -native pdfpage.mli > ._ncdi/pdfpage.di
ocamlfind ocamldep -native pdfpagelabels.mli > ._ncdi/pdfpagelabels.di
ocamlfind ocamldep -native pdfmarks.mli > ._ncdi/pdfmarks.di
ocamlfind ocamldep -native pdfdest.mli > ._ncdi/pdfdest.di
ocamlfind ocamldep -native pdfops.mli > ._ncdi/pdfops.di
ocamlfind ocamldep -native pdfjpeg.mli > ._ncdi/pdfjpeg.di
ocamlfind ocamldep -native pdfread.mli > ._ncdi/pdfread.di
ocamlfind ocamldep -native pdfgenlex.mli > ._ncdi/pdfgenlex.di
ocamlfind ocamldep -native pdfwrite.mli > ._ncdi/pdfwrite.di
ocamlfind ocamldep -native pdfcodec.mli > ._ncdi/pdfcodec.di
ocamlfind ocamldep -native pdfflate.mli > ._ncdi/pdfflate.di
ocamlfind ocamldep -native pdfcrypt.mli > ._ncdi/pdfcrypt.di
ocamlfind ocamldep -native pdf.mli > ._ncdi/pdf.di
ocamlfind ocamldep -native pdfpaper.mli > ._ncdi/pdfpaper.di
ocamlfind ocamldep -native pdfunits.mli > ._ncdi/pdfunits.di
ocamlfind ocamldep -native pdftransform.mli > ._ncdi/pdftransform.di
ocamlfind ocamldep -native pdfio.mli > ._ncdi/pdfio.di
ocamlfind ocamldep -native pdfutil.mli > ._ncdi/pdfutil.di
ocamlfind ocamldep pdfmerge.ml > ._d/pdfmerge.d
ocamlfind ocamldep pdftype0.ml > ._d/pdftype0.d
ocamlfind ocamldep pdftruetype.ml > ._d/pdftruetype.d
ocamlfind ocamldep pdftype1.ml > ._d/pdftype1.d
ocamlfind ocamldep pdfcff.ml > ._d/pdfcff.d
ocamlfind ocamldep pdfocg.ml > ._d/pdfocg.d
ocamlfind ocamldep pdfdate.ml > ._d/pdfdate.d
ocamlfind ocamldep pdfshapes.ml > ._d/pdfshapes.d
ocamlfind ocamldep pdfgraphics.ml > ._d/pdfgraphics.d
ocamlfind ocamldep pdfstandard14.ml > ._d/pdfstandard14.d
ocamlfind ocamldep pdftext.ml > ._d/pdftext.d
ocamlfind ocamldep pdfglyphlist.ml > ._d/pdfglyphlist.d
ocamlfind ocamldep pdfafmdata.ml > ._d/pdfafmdata.d
ocamlfind ocamldep pdfafm.ml > ._d/pdfafm.d
ocamlfind ocamldep pdfimage.ml > ._d/pdfimage.d
ocamlfind ocamldep pdfspace.ml > ._d/pdfspace.d
ocamlfind ocamldep pdffun.ml > ._d/pdffun.d
ocamlfind ocamldep pdfannot.ml > ._d/pdfannot.d
ocamlfind ocamldep pdfpage.ml > ._d/pdfpage.d
ocamlfind ocamldep pdfpagelabels.ml > ._d/pdfpagelabels.d
ocamlfind ocamldep pdfmarks.ml > ._d/pdfmarks.d
ocamlfind ocamldep pdfdest.ml > ._d/pdfdest.d
ocamlfind ocamldep pdfops.ml > ._d/pdfops.d
ocamlfind ocamldep pdfjpeg.ml > ._d/pdfjpeg.d
ocamlfind ocamldep pdfread.ml > ._d/pdfread.d
ocamlfind ocamldep pdfgenlex.ml > ._d/pdfgenlex.d
ocamlfind ocamldep pdfwrite.ml > ._d/pdfwrite.d
ocamlfind ocamldep pdfcodec.ml > ._d/pdfcodec.d
ocamlfind ocamldep pdfflate.ml > ._d/pdfflate.d
ocamlfind ocamldep pdfcrypt.ml > ._d/pdfcrypt.d
ocamlfind ocamldep pdf.ml > ._d/pdf.d
ocamlfind ocamldep pdfpaper.ml > ._d/pdfpaper.d
ocamlfind ocamldep pdfunits.ml > ._d/pdfunits.d
ocamlfind ocamldep pdftransform.ml > ._d/pdftransform.d
ocamlfind ocamldep pdfio.ml > ._d/pdfio.d
ocamlfind ocamldep pdfutil.ml > ._d/pdfutil.d
ocamlc -c -cc "cc" -ccopt "-fPIC  \
			-DPIC -DNATIVE_CODE   \
			    -o flatestubs.o " flatestubs.c
flatestubs.c: In function ‘camlzip_update_crc32’:
flatestubs.c:173:28: error: ‘uint32’ undeclared (first use in this function)
   return copy_int32(crc32((uint32) Int32_val(crc), 
                            ^
flatestubs.c:173:28: note: each undeclared identifier is reported only once for each function it appears in
In file included from flatestubs.c:20:0:
At top level:
miniz.c:2440:28: warning: always_inline function might not be inlinable [-Wattributes]
 static MZ_FORCEINLINE void tdefl_record_match(tdefl_compressor *d, mz_uint match_len, mz_uint match_dist)
                            ^
miniz.c:2432:28: warning: always_inline function might not be inlinable [-Wattributes]
 static MZ_FORCEINLINE void tdefl_record_literal(tdefl_compressor *d, mz_uint8 lit)
                            ^
miniz.c:2230:28: warning: always_inline function might not be inlinable [-Wattributes]
 static MZ_FORCEINLINE void tdefl_find_match(tdefl_compressor *d, mz_uint lookahead_pos, mz_uint max_dist, mz_uint max_match_len, mz_uint *pMatch_dist, mz_uint *pMatch_len)
                            ^
OCamlMakefile:1132: recipe for target 'flatestubs.o' failed
make[1]: *** [flatestubs.o] Error 2
make[1]: Leaving directory '/home/louis/.opam/4.07.1+clambda+bench/.opam-switch/build/camlpdf.1.7.1'
OCamlMakefile:801: recipe for target 'native-code-library' failed
make: *** [native-code-library] Error 2
Close

Error on async-rpc-bench.1.0 (4.07.1+oclassic+bench)

Command:

/usr/bin/make -C async_rpc

Output

make: Entering directory '/home/louis/.opam/4.07.1+oclassic+bench/.opam-switch/build/async-rpc-bench.1.0/async_rpc'
ocamlfind ocamlopt -thread -syntax camlp4o -package async -package bin_prot.syntax -package core -c rpc_common.ml
ocamlfind: Package `bin_prot.syntax' not found
Makefile:12: recipe for target 'rpc_common.cmx' failed
make: *** [rpc_common.cmx] Error 2
make: Leaving directory '/home/louis/.opam/4.07.1+oclassic+bench/.opam-switch/build/async-rpc-bench.1.0/async_rpc'
make: Entering directory '/home/louis/.opam/4.07.1+oclassic+bench/.opam-switch/build/async-rpc-bench.1.0/async_rpc'
ocamlfind ocamlopt -thread -syntax camlp4o -package async -package bin_prot.syntax -package core -c rpc_common.ml
ocamlfind: Package `bin_prot.syntax' not found
Makefile:12: recipe for target 'rpc_common.cmx' failed
make: *** [rpc_common.cmx] Error 2
make: Leaving directory '/home/louis/.opam/4.07.1+oclassic+bench/.opam-switch/build/async-rpc-bench.1.0/async_rpc'
Close

Error on async-rpc-bench.1.0 (4.07.1+flambda+bench)

Command:

/usr/bin/make -C async_rpc

Output

make: Entering directory '/home/louis/.opam/4.07.1+clambda+bench/.opam-switch/build/async-rpc-bench.1.0/async_rpc'
ocamlfind ocamlopt -thread -syntax camlp4o -package async -package bin_prot.syntax -package core -c rpc_common.ml
ocamlfind: Package `bin_prot.syntax' not found
Makefile:12: recipe for target 'rpc_common.cmx' failed
make: *** [rpc_common.cmx] Error 2
make: Leaving directory '/home/louis/.opam/4.07.1+clambda+bench/.opam-switch/build/async-rpc-bench.1.0/async_rpc'
make: Entering directory '/home/louis/.opam/4.07.1+flambda+bench/.opam-switch/build/async-rpc-bench.1.0/async_rpc'
ocamlfind ocamlopt -thread -syntax camlp4o -package async -package bin_prot.syntax -package core -c rpc_common.ml
ocamlfind: Package `bin_prot.syntax' not found
Makefile:12: recipe for target 'rpc_common.cmx' failed
make: *** [rpc_common.cmx] Error 2
make: Leaving directory '/home/louis/.opam/4.07.1+flambda+bench/.opam-switch/build/async-rpc-bench.1.0/async_rpc'
Close

Error on async-rpc-bench.1.0 (4.07.1+clambda+bench)

Command:

/usr/bin/make -C async_rpc

Output

make: Entering directory '/home/louis/.opam/4.07.1+clambda+bench/.opam-switch/build/async-rpc-bench.1.0/async_rpc'
ocamlfind ocamlopt -thread -syntax camlp4o -package async -package bin_prot.syntax -package core -c rpc_common.ml
ocamlfind: Package `bin_prot.syntax' not found
Makefile:12: recipe for target 'rpc_common.cmx' failed
make: *** [rpc_common.cmx] Error 2
make: Leaving directory '/home/louis/.opam/4.07.1+clambda+bench/.opam-switch/build/async-rpc-bench.1.0/async_rpc'
Close

Error on async-rpc-bench.1.0 (4.03.1+bench)

Command:

/usr/bin/make -C async_rpc

Output

make: Entering directory '/home/louis/.opam/4.03.1+bench/.opam-switch/build/async-rpc-bench.1.0/async_rpc'
ocamlfind ocamlopt -thread -syntax camlp4o -package async -package bin_prot.syntax -package core -c rpc_common.ml
ocamlfind: Package `bin_prot.syntax' not found
Makefile:12: recipe for target 'rpc_common.cmx' failed
make: *** [rpc_common.cmx] Error 2
make: Leaving directory '/home/louis/.opam/4.03.1+bench/.opam-switch/build/async-rpc-bench.1.0/async_rpc'
Close

Error on async-echo-bench.1.0 (4.07.1+oclassic+bench)

Command:

/usr/bin/make -C async_echo

Output

make: Entering directory '/home/louis/.opam/4.07.1+oclassic+bench/.opam-switch/build/async-echo-bench.1.0/async_echo'
ocamlfind ocamlopt -thread -syntax camlp4o -package async -package bin_prot.syntax -package core -c echo_common.ml
ocamlfind: Package `bin_prot.syntax' not found
Makefile:20: recipe for target 'echo_common.cmx' failed
make: *** [echo_common.cmx] Error 2
make: Leaving directory '/home/louis/.opam/4.07.1+oclassic+bench/.opam-switch/build/async-echo-bench.1.0/async_echo'
make: Entering directory '/home/louis/.opam/4.07.1+oclassic+bench/.opam-switch/build/async-echo-bench.1.0/async_echo'
ocamlfind ocamlopt -thread -syntax camlp4o -package async -package bin_prot.syntax -package core -c echo_common.ml
ocamlfind: Package `bin_prot.syntax' not found
Makefile:20: recipe for target 'echo_common.cmx' failed
make: *** [echo_common.cmx] Error 2
make: Leaving directory '/home/louis/.opam/4.07.1+oclassic+bench/.opam-switch/build/async-echo-bench.1.0/async_echo'
Close

Error on async-echo-bench.1.0 (4.07.1+flambda+bench)

Command:

/usr/bin/make -C async_echo

Output

make: Entering directory '/home/louis/.opam/4.07.1+clambda+bench/.opam-switch/build/async-echo-bench.1.0/async_echo'
ocamlfind ocamlopt -thread -syntax camlp4o -package async -package bin_prot.syntax -package core -c echo_common.ml
ocamlfind: Package `bin_prot.syntax' not found
Makefile:20: recipe for target 'echo_common.cmx' failed
make: *** [echo_common.cmx] Error 2
make: Leaving directory '/home/louis/.opam/4.07.1+clambda+bench/.opam-switch/build/async-echo-bench.1.0/async_echo'
make: Entering directory '/home/louis/.opam/4.07.1+flambda+bench/.opam-switch/build/async-echo-bench.1.0/async_echo'
ocamlfind ocamlopt -thread -syntax camlp4o -package async -package bin_prot.syntax -package core -c echo_common.ml
ocamlfind: Package `bin_prot.syntax' not found
Makefile:20: recipe for target 'echo_common.cmx' failed
make: *** [echo_common.cmx] Error 2
make: Leaving directory '/home/louis/.opam/4.07.1+flambda+bench/.opam-switch/build/async-echo-bench.1.0/async_echo'
Close

Error on async-echo-bench.1.0 (4.07.1+clambda+bench)

Command:

/usr/bin/make -C async_echo

Output

make: Entering directory '/home/louis/.opam/4.07.1+clambda+bench/.opam-switch/build/async-echo-bench.1.0/async_echo'
ocamlfind ocamlopt -thread -syntax camlp4o -package async -package bin_prot.syntax -package core -c echo_common.ml
ocamlfind: Package `bin_prot.syntax' not found
Makefile:20: recipe for target 'echo_common.cmx' failed
make: *** [echo_common.cmx] Error 2
make: Leaving directory '/home/louis/.opam/4.07.1+clambda+bench/.opam-switch/build/async-echo-bench.1.0/async_echo'
Close

Error on async-echo-bench.1.0 (4.03.1+bench)

Command:

/usr/bin/make -C async_echo

Output

make: Entering directory '/home/louis/.opam/4.03.1+bench/.opam-switch/build/async-echo-bench.1.0/async_echo'
ocamlfind ocamlopt -thread -syntax camlp4o -package async -package bin_prot.syntax -package core -c echo_common.ml
ocamlfind: Package `bin_prot.syntax' not found
Makefile:20: recipe for target 'echo_common.cmx' failed
make: *** [echo_common.cmx] Error 2
make: Leaving directory '/home/louis/.opam/4.03.1+bench/.opam-switch/build/async-echo-bench.1.0/async_echo'
Close

Error on alt-ergo-lib.2.3.0 (4.08.0+gpr2165+bench)

Command:

~/.opam/4.08.0+gpr2165+bench/bin/dune build -p alt-ergo-lib -j 7

Output

      ocamlc lib/.AltErgoLib.objs/byte/altErgoLib__MyUnix.{cmo,cmt}
File "lib/util/myUnix.ml", line 21, characters 7-22:
21 |     if Pervasives.(<>) timelimit 0. then
            ^^^^^^^^^^^^^^^
Alert deprecated: module Stdlib.Pervasives
Use Stdlib instead.

If you need to stay compatible with OCaml < 4.07, you can use the 
stdlib-shims library: https://github.com/ocaml/stdlib-shims
      ocamlc lib/.AltErgoLib.objs/byte/altErgoLib__Util.{cmo,cmt}
File "lib/util/util.ml", line 86, characters 18-36:
86 |   | true, true -> Pervasives.compare s1 s2 (* both constructors without args *)
                       ^^^^^^^^^^^^^^^^^^
Alert deprecated: module Stdlib.Pervasives
Use Stdlib instead.

If you need to stay compatible with OCaml < 4.07, you can use the 
stdlib-shims library: https://github.com/ocaml/stdlib-shims
    ocamlopt lib/.AltErgoLib.objs/native/altErgoLib__MyUnix.{cmx,o}
File "lib/util/myUnix.ml", line 21, characters 7-22:
21 |     if Pervasives.(<>) timelimit 0. then
            ^^^^^^^^^^^^^^^
Alert deprecated: module Stdlib.Pervasives
Use Stdlib instead.

If you need to stay compatible with OCaml < 4.07, you can use the 
stdlib-shims library: https://github.com/ocaml/stdlib-shims
    ocamlopt lib/.AltErgoLib.objs/native/altErgoLib__Util.{cmx,o}
File "lib/util/util.ml", line 86, characters 18-36:
86 |   | true, true -> Pervasives.compare s1 s2 (* both constructors without args *)
                       ^^^^^^^^^^^^^^^^^^
Alert deprecated: module Stdlib.Pervasives
Use Stdlib instead.

If you need to stay compatible with OCaml < 4.07, you can use the 
stdlib-shims library: https://github.com/ocaml/stdlib-shims
      ocamlc lib/.AltErgoLib.objs/byte/altErgoLib__ZarithNumbers.{cmo,cmt}
File "lib/util/zarithNumbers.ml", line 156, characters 16-30:
156 |     let abs_n = Pervasives.abs n in
                      ^^^^^^^^^^^^^^
Alert deprecated: module Stdlib.Pervasives
Use Stdlib instead.

If you need to stay compatible with OCaml < 4.07, you can use the 
stdlib-shims library: https://github.com/ocaml/stdlib-shims
      ocamlc lib/.AltErgoLib.objs/byte/altErgoLib__Numbers.{cmo,cmt}
File "lib/util/numbers.ml", line 51, characters 11-25:
51 |         if Pervasives.(<) v min_float then min_float
                ^^^^^^^^^^^^^^
Alert deprecated: module Stdlib.Pervasives
Use Stdlib instead.

If you need to stay compatible with OCaml < 4.07, you can use the 
stdlib-shims library: https://github.com/ocaml/stdlib-shims
File "lib/util/numbers.ml", line 52, characters 16-30:
52 |         else if Pervasives.(>) v max_float then max_float
                     ^^^^^^^^^^^^^^
Alert deprecated: module Stdlib.Pervasives
Use Stdlib instead.

If you need to stay compatible with OCaml < 4.07, you can use the 
stdlib-shims library: https://github.com/ocaml/stdlib-shims
    ocamlopt lib/.AltErgoLib.objs/native/altErgoLib__ZarithNumbers.{cmx,o} (exit 2)
(cd _build/default && /home/louis/.opam/4.08.0+gpr2165+bench/bin/ocamlopt.opt -w -40 -bin-annot -w -22 -O3 -unbox-closures -I lib/.AltErgoLib.objs/byte -I lib/.AltErgoLib.objs/native -I /home/louis/.opam/4.08.0+gpr2165+bench/lib/num -I /home/louis/.opam/4.08.0+gpr2165+bench/lib/ocplib-simplex -I /home/louis/.opam/4.08.0+gpr2165+bench/lib/seq -I /home/louis/.opam/4.08.0+gpr2165+bench/lib/zarith -intf-suffix .ml -no-alias-deps -open AltErgoLib -o lib/.AltErgoLib.objs/native/altErgoLib__ZarithNumbers.cmx -c -impl lib/util/zarithNumbers.ml)
File "lib/util/zarithNumbers.ml", line 156, characters 16-30:
156 |     let abs_n = Pervasives.abs n in
                      ^^^^^^^^^^^^^^
Alert deprecated: module Stdlib.Pervasives
Use Stdlib instead.

If you need to stay compatible with OCaml < 4.07, you can use the 
stdlib-shims library: https://github.com/ocaml/stdlib-shims
Fatal error: exception Invalid_argument("index out of bounds")
      ocamlc lib/.AltErgoLib.objs/byte/altErgoLib__Options.{cmo,cmt}
File "lib/util/options.ml", line 960, characters 33-51:
960 | let compare  (a: int) (b: int) = Pervasives.compare a b
                                       ^^^^^^^^^^^^^^^^^^
Alert deprecated: module Stdlib.Pervasives
Use Stdlib instead.

If you need to stay compatible with OCaml < 4.07, you can use the 
stdlib-shims library: https://github.com/ocaml/stdlib-shims
      ocamlc lib/.AltErgoLib.objs/byte/altErgoLib__Symbols.{cmo,cmt}
File "lib/structures/symbols.ml", line 127, characters 16-34:
127 |         let c = Pervasives.compare b1 b2 in
                      ^^^^^^^^^^^^^^^^^^
Alert deprecated: module Stdlib.Pervasives
Use Stdlib instead.

If you need to stay compatible with OCaml < 4.07, you can use the 
stdlib-shims library: https://github.com/ocaml/stdlib-shims
File "lib/structures/symbols.ml", line 158, characters 36-54:
158 |       | F_Clause b1, F_Clause b2 -> Pervasives.compare b1 b2
                                          ^^^^^^^^^^^^^^^^^^
Alert deprecated: module Stdlib.Pervasives
Use Stdlib instead.

If you need to stay compatible with OCaml < 4.07, you can use the 
stdlib-shims library: https://github.com/ocaml/stdlib-shims
File "lib/structures/symbols.ml", line 176, characters 12-30:
176 |     let c = Pervasives.compare a.is_open b.is_open in
                  ^^^^^^^^^^^^^^^^^^
Alert deprecated: module Stdlib.Pervasives
Use Stdlib instead.

If you need to stay compatible with OCaml < 4.07, you can use the 
stdlib-shims library: https://github.com/ocaml/stdlib-shims
File "lib/structures/symbols.ml", line 179, characters 14-32:
179 |       let c = Pervasives.compare a.is_lower b.is_lower in
                    ^^^^^^^^^^^^^^^^^^
Alert deprecated: module Stdlib.Pervasives
Use Stdlib instead.

If you need to stay compatible with OCaml < 4.07, you can use the 
stdlib-shims library: https://github.com/ocaml/stdlib-shims
      ocamlc lib/.AltErgoLib.objs/byte/altErgoLib__Typed.{cmo,cmt}
File "lib/structures/typed.ml", line 372, characters 6-20:
372 |   try Pervasives.(=) (String.sub s 0 2) "@L" with Invalid_argument _ -> false
            ^^^^^^^^^^^^^^
Alert deprecated: module Stdlib.Pervasives
Use Stdlib instead.

If you need to stay compatible with OCaml < 4.07, you can use the 
stdlib-shims library: https://github.com/ocaml/stdlib-shims
File "lib/structures/typed.ml", line 375, characters 6-20:
375 |   try Pervasives.(=) (String.sub s 0 2) "@H" with Invalid_argument _ -> false
            ^^^^^^^^^^^^^^
Alert deprecated: module Stdlib.Pervasives
Use Stdlib instead.

If you need to stay compatible with OCaml < 4.07, you can use the 
stdlib-shims library: https://github.com/ocaml/stdlib-shims
      ocamlc lib/.AltErgoLib.objs/byte/altErgoLib__Ty.{cmo,cmt}
File "lib/structures/ty.ml", line 204, characters 45-63:
204 |   | Tvar{ v = v1; _ } , Tvar{ v = v2; _ } -> Pervasives.compare v1 v2
                                                   ^^^^^^^^^^^^^^^^^^
Alert deprecated: module Stdlib.Pervasives
Use Stdlib instead.

If you need to stay compatible with OCaml < 4.07, you can use the 
stdlib-shims library: https://github.com/ocaml/stdlib-shims
File "lib/structures/ty.ml", line 237, characters 15-33:
237 |   | t1 , t2 -> Pervasives.compare t1 t2
                     ^^^^^^^^^^^^^^^^^^
Alert deprecated: module Stdlib.Pervasives
Use Stdlib instead.

If you need to stay compatible with OCaml < 4.07, you can use the 
stdlib-shims library: https://github.com/ocaml/stdlib-shims
File "lib/structures/ty.ml", line 281, characters 52-70:
281 | module M = Map.Make(struct type t=int let compare = Pervasives.compare end)
                                                          ^^^^^^^^^^^^^^^^^^
Alert deprecated: module Stdlib.Pervasives
Use Stdlib instead.

If you need to stay compatible with OCaml < 4.07, you can use the 
stdlib-shims library: https://github.com/ocaml/stdlib-shims
File "lib/structures/ty.ml", line 605, characters 30-48:
605 | let compare_subst = M.compare Pervasives.compare
                                    ^^^^^^^^^^^^^^^^^^
Alert deprecated: module Stdlib.Pervasives
Use Stdlib instead.

If you need to stay compatible with OCaml < 4.07, you can use the 
stdlib-shims library: https://github.com/ocaml/stdlib-shims
File "lib/structures/ty.ml", line 607, characters 26-40:
607 | let equal_subst = M.equal Pervasives.(=)
                                ^^^^^^^^^^^^^^
Alert deprecated: module Stdlib.Pervasives
Use Stdlib instead.

If you need to stay compatible with OCaml < 4.07, you can use the 
stdlib-shims library: https://github.com/ocaml/stdlib-shims
File "lib/structures/ty.ml", line 610, characters 45-63:
610 |   Set.Make(struct type t = int let compare = Pervasives.compare end)
                                                   ^^^^^^^^^^^^^^^^^^
Alert deprecated: module Stdlib.Pervasives
Use Stdlib instead.

If you need to stay compatible with OCaml < 4.07, you can use the 
stdlib-shims library: https://github.com/ocaml/stdlib-shims
      ocamlc lib/.AltErgoLib.objs/byte/altErgoLib__Xliteral.{cmo,cmt}
File "lib/structures/xliteral.ml", line 106, characters 22-40:
106 |   let compare a1 a2 = Pervasives.compare a1.tpos a2.tpos
                            ^^^^^^^^^^^^^^^^^^
Alert deprecated: module Stdlib.Pervasives
Use Stdlib instead.

If you need to stay compatible with OCaml < 4.07, you can use the 
stdlib-shims library: https://github.com/ocaml/stdlib-shims
      ocamlc lib/.AltErgoLib.objs/byte/altErgoLib__Profiling.{cmo,cmt}
File "lib/structures/profiling.ml", line 88, characters 7-21:
88 |     if Pervasives.(>) v 0. then v else -. v
            ^^^^^^^^^^^^^^
Alert deprecated: module Stdlib.Pervasives
Use Stdlib instead.

If you need to stay compatible with OCaml < 4.07, you can use the 
stdlib-shims library: https://github.com/ocaml/stdlib-shims
File "lib/structures/profiling.ml", line 632, characters 5-19:
632 |   if Pervasives.(=) v 0. then fprintf fmt "--     "
           ^^^^^^^^^^^^^^
Alert deprecated: module Stdlib.Pervasives
Use Stdlib instead.

If you need to stay compatible with OCaml < 4.07, you can use the 
stdlib-shims library: https://github.com/ocaml/stdlib-shims
File "lib/structures/profiling.ml", line 633, characters 10-24:
633 |   else if Pervasives.(<) v 10. then fprintf fmt "%0.5f" v
                ^^^^^^^^^^^^^^
Alert deprecated: module Stdlib.Pervasives
Use Stdlib instead.

If you need to stay compatible with OCaml < 4.07, you can use the 
stdlib-shims library: https://github.com/ocaml/stdlib-shims
File "lib/structures/profiling.ml", line 634, characters 10-24:
634 |   else if Pervasives.(<) v 100. then fprintf fmt "%0.4f" v
                ^^^^^^^^^^^^^^
Alert deprecated: module Stdlib.Pervasives
Use Stdlib instead.

If you need to stay compatible with OCaml < 4.07, you can use the 
stdlib-shims library: https://github.com/ocaml/stdlib-shims
      ocamlc lib/.AltErgoLib.objs/byte/altErgoLib__Expr.{cmo,cmt}
File "lib/structures/expr.ml", line 1034, characters 6-20:
1034 |   try Pervasives.(=) (String.sub (Sy.to_string v.f) 0 4) "_sko"
             ^^^^^^^^^^^^^^
Alert deprecated: module Stdlib.Pervasives
Use Stdlib instead.

If you need to stay compatible with OCaml < 4.07, you can use the 
stdlib-shims library: https://github.com/ocaml/stdlib-shims
File "lib/structures/expr.ml", line 1672, characters 30-48:
1672 |       let l1 = List.fast_sort Pervasives.compare l1 in
                                     ^^^^^^^^^^^^^^^^^^
Alert deprecated: module Stdlib.Pervasives
Use Stdlib instead.

If you need to stay compatible with OCaml < 4.07, you can use the 
stdlib-shims library: https://github.com/ocaml/stdlib-shims
File "lib/structures/expr.ml", line 1673, characters 30-48:
1673 |       let l2 = List.fast_sort Pervasives.compare l2 in
                                     ^^^^^^^^^^^^^^^^^^
Alert deprecated: module Stdlib.Pervasives
Use Stdlib instead.

If you need to stay compatible with OCaml < 4.07, you can use the 
stdlib-shims library: https://github.com/ocaml/stdlib-shims
File "lib/structures/expr.ml", line 1674, characters 36-54:
1674 |       let c  = Util.cmp_lists l1 l2 Pervasives.compare in
                                           ^^^^^^^^^^^^^^^^^^
Alert deprecated: module Stdlib.Pervasives
Use Stdlib instead.

If you need to stay compatible with OCaml < 4.07, you can use the 
stdlib-shims library: https://github.com/ocaml/stdlib-shims
File "lib/structures/expr.ml", line 1705, characters 14-32:
1705 |       let c = Pervasives.compare a1 a2 in (* should be Hstring.compare *)
                     ^^^^^^^^^^^^^^^^^^
Alert deprecated: module Stdlib.Pervasives
Use Stdlib instead.

If you need to stay compatible with OCaml < 4.07, you can use the 
stdlib-shims library: https://github.com/ocaml/stdlib-shims
File "lib/structures/expr.ml", line 1713, characters 14-32:
1713 |       let c = Pervasives.compare a1 a2 in (* should be Hstring.compare *)
                     ^^^^^^^^^^^^^^^^^^
Alert deprecated: module Stdlib.Pervasives
Use Stdlib instead.

If you need to stay compatible with OCaml < 4.07, you can use the 
stdlib-shims library: https://github.com/ocaml/stdlib-shims
File "lib/structures/expr.ml", line 1728, characters 30-48:
1728 |       let l1 = List.fast_sort Pervasives.compare l1 in
                                     ^^^^^^^^^^^^^^^^^^
Alert deprecated: module Stdlib.Pervasives
Use Stdlib instead.

If you need to stay compatible with OCaml < 4.07, you can use the 
stdlib-shims library: https://github.com/ocaml/stdlib-shims
File "lib/structures/expr.ml", line 1729, characters 30-48:
1729 |       let l2 = List.fast_sort Pervasives.compare l2 in
                                     ^^^^^^^^^^^^^^^^^^
Alert deprecated: module Stdlib.Pervasives
Use Stdlib instead.

If you need to stay compatible with OCaml < 4.07, you can use the 
stdlib-shims library: https://github.com/ocaml/stdlib-shims
File "lib/structures/expr.ml", line 1730, characters 35-53:
1730 |       let c = Util.cmp_lists l1 l2 Pervasives.compare in
                                          ^^^^^^^^^^^^^^^^^^
Alert deprecated: module Stdlib.Pervasives
Use Stdlib instead.

If you need to stay compatible with OCaml < 4.07, you can use the 
stdlib-shims library: https://github.com/ocaml/stdlib-shims
File "lib/structures/expr.ml", line 1744, characters 38-56:
1744 |     let l1 = List.rev (List.fast_sort Pervasives.compare l1) in
                                             ^^^^^^^^^^^^^^^^^^
Alert deprecated: module Stdlib.Pervasives
Use Stdlib instead.

If you need to stay compatible with OCaml < 4.07, you can use the 
stdlib-shims library: https://github.com/ocaml/stdlib-shims
File "lib/structures/expr.ml", line 1745, characters 38-56:
1745 |     let l2 = List.rev (List.fast_sort Pervasives.compare l2) in
                                             ^^^^^^^^^^^^^^^^^^
Alert deprecated: module Stdlib.Pervasives
Use Stdlib instead.

If you need to stay compatible with OCaml < 4.07, you can use the 
stdlib-shims library: https://github.com/ocaml/stdlib-shims
File "lib/structures/expr.ml", line 1746, characters 33-51:
1746 |     let c = Util.cmp_lists l1 l2 Pervasives.compare in
                                        ^^^^^^^^^^^^^^^^^^
Alert deprecated: module Stdlib.Pervasives
Use Stdlib instead.

If you need to stay compatible with OCaml < 4.07, you can use the 
stdlib-shims library: https://github.com/ocaml/stdlib-shims
      ocamlc lib/.AltErgoLib.objs/byte/altErgoLib__Typechecker.{cmo,cmt}
File "lib/frontend/typechecker.ml", line 40, characters 48-66:
40 |   Map.Make(struct type t = string let compare = Pervasives.compare end)
                                                     ^^^^^^^^^^^^^^^^^^
Alert deprecated: module Stdlib.Pervasives
Use Stdlib instead.

If you need to stay compatible with OCaml < 4.07, you can use the 
stdlib-shims library: https://github.com/ocaml/stdlib-shims
File "lib/frontend/typechecker.ml", line 89, characters 32-46:
89 |            | PPTvarid (y, _) -> Pervasives.(=) x y
                                     ^^^^^^^^^^^^^^
Alert deprecated: module Stdlib.Pervasives
Use Stdlib instead.

If you need to stay compatible with OCaml < 4.07, you can use the 
stdlib-shims library: https://github.com/ocaml/stdlib-shims
File "lib/frontend/typechecker.ml", line 108, characters 35-49:
108 |     | PPTexternal (l, s, loc) when Pervasives.(=) s "farray" ->
                                         ^^^^^^^^^^^^^^
Alert deprecated: module Stdlib.Pervasives
Use Stdlib instead.

If you need to stay compatible with OCaml < 4.07, you can use the 
stdlib-shims library: https://github.com/ocaml/stdlib-shims
File "lib/frontend/typechecker.ml", line 119, characters 35-49:
119 |         | Some (id, vars, ty) when Pervasives.(=) s id &&
                                         ^^^^^^^^^^^^^^
Alert deprecated: module Stdlib.Pervasives
Use Stdlib instead.

If you need to stay compatible with OCaml < 4.07, you can use the 
stdlib-shims library: https://github.com/ocaml/stdlib-shims
      ocamlc lib/.AltErgoLib.objs/byte/altErgoLib__Ite_rel.{cmo,cmt}
File "lib/reasoners/ite_rel.ml", line 35, characters 30-48:
35 |         if c <> 0 then c else Pervasives.compare b1 b2
                                   ^^^^^^^^^^^^^^^^^^
Alert deprecated: module Stdlib.Pervasives
Use Stdlib instead.

If you need to stay compatible with OCaml < 4.07, you can use the 
stdlib-shims library: https://github.com/ocaml/stdlib-shims
      ocamlc lib/.AltErgoLib.objs/byte/altErgoLib__Satml_frontend.{cmo,cmt}
File "lib/reasoners/satml_frontend.ml", line 511, characters 16-34:
511 |       let res = Pervasives.compare w2 w1 in
                      ^^^^^^^^^^^^^^^^^^
Alert deprecated: module Stdlib.Pervasives
Use Stdlib instead.

If you need to stay compatible with OCaml < 4.07, you can use the 
stdlib-shims library: https://github.com/ocaml/stdlib-shims
File "lib/reasoners/satml_frontend.ml", line 847, characters 24-38:
847 |     {Util.nb_triggers = Pervasives.max 2 (nb_triggers () * 2);
                              ^^^^^^^^^^^^^^
Alert deprecated: module Stdlib.Pervasives
Use Stdlib instead.

If you need to stay compatible with OCaml < 4.07, you can use the 
stdlib-shims library: https://github.com/ocaml/stdlib-shims
File "lib/reasoners/satml_frontend.ml", line 856, characters 24-38:
856 |     {Util.nb_triggers = Pervasives.max 10 (nb_triggers () * 10);
                              ^^^^^^^^^^^^^^
Alert deprecated: module Stdlib.Pervasives
Use Stdlib instead.

If you need to stay compatible with OCaml < 4.07, you can use the 
stdlib-shims library: https://github.com/ocaml/stdlib-shims
File "lib/reasoners/satml_frontend.ml", line 954, characters 19-33:
954 |     let aux mx f = Pervasives.max mx (E.depth f) in
                         ^^^^^^^^^^^^^^
Alert deprecated: module Stdlib.Pervasives
Use Stdlib instead.

If you need to stay compatible with OCaml < 4.07, you can use the 
stdlib-shims library: https://github.com/ocaml/stdlib-shims
      ocamlc lib/.AltErgoLib.objs/byte/altErgoLib__Satml.{cmo,cmt}
File "lib/reasoners/satml.ml", line 364, characters 4-18:
364 |     Pervasives.(<) (Vec.get env.vars j).weight (Vec.get env.vars i).weight
          ^^^^^^^^^^^^^^
Alert deprecated: module Stdlib.Pervasives
Use Stdlib instead.

If you need to stay compatible with OCaml < 4.07, you can use the 
stdlib-shims library: https://github.com/ocaml/stdlib-shims
File "lib/reasoners/satml.ml", line 378, characters 7-21:
378 |     if Pervasives.(>) v.weight 1e100 then begin
             ^^^^^^^^^^^^^^
Alert deprecated: module Stdlib.Pervasives
Use Stdlib instead.

If you need to stay compatible with OCaml < 4.07, you can use the 
stdlib-shims library: https://github.com/ocaml/stdlib-shims
File "lib/reasoners/satml.ml", line 390, characters 7-21:
390 |     if Pervasives.(>) c.activity 1e20 then begin
             ^^^^^^^^^^^^^^
Alert deprecated: module Stdlib.Pervasives
Use Stdlib instead.

If you need to stay compatible with OCaml < 4.07, you can use the 
stdlib-shims library: https://github.com/ocaml/stdlib-shims
      ocamlc lib/.AltErgoLib.objs/byte/altErgoLib__Fun_sat.{cmo,cmt}
File "lib/reasoners/fun_sat.ml", line 78, characters 34-49:
78 |              stable := !stable && Pervasives.(<=) w 1e100;
                                       ^^^^^^^^^^^^^^^
Alert deprecated: module Stdlib.Pervasives
Use Stdlib instead.

If you need to stay compatible with OCaml < 4.07, you can use the 
stdlib-shims library: https://github.com/ocaml/stdlib-shims
File "lib/reasoners/fun_sat.ml", line 121, characters 21-39:
121 |              let c = Pervasives.compare b2 b1 in
                           ^^^^^^^^^^^^^^^^^^
Alert deprecated: module Stdlib.Pervasives
Use Stdlib instead.

If you need to stay compatible with OCaml < 4.07, you can use the 
stdlib-shims library: https://github.com/ocaml/stdlib-shims
File "lib/reasoners/fun_sat.ml", line 123, characters 18-36:
123 |              else Pervasives.compare x2 x1
                        ^^^^^^^^^^^^^^^^^^
Alert deprecated: module Stdlib.Pervasives
Use Stdlib instead.

If you need to stay compatible with OCaml < 4.07, you can use the 
stdlib-shims library: https://github.com/ocaml/stdlib-shims
File "lib/reasoners/fun_sat.ml", line 1174, characters 7-22:
1174 |        Pervasives.(<>) (Options.interpretation_timelimit ()) 0. then
              ^^^^^^^^^^^^^^^
Alert deprecated: module Stdlib.Pervasives
Use Stdlib instead.

If you need to stay compatible with OCaml < 4.07, you can use the 
stdlib-shims library: https://github.com/ocaml/stdlib-shims