Package4.03.1+bench4.05.0+flambda+opt+bench4.06.1+flambda+bench4.06.1+flambda+opt+bench4.07.1+clambda+bench4.07.1+flambda+bench4.07.1+oclassic+bench4.08.0+gpr2165+bench4.08.0+mutmatch+bench4.08.0+trunk+bench4.08.0+trunk+flambda+bench4.08.0+trunk+flambda+oclassic+bench4.08.0+trunk+flambda+opt+bench4.03.1+bench time (s)4.05.0+flambda+opt+bench time (s)4.06.1+flambda+bench time (s)4.06.1+flambda+opt+bench time (s)4.07.1+clambda+bench time (s)4.07.1+flambda+bench time (s)4.07.1+oclassic+bench time (s)4.08.0+gpr2165+bench time (s)4.08.0+mutmatch+bench time (s)4.08.0+trunk+bench time (s)4.08.0+trunk+flambda+bench time (s)4.08.0+trunk+flambda+oclassic+bench time (s)4.08.0+trunk+flambda+opt+bench time (s)
almabench-bench.1.0----------AbortedAborted-----------0.0000.000-
alt-ergo.2.3.0----------AbortedAborted-----------0.0000.000-
alt-ergo-lib.2.3.0--------Aborted-AbortedAborted---------0.000-0.0000.000-
alt-ergo-parsers.2.3.0--------Aborted-AbortedAborted---------0.000-0.0000.000-
async.v0.12.0-------AbortedAbortedAbortedAbortedAborted--------0.0000.0000.0000.0000.000-
async-echo-bench.1.0Failure (2)---Failure (2)Failure (2)Failure (2)AbortedAbortedAbortedAbortedAborted-0.542---0.4330.4170.4260.0000.0000.0000.0000.000-
async-rpc-bench.1.0Failure (2)---Failure (2)Failure (2)Failure (2)AbortedAbortedAbortedAbortedAborted-0.562---0.5010.4860.4950.0000.0000.0000.0000.000-
async_extra.v0.12.0-------AbortedAbortedAbortedAbortedAborted--------0.0000.0000.0000.0000.000-
async_kernel.v0.12.0-------AbortedAbortedAbortedAbortedAborted--------0.0000.0000.0000.0000.000-
async_rpc_kernel.v0.12.0-------AbortedAbortedAbortedAbortedAborted--------0.0000.0000.0000.0000.000-
async_unix.v0.12.0-------AbortedAbortedAbortedAbortedAborted--------0.0000.0000.0000.0000.000-
base.v0.12.2--------AbortedAbortedAbortedAborted---------0.0000.0000.0000.000-
base-bytes.base-------AbortedAbortedAbortedAbortedAborted--------0.0000.0000.0000.0000.000-
base64.3.2.0-------AbortedAbortedAbortedAbortedAborted--------0.0000.0000.0000.0000.000-
base_bigstring.v0.12.0-------AbortedAbortedAbortedAbortedAborted--------0.0000.0000.0000.0000.000-
base_quickcheck.v0.12.0-------AbortedAbortedAbortedAbortedAborted--------0.0000.0000.0000.0000.000-
bdd-bench.1.0----------AbortedAborted-----------0.0000.000-
bin_prot.v0.12.0-------AbortedAbortedAbortedAbortedAborted--------0.0000.0000.0000.0000.000-
biniou.1.2.0---------AbortedAbortedAborted----------0.0000.0000.000-
camlimages.5.0.1-------AbortedAbortedAbortedAbortedAborted--------0.0000.0000.0000.0000.000-
camlpdf.1.7.1----Failure (2)Failure (2)Failure (2)AbortedAbortedAbortedAbortedAborted-----0.8000.7730.7820.0000.0000.0000.0000.000-
camlzip.1.08--------Aborted-AbortedAborted---------0.000-0.0000.000-
chameneos-bench.1.0Failure (2)---Failure (2)Failure (2)Failure (2)AbortedAbortedAbortedAbortedAborted-0.759---0.6460.7510.7310.0000.0000.0000.0000.000-
cohttp.2.1.2-------AbortedAbortedAbortedAbortedAborted--------0.0000.0000.0000.0000.000-
cohttp-bench.1.0Failure (2)---Failure (2)Failure (2)Failure (2)AbortedAbortedAbortedAbortedAborted-0.501---0.3830.3710.3700.0000.0000.0000.0000.000-
conf-graphviz.0.1Failure (1)---Failure (1)Failure (1)Failure (1)------0.435---0.2930.2920.292------
configurator.v0.11.0--------AbortedAbortedAbortedAborted---------0.0000.0000.0000.000-
core.v0.12.3-------AbortedAbortedAbortedAbortedAborted--------0.0000.0000.0000.0000.000-
core-micro-bench.1.0Failure (2)---Failure (2)Failure (2)Failure (2)AbortedAbortedAbortedAbortedAborted-0.421---0.2750.2750.2740.0000.0000.0000.0000.000-
core-sequence-bench.1.0-------AbortedAbortedAbortedAbortedAborted--------0.0000.0000.0000.0000.000-
core_bench.v0.12.0-------AbortedAbortedAbortedAbortedAborted--------0.0000.0000.0000.0000.000-
core_extended.v0.12.0-------AbortedAbortedAbortedAbortedAborted--------0.0000.0000.0000.0000.000-
core_kernel.v0.12.2-------AbortedAbortedAbortedAbortedAborted--------0.0000.0000.0000.0000.000-
cpdf.1.7----AbortedAbortedAbortedAbortedAbortedAbortedAbortedAborted-----0.0000.0000.0000.0000.0000.0000.0000.000-
cpdf-bench.1.0----AbortedAbortedAbortedAbortedAbortedAbortedAbortedAborted-----0.0000.0000.0000.0000.0000.0000.0000.000-
cppo.1.6.6--------AbortedAbortedAbortedAborted---------0.0000.0000.0000.000-
dune.1.10.0--------Failure (2)Failure (1)AbortedAborted---------0.49414.5070.0000.000-
easy-format.1.3.1---------AbortedAbortedAborted----------0.0000.0000.000-
expect_test_helpers.v0.12.0-------AbortedAbortedAbortedAbortedAborted--------0.0000.0000.0000.0000.000-
expect_test_helpers_kernel.v0.12.0-------AbortedAbortedAbortedAbortedAborted--------0.0000.0000.0000.0000.000-
fieldslib.v0.12.0--------AbortedAbortedAbortedAborted---------0.0000.0000.0000.000-
frama-c.19.0OK------------56.784------------
frama-c-bench.1.0OK------------0.105------------
jane-street-headers.v0.12.0---------AbortedAbortedAborted----------0.0000.0000.000-
jbuilder.transition--------AbortedAbortedAbortedAborted---------0.0000.0000.0000.000-
json-bench-data.1.0----------AbortedAborted-----------0.0000.000-
jsonm.1.0.1-------Aborted-AbortedAbortedAborted--------0.000-0.0000.0000.000-
jsonm-bench.1.0-------Aborted-AbortedAbortedAborted--------0.000-0.0000.0000.000-
jst-config.v0.12.0-------AbortedAbortedAbortedAbortedAborted--------0.0000.0000.0000.0000.000-
kb-bench.1.0----------AbortedAborted-----------0.0000.000-
lexifi-g2pp-bench.1.0----------AbortedAborted-----------0.0000.000-
lwt.4.2.1--------AbortedAbortedAbortedAborted---------0.0000.0000.0000.000-
menhir.20190626-------AbortedAbortedAbortedAbortedAborted--------0.0000.0000.0000.0000.000-
menhir-bench.1.0-------AbortedAbortedAbortedAbortedAborted--------0.0000.0000.0000.0000.000-
minilight.1.6----------AbortedAborted-----------0.0000.000-
minilight-bench.1.0----------AbortedAborted-----------0.0000.000-
mmap.1.1.0--------AbortedAbortedAbortedAborted---------0.0000.0000.0000.000-
nbcodec.1.0-------AbortedAbortedAbortedAbortedAborted--------0.0000.0000.0000.0000.000-
nbcodec-bench.1.0-------AbortedAbortedAbortedAbortedAborted--------0.0000.0000.0000.0000.000-
num.1.2-------AbortedAbortedAbortedAbortedAborted--------0.0000.0000.0000.0000.000-
numerical-analysis-bench.1.0-------Failure (2)-Failure (2)AbortedAborted--------6.008-6.5760.0000.000-
ocaml.4.08.0----------AbortedAborted-----------0.0000.000-
ocaml-compiler-libs.v0.12.0--------AbortedAbortedAbortedAborted---------0.0000.0000.0000.000-
ocaml-migrate-parsetree.1.4.0-------Failure (1)AbortedAbortedAbortedAborted--------0.5810.0000.0000.0000.000-
ocaml-variants.4.08.0+trunk+flambda----------Failure (1)------------0.298--
ocaml-variants.4.08.0+trunk+flambda+oclassic-----------Failure (1)------------0.303-
ocamlbuild.0.14.0----------AbortedAborted-----------0.0000.000-
ocamlfind.1.8.0-------Failure (1)OKFailure (1)AbortedAborted--------0.2242.0420.1440.0000.000-
ocplib-simplex.0.4--------Aborted-AbortedAborted---------0.000-0.0000.000-
octavius.1.2.1--------AbortedAbortedAbortedAborted---------0.0000.0000.0000.000-
parsexp.v0.12.0--------AbortedAbortedAbortedAborted---------0.0000.0000.0000.000-
patdiff.v0.12.0-------AbortedAbortedAbortedAbortedAborted--------0.0000.0000.0000.0000.000-
patdiff-bench.1.0-------AbortedAbortedAbortedAbortedAborted--------0.0000.0000.0000.0000.000-
patience_diff.v0.12.0-------AbortedAbortedAbortedAbortedAborted--------0.0000.0000.0000.0000.000-
pcre.7.4.1-------AbortedAbortedAbortedAbortedAborted--------0.0000.0000.0000.0000.000-
ppx_assert.v0.12.0-------AbortedAbortedAbortedAbortedAborted--------0.0000.0000.0000.0000.000-
ppx_base.v0.12.0-------AbortedAbortedAbortedAbortedAborted--------0.0000.0000.0000.0000.000-
ppx_bench.v0.12.0-------AbortedAbortedAbortedAbortedAborted--------0.0000.0000.0000.0000.000-
ppx_bin_prot.v0.12.1-------AbortedAbortedAbortedAbortedAborted--------0.0000.0000.0000.0000.000-
ppx_compare.v0.12.0-------AbortedAbortedAbortedAbortedAborted--------0.0000.0000.0000.0000.000-
ppx_custom_printf.v0.12.1-------AbortedAbortedAbortedAbortedAborted--------0.0000.0000.0000.0000.000-
ppx_derivers.1.2.1--------AbortedAbortedAbortedAborted---------0.0000.0000.0000.000-
ppx_enumerate.v0.12.0-------AbortedAbortedAbortedAbortedAborted--------0.0000.0000.0000.0000.000-
ppx_expect.v0.12.0-------AbortedAbortedAbortedAbortedAborted--------0.0000.0000.0000.0000.000-
ppx_fail.v0.12.0-------AbortedAbortedAbortedAbortedAborted--------0.0000.0000.0000.0000.000-
ppx_fields_conv.v0.12.0-------AbortedAbortedAbortedAbortedAborted--------0.0000.0000.0000.0000.000-
ppx_hash.v0.12.0-------AbortedAbortedAbortedAbortedAborted--------0.0000.0000.0000.0000.000-
ppx_here.v0.12.0-------AbortedAbortedAbortedAbortedAborted--------0.0000.0000.0000.0000.000-
ppx_inline_test.v0.12.0-------AbortedAbortedAbortedAbortedAborted--------0.0000.0000.0000.0000.000-
ppx_jane.v0.12.0-------AbortedAbortedAbortedAbortedAborted--------0.0000.0000.0000.0000.000-
ppx_js_style.v0.12.0-------AbortedAbortedAbortedAbortedAborted--------0.0000.0000.0000.0000.000-
ppx_let.v0.12.0-------AbortedAbortedAbortedAbortedAborted--------0.0000.0000.0000.0000.000-
ppx_module_timer.v0.12.0-------AbortedAbortedAbortedAbortedAborted--------0.0000.0000.0000.0000.000-
ppx_optcomp.v0.12.0-------AbortedAbortedAbortedAbortedAborted--------0.0000.0000.0000.0000.000-
ppx_optional.v0.12.0-------AbortedAbortedAbortedAbortedAborted--------0.0000.0000.0000.0000.000-
ppx_pipebang.v0.12.0-------AbortedAbortedAbortedAbortedAborted--------0.0000.0000.0000.0000.000-
ppx_sexp_conv.v0.12.0-------AbortedAbortedAbortedAbortedAborted--------0.0000.0000.0000.0000.000-
ppx_sexp_message.v0.12.0-------AbortedAbortedAbortedAbortedAborted--------0.0000.0000.0000.0000.000-
ppx_sexp_value.v0.12.0-------AbortedAbortedAbortedAbortedAborted--------0.0000.0000.0000.0000.000-
ppx_stable.v0.12.0-------AbortedAbortedAbortedAbortedAborted--------0.0000.0000.0000.0000.000-
ppx_typerep_conv.v0.12.0-------AbortedAbortedAbortedAbortedAborted--------0.0000.0000.0000.0000.000-
ppx_variants_conv.v0.12.0-------AbortedAbortedAbortedAbortedAborted--------0.0000.0000.0000.0000.000-
ppxlib.0.8.0-------AbortedAbortedAbortedAbortedAborted--------0.0000.0000.0000.0000.000-
protocol_version_header.v0.12.0-------AbortedAbortedAbortedAbortedAborted--------0.0000.0000.0000.0000.000-
psmt2-frontend.0.2--------Aborted-AbortedAborted---------0.000-0.0000.000-
re.1.9.0--------AbortedAbortedAbortedAborted---------0.0000.0000.0000.000-
re2.v0.12.0-------AbortedAbortedAbortedAbortedAborted--------0.0000.0000.0000.0000.000-
result.1.4--------AbortedAbortedAbortedAborted---------0.0000.0000.0000.000-
sauvola-bench.1.0-------AbortedAbortedAbortedAbortedAborted--------0.0000.0000.0000.0000.000-
seq.base----------AbortedAborted-----------0.0000.000-
sequence-bench.1.0----------AbortedAborted-----------0.0000.000-
sexp_pretty.v0.12.0-------AbortedAbortedAbortedAbortedAborted--------0.0000.0000.0000.0000.000-
sexplib.v0.12.0-------AbortedAbortedAbortedAbortedAborted--------0.0000.0000.0000.0000.000-
sexplib0.v0.12.0--------AbortedAbortedAbortedAborted---------0.0000.0000.0000.000-
shell.v0.12.0-------AbortedAbortedAbortedAbortedAborted--------0.0000.0000.0000.0000.000-
spawn.v0.13.0--------AbortedAbortedAbortedAborted---------0.0000.0000.0000.000-
splittable_random.v0.12.0-------AbortedAbortedAbortedAbortedAborted--------0.0000.0000.0000.0000.000-
stdio.v0.12.0--------AbortedAbortedAbortedAborted---------0.0000.0000.0000.000-
stringext.1.6.0-------AbortedAbortedAbortedAbortedAborted--------0.0000.0000.0000.0000.000-
textutils.v0.12.0-------AbortedAbortedAbortedAbortedAborted--------0.0000.0000.0000.0000.000-
thread-bench.1.0----Failure (2)Failure (2)Failure (2)AbortedAbortedAbortedAbortedAborted-----0.6530.7780.7600.0000.0000.0000.0000.000-
time_now.v0.12.0-------AbortedAbortedAbortedAbortedAborted--------0.0000.0000.0000.0000.000-
topkg.1.0.0-------AbortedAbortedAbortedAbortedAborted--------0.0000.0000.0000.0000.000-
typerep.v0.12.0--------AbortedAbortedAbortedAborted---------0.0000.0000.0000.000-
uchar.0.0.2----------AbortedAborted-----------0.0000.000-
uri.2.2.1-------AbortedAbortedAbortedAbortedAborted--------0.0000.0000.0000.0000.000-
uutf.1.0.2-------Aborted-AbortedAbortedAborted--------0.000-0.0000.0000.000-
valet-bench.1.0Failure (2)------------0.537------------
variantslib.v0.12.0--------AbortedAbortedAbortedAborted---------0.0000.0000.0000.000-
yojson.1.7.0---------AbortedAbortedAborted----------0.0000.0000.000-
yojson-bench.1.0Failure (2)---Failure (2)Failure (2)Failure (2)Failure (2)Failure (2)AbortedAbortedAborted-0.136---0.1510.2080.1730.0930.1440.0000.0000.000-
zarith.1.7--------Aborted-AbortedAborted---------0.000-0.0000.000-
Close

Error on yojson-bench.1.0 (4.08.0+mutmatch+bench)

Command:

/usr/bin/make -C yojson

Output

make: Entering directory '/home/louis/.opam/4.08.0+mutmatch+bench/.opam-switch/build/yojson-bench.1.0/yojson'
ocamlfind ocamlopt -I `ocamlfind query yojson` -o ydump_bench -package easy-format,biniou -linkpkg yojson.cmx yojson_biniou.cmx ydump.ml
gcc: error: /home/louis/.opam/4.08.0+mutmatch+bench/lib/yojson/yojson_biniou.o: No such file or directory
gcc: error: /home/louis/.opam/4.08.0+mutmatch+bench/lib/yojson/yojson.o: No such file or directory
File "caml_startup", line 1:
Error: Error during linking
Makefile:6: recipe for target 'all' failed
make: *** [all] Error 2
make: Leaving directory '/home/louis/.opam/4.08.0+mutmatch+bench/.opam-switch/build/yojson-bench.1.0/yojson'
Close

Error on yojson-bench.1.0 (4.08.0+gpr2165+bench)

Command:

/usr/bin/make -C yojson

Output

make: Entering directory '/home/louis/.opam/4.08.0+gpr2165+bench/.opam-switch/build/yojson-bench.1.0/yojson'
ocamlfind ocamlopt -I `ocamlfind query yojson` -o ydump_bench -package easy-format,biniou -linkpkg yojson.cmx yojson_biniou.cmx ydump.ml
ocamlfind: Package `yojson' not found
ocamlfind: Package `easy-format' not found
Makefile:6: recipe for target 'all' failed
make: *** [all] Error 2
make: Leaving directory '/home/louis/.opam/4.08.0+gpr2165+bench/.opam-switch/build/yojson-bench.1.0/yojson'
Close

Error on yojson-bench.1.0 (4.07.1+oclassic+bench)

Command:

/usr/bin/make -C yojson

Output

make: Entering directory '/home/louis/.opam/4.07.1+oclassic+bench/.opam-switch/build/yojson-bench.1.0/yojson'
ocamlfind ocamlopt -I `ocamlfind query yojson` -o ydump_bench -package easy-format,biniou -linkpkg yojson.cmx yojson_biniou.cmx ydump.ml
gcc: error: /home/louis/.opam/4.07.1+oclassic+bench/lib/yojson/yojson_biniou.o: No such file or directory
gcc: error: /home/louis/.opam/4.07.1+oclassic+bench/lib/yojson/yojson.o: No such file or directory
File "caml_startup", line 1:
Error: Error during linking
Makefile:6: recipe for target 'all' failed
make: *** [all] Error 2
make: Leaving directory '/home/louis/.opam/4.07.1+oclassic+bench/.opam-switch/build/yojson-bench.1.0/yojson'
Close

Error on yojson-bench.1.0 (4.07.1+flambda+bench)

Command:

/usr/bin/make -C yojson

Output

make: Entering directory '/home/louis/.opam/4.07.1+flambda+bench/.opam-switch/build/yojson-bench.1.0/yojson'
ocamlfind ocamlopt -I `ocamlfind query yojson` -o ydump_bench -package easy-format,biniou -linkpkg yojson.cmx yojson_biniou.cmx ydump.ml
gcc: error: /home/louis/.opam/4.07.1+flambda+bench/lib/yojson/yojson_biniou.o: No such file or directory
gcc: error: /home/louis/.opam/4.07.1+flambda+bench/lib/yojson/yojson.o: No such file or directory
File "caml_startup", line 1:
Error: Error during linking
Makefile:6: recipe for target 'all' failed
make: *** [all] Error 2
make: Leaving directory '/home/louis/.opam/4.07.1+flambda+bench/.opam-switch/build/yojson-bench.1.0/yojson'
Close

Error on yojson-bench.1.0 (4.07.1+clambda+bench)

Command:

/usr/bin/make -C yojson

Output

make: Entering directory '/home/louis/.opam/4.07.1+flambda+bench/.opam-switch/build/yojson-bench.1.0/yojson'
ocamlfind ocamlopt -I `ocamlfind query yojson` -o ydump_bench -package easy-format,biniou -linkpkg yojson.cmx yojson_biniou.cmx ydump.ml
gcc: error: /home/louis/.opam/4.07.1+flambda+bench/lib/yojson/yojson_biniou.o: No such file or directory
gcc: error: /home/louis/.opam/4.07.1+flambda+bench/lib/yojson/yojson.o: No such file or directory
File "caml_startup", line 1:
Error: Error during linking
Makefile:6: recipe for target 'all' failed
make: *** [all] Error 2
make: Leaving directory '/home/louis/.opam/4.07.1+flambda+bench/.opam-switch/build/yojson-bench.1.0/yojson'
make: Entering directory '/home/louis/.opam/4.07.1+oclassic+bench/.opam-switch/build/yojson-bench.1.0/yojson'
ocamlfind ocamlopt -I `ocamlfind query yojson` -o ydump_bench -package easy-format,biniou -linkpkg yojson.cmx yojson_biniou.cmx ydump.ml
gcc: error: /home/louis/.opam/4.07.1+oclassic+bench/lib/yojson/yojson_biniou.o: No such file or directory
gcc: error: /home/louis/.opam/4.07.1+oclassic+bench/lib/yojson/yojson.o: No such file or directory
File "caml_startup", line 1:
Error: Error during linking
Makefile:6: recipe for target 'all' failed
make: *** [all] Error 2
make: Leaving directory '/home/louis/.opam/4.07.1+oclassic+bench/.opam-switch/build/yojson-bench.1.0/yojson'
make: Entering directory '/home/louis/.opam/4.07.1+clambda+bench/.opam-switch/build/yojson-bench.1.0/yojson'
ocamlfind ocamlopt -I `ocamlfind query yojson` -o ydump_bench -package easy-format,biniou -linkpkg yojson.cmx yojson_biniou.cmx ydump.ml
gcc: error: /home/louis/.opam/4.07.1+clambda+bench/lib/yojson/yojson_biniou.o: No such file or directory
gcc: error: /home/louis/.opam/4.07.1+clambda+bench/lib/yojson/yojson.o: No such file or directory
File "caml_startup", line 1:
Error: Error during linking
Makefile:6: recipe for target 'all' failed
make: *** [all] Error 2
make: Leaving directory '/home/louis/.opam/4.07.1+clambda+bench/.opam-switch/build/yojson-bench.1.0/yojson'
Close

Error on yojson-bench.1.0 (4.03.1+bench)

Command:

/usr/bin/make -C yojson

Output

make: Entering directory '/home/louis/.opam/4.03.1+bench/.opam-switch/build/yojson-bench.1.0/yojson'
ocamlfind ocamlopt -I `ocamlfind query yojson` -o ydump_bench -package easy-format,biniou -linkpkg yojson.cmx yojson_biniou.cmx ydump.ml
gcc: error: /home/louis/.opam/4.03.1+bench/lib/yojson/yojson_biniou.o: No such file or directory
gcc: error: /home/louis/.opam/4.03.1+bench/lib/yojson/yojson.o: No such file or directory
File "caml_startup", line 1:
Error: Error during linking
Makefile:6: recipe for target 'all' failed
make: *** [all] Error 2
make: Leaving directory '/home/louis/.opam/4.03.1+bench/.opam-switch/build/yojson-bench.1.0/yojson'
Close

Error on valet-bench.1.0 (4.03.1+bench)

Command:

/usr/bin/make -C valet

Output

make: Entering directory '/home/louis/.opam/4.03.1+bench/.opam-switch/build/valet-bench.1.0/valet'
ocamlbuild -use-ocamlfind test_lwt.native test_async.native
ocamlfind ocamldep -package react -package uuidm -package unix -package ocplib-endian -package lwt.unix -modules test_lwt.ml > test_lwt.ml.depends
ocamlfind ocamldep -package react -package uuidm -package ocplib-endian -modules test_lib.ml > test_lib.ml.depends
ocamlfind ocamldep -package uuidm -package unix -package ocplib-endian -modules valet_core.ml > valet_core.ml.depends
ocamlfind ocamldep -package react -package uuidm -package ocplib-endian -modules valet_react.ml > valet_react.ml.depends
ocamlfind ocamlc -c -g -bin-annot -package uuidm -package unix -package ocplib-endian -o valet_core.cmo valet_core.ml
ocamlfind ocamlc -c -g -bin-annot -package react -package uuidm -package ocplib-endian -o valet_react.cmo valet_react.ml
ocamlfind ocamlc -c -g -bin-annot -package react -package uuidm -package ocplib-endian -o test_lib.cmo test_lib.ml
ocamlfind ocamlc -c -g -bin-annot -package react -package uuidm -package unix -package ocplib-endian -package lwt.unix -o test_lwt.cmo test_lwt.ml
+ ocamlfind ocamlc -c -g -bin-annot -package react -package uuidm -package unix -package ocplib-endian -package lwt.unix -o test_lwt.cmo test_lwt.ml
ocamlfind: [WARNING] Package `threads': Linking problems may arise because of the missing -thread or -vmthread switch
ocamlfind ocamlopt -c -g -bin-annot -package uuidm -package unix -package ocplib-endian -o valet_core.cmx valet_core.ml
ocamlfind ocamlopt -c -g -bin-annot -package react -package uuidm -package ocplib-endian -o valet_react.cmx valet_react.ml
ocamlfind ocamlopt -c -g -bin-annot -package react -package uuidm -package ocplib-endian -o test_lib.cmx test_lib.ml
ocamlfind ocamlopt -c -g -bin-annot -package react -package uuidm -package unix -package ocplib-endian -package lwt.unix -o test_lwt.cmx test_lwt.ml
+ ocamlfind ocamlopt -c -g -bin-annot -package react -package uuidm -package unix -package ocplib-endian -package lwt.unix -o test_lwt.cmx test_lwt.ml
ocamlfind: [WARNING] Package `threads': Linking problems may arise because of the missing -thread or -vmthread switch
ocamlfind ocamlopt -linkpkg -g -package react -package uuidm -package unix -package ocplib-endian -package lwt.unix valet_core.cmx valet_react.cmx test_lib.cmx test_lwt.cmx -o test_lwt.native
+ ocamlfind ocamlopt -linkpkg -g -package react -package uuidm -package unix -package ocplib-endian -package lwt.unix valet_core.cmx valet_react.cmx test_lib.cmx test_lwt.cmx -o test_lwt.native
ocamlfind: [WARNING] Package `threads': Linking problems may arise because of the missing -thread or -vmthread switch
ocamlfind ocamldep -package react -package uuidm -package unix -package ocplib-endian -package async -modules test_async.ml > test_async.ml.depends
ocamlfind ocamlc -c -g -bin-annot -thread -package react -package uuidm -package unix -package ocplib-endian -package async -o test_async.cmo test_async.ml
+ ocamlfind ocamlc -c -g -bin-annot -thread -package react -package uuidm -package unix -package ocplib-endian -package async -o test_async.cmo test_async.ml
File "test_async.ml", line 3, characters 5-13:
Warning 3: deprecated: module Core.Std
[since 2017-02] Use Core. The Std sub-module is no longer needed
File "test_async.ml", line 4, characters 5-14:
Warning 3: deprecated: module Async.Std
[since 2017-02] use Async. The Std sub-module is no longer needed
File "test_async.ml", line 23, characters 13-22:
Warning 3: deprecated: module Async.Std
[since 2017-02] use Async. The Std sub-module is no longer needed
File "test_async.ml", line 64, characters 5-19:
Error: This expression has type
         [> `Probably_should_not_use_blocking_Core_Printf_functions_with_Async ]
       This is not a function; it cannot be applied.
Command exited with code 2.
Makefile:6: recipe for target 'all' failed
make: *** [all] Error 10
make: Leaving directory '/home/louis/.opam/4.03.1+bench/.opam-switch/build/valet-bench.1.0/valet'
Close

Error on thread-bench.1.0 (4.07.1+oclassic+bench)

Command:

/usr/bin/make -C thread

Output

make: Entering directory '/home/louis/.opam/4.07.1+oclassic+bench/.opam-switch/build/thread-bench.1.0/thread'
ocamlfind ocamlopt -package lwt.unix -linkpkg -o thread_sleep_lwt thread_sleep_lwt.ml
ocamlfind: [WARNING] Package `threads': Linking problems may arise because of the missing -thread or -vmthread switch
ocamlfind ocamlopt -package lwt.unix -linkpkg -o thread_ring_lwt_mvar thread_ring_lwt_mvar.ml
ocamlfind: [WARNING] Package `threads': Linking problems may arise because of the missing -thread or -vmthread switch
ocamlfind ocamlopt -package lwt.unix -linkpkg -o thread_ring_lwt_stream thread_ring_lwt_stream.ml
ocamlfind: [WARNING] Package `threads': Linking problems may arise because of the missing -thread or -vmthread switch
ocamlfind ocamlopt -thread -package async -linkpkg -o thread_sleep_async thread_sleep_async.ml
File "thread_sleep_async.ml", line 1, characters 5-13:
Error: Unbound module Core.Std
Makefile:10: recipe for target 'thread_sleep_async' failed
make: *** [thread_sleep_async] Error 2
make: Leaving directory '/home/louis/.opam/4.07.1+oclassic+bench/.opam-switch/build/thread-bench.1.0/thread'
Close

Error on thread-bench.1.0 (4.07.1+flambda+bench)

Command:

/usr/bin/make -C thread

Output

make: Entering directory '/home/louis/.opam/4.07.1+flambda+bench/.opam-switch/build/thread-bench.1.0/thread'
ocamlfind ocamlopt -package lwt.unix -linkpkg -o thread_sleep_lwt thread_sleep_lwt.ml
ocamlfind: [WARNING] Package `threads': Linking problems may arise because of the missing -thread or -vmthread switch
ocamlfind ocamlopt -package lwt.unix -linkpkg -o thread_ring_lwt_mvar thread_ring_lwt_mvar.ml
ocamlfind: [WARNING] Package `threads': Linking problems may arise because of the missing -thread or -vmthread switch
ocamlfind ocamlopt -package lwt.unix -linkpkg -o thread_ring_lwt_stream thread_ring_lwt_stream.ml
ocamlfind: [WARNING] Package `threads': Linking problems may arise because of the missing -thread or -vmthread switch
ocamlfind ocamlopt -thread -package async -linkpkg -o thread_sleep_async thread_sleep_async.ml
File "thread_sleep_async.ml", line 1, characters 5-13:
Error: Unbound module Core.Std
Makefile:10: recipe for target 'thread_sleep_async' failed
make: *** [thread_sleep_async] Error 2
make: Leaving directory '/home/louis/.opam/4.07.1+flambda+bench/.opam-switch/build/thread-bench.1.0/thread'
Close

Error on thread-bench.1.0 (4.07.1+clambda+bench)

Command:

/usr/bin/make -C thread

Output

make: Entering directory '/home/louis/.opam/4.07.1+flambda+bench/.opam-switch/build/thread-bench.1.0/thread'
ocamlfind ocamlopt -package lwt.unix -linkpkg -o thread_sleep_lwt thread_sleep_lwt.ml
ocamlfind: [WARNING] Package `threads': Linking problems may arise because of the missing -thread or -vmthread switch
ocamlfind ocamlopt -package lwt.unix -linkpkg -o thread_ring_lwt_mvar thread_ring_lwt_mvar.ml
ocamlfind: [WARNING] Package `threads': Linking problems may arise because of the missing -thread or -vmthread switch
ocamlfind ocamlopt -package lwt.unix -linkpkg -o thread_ring_lwt_stream thread_ring_lwt_stream.ml
ocamlfind: [WARNING] Package `threads': Linking problems may arise because of the missing -thread or -vmthread switch
ocamlfind ocamlopt -thread -package async -linkpkg -o thread_sleep_async thread_sleep_async.ml
File "thread_sleep_async.ml", line 1, characters 5-13:
Warning 3: deprecated: module Core.Std
[since 2017-02] Use Core. The Std sub-module is no longer needed
File "thread_sleep_async.ml", line 2, characters 5-14:
Error: Unbound module Async.Std
Makefile:10: recipe for target 'thread_sleep_async' failed
make: *** [thread_sleep_async] Error 2
make: Leaving directory '/home/louis/.opam/4.07.1+flambda+bench/.opam-switch/build/thread-bench.1.0/thread'
make: Entering directory '/home/louis/.opam/4.07.1+oclassic+bench/.opam-switch/build/thread-bench.1.0/thread'
ocamlfind ocamlopt -package lwt.unix -linkpkg -o thread_sleep_lwt thread_sleep_lwt.ml
ocamlfind: [WARNING] Package `threads': Linking problems may arise because of the missing -thread or -vmthread switch
ocamlfind ocamlopt -package lwt.unix -linkpkg -o thread_ring_lwt_mvar thread_ring_lwt_mvar.ml
ocamlfind: [WARNING] Package `threads': Linking problems may arise because of the missing -thread or -vmthread switch
ocamlfind ocamlopt -package lwt.unix -linkpkg -o thread_ring_lwt_stream thread_ring_lwt_stream.ml
ocamlfind: [WARNING] Package `threads': Linking problems may arise because of the missing -thread or -vmthread switch
ocamlfind ocamlopt -thread -package async -linkpkg -o thread_sleep_async thread_sleep_async.ml
File "thread_sleep_async.ml", line 1, characters 5-13:
Error: Unbound module Core.Std
Makefile:10: recipe for target 'thread_sleep_async' failed
make: *** [thread_sleep_async] Error 2
make: Leaving directory '/home/louis/.opam/4.07.1+oclassic+bench/.opam-switch/build/thread-bench.1.0/thread'
make: Entering directory '/home/louis/.opam/4.07.1+clambda+bench/.opam-switch/build/thread-bench.1.0/thread'
ocamlfind ocamlopt -package lwt.unix -linkpkg -o thread_sleep_lwt thread_sleep_lwt.ml
ocamlfind: [WARNING] Package `threads': Linking problems may arise because of the missing -thread or -vmthread switch
ocamlfind ocamlopt -package lwt.unix -linkpkg -o thread_ring_lwt_mvar thread_ring_lwt_mvar.ml
ocamlfind: [WARNING] Package `threads': Linking problems may arise because of the missing -thread or -vmthread switch
ocamlfind ocamlopt -package lwt.unix -linkpkg -o thread_ring_lwt_stream thread_ring_lwt_stream.ml
ocamlfind: [WARNING] Package `threads': Linking problems may arise because of the missing -thread or -vmthread switch
ocamlfind ocamlopt -thread -package async -linkpkg -o thread_sleep_async thread_sleep_async.ml
File "thread_sleep_async.ml", line 1, characters 5-13:
Error: Unbound module Core.Std
Makefile:10: recipe for target 'thread_sleep_async' failed
make: *** [thread_sleep_async] Error 2
make: Leaving directory '/home/louis/.opam/4.07.1+clambda+bench/.opam-switch/build/thread-bench.1.0/thread'
Close

Error on ocamlfind.1.8.0 (4.08.0+trunk+bench)

Command:

~/.opam/4.08.0+trunk+bench/.opam-switch/build/ocamlfind.1.8.0/./configure -bindir /home/louis/.opam/4.08.0+trunk+bench/bin -sitelib /home/louis/.opam/4.08.0+trunk+bench/lib -mandir /home/louis/.opam/4.08.0+trunk+bench/man -config /home/louis/.opam/4.08.0+trunk+bench/lib/findlib.conf -no-custom -no-camlp4

Output

Welcome to findlib version 1.8.0
Configuring core...
Checking for #remove_directory...
Testing threading model...
The -vmthread switch is not supported: Your ocaml version is too old!
Close

Error on ocamlfind.1.8.0 (4.08.0+gpr2165+bench)

Command:

~/.opam/4.08.0+gpr2165+bench/.opam-switch/build/ocamlfind.1.8.0/./configure -bindir /home/louis/.opam/4.08.0+gpr2165+bench/bin -sitelib /home/louis/.opam/4.08.0+gpr2165+bench/lib -mandir /home/louis/.opam/4.08.0+gpr2165+bench/man -config /home/louis/.opam/4.08.0+gpr2165+bench/lib/findlib.conf -no-custom -no-camlp4

Output

Welcome to findlib version 1.8.0
Configuring core...
Checking for #remove_directory...
Testing threading model...
The -vmthread switch is not supported: Your ocaml version is too old!
Close

Error on ocaml-variants.4.08.0+trunk+flambda+oclassic (4.08.0+trunk+flambda+oclassic+bench)

Command:

~/.opam/4.08.0+trunk+flambda+oclassic+bench/.opam-switch/build/ocaml-variants.4.08.0+trunk+flambda+oclassic/./configure -prefix /home/louis/.opam/4.08.0+trunk+flambda+oclassic+bench -flambda -with-debug-runtime

Output

configure: error: unrecognized option: `-flambda'
Try `/home/louis/.opam/4.08.0+trunk+flambda+oclassic+bench/.opam-switch/build/ocaml-variants.4.08.0+trunk+flambda+oclassic/./configure --help' for more information
Close

Error on ocaml-variants.4.08.0+trunk+flambda (4.08.0+trunk+flambda+bench)

Command:

~/.opam/4.08.0+trunk+flambda+bench/.opam-switch/build/ocaml-variants.4.08.0+trunk+flambda/./configure -prefix /home/louis/.opam/4.08.0+trunk+flambda+bench -flambda -with-debug-runtime

Output

configure: error: unrecognized option: `-flambda'
Try `/home/louis/.opam/4.08.0+trunk+flambda+bench/.opam-switch/build/ocaml-variants.4.08.0+trunk+flambda/./configure --help' for more information
Close

Error on ocaml-migrate-parsetree.1.4.0 (4.08.0+gpr2165+bench)

Command:

~/.opam/4.08.0+gpr2165+bench/bin/dune build -p ocaml-migrate-parsetree -j 7

Output

       ocaml src/ast-version,src/compiler-functions-file (exit 1)
(cd _build/default/src && /home/louis/.opam/4.08.0+gpr2165+bench/bin/ocaml config/gen.ml 4.10.0+dev0-2019-04-23)
Unkown OCaml version 4.10.0+dev0-2019-04-23
Close

Error on numerical-analysis-bench.1.0 (4.08.0+trunk+bench)

Command:

/usr/bin/make

Output

ulimit -s 98304; ocamlopt.opt  -I simple_access `ocamldep.opt -sort simple_access/*.ml` main_nogcstats.ml -o simple_access.opt
ulimit -s 98304; ocamlopt.opt  -I lu-decomposition `ocamldep.opt -sort lu-decomposition/*.ml` main_nogcstats.ml -o lu-decomposition.opt
ulimit -s 98304; ocamlopt.opt  -I fft `ocamldep.opt -sort fft/*.ml` main_nogcstats.ml -o fft.opt
ulimit -s 98304; ocamlopt.opt  -I rnd_access `ocamldep.opt -sort rnd_access/*.ml` main_nogcstats.ml -o rnd_access.opt
ulimit -s 98304; ocamlopt.opt  -I k-means `ocamldep.opt -sort k-means/*.ml` main_nogcstats.ml -o k-means.opt
Fatal error: exception Stack overflow
Makefile:20: recipe for target 'k-means.opt' failed
make: *** [k-means.opt] Error 2
Close

Error on numerical-analysis-bench.1.0 (4.08.0+gpr2165+bench)

Command:

/usr/bin/make

Output

ulimit -s 98304; ocamlopt.opt  -I simple_access `ocamldep.opt -sort simple_access/*.ml` main_nogcstats.ml -o simple_access.opt
ulimit -s 98304; ocamlopt.opt  -I lu-decomposition `ocamldep.opt -sort lu-decomposition/*.ml` main_nogcstats.ml -o lu-decomposition.opt
ulimit -s 98304; ocamlopt.opt  -I fft `ocamldep.opt -sort fft/*.ml` main_nogcstats.ml -o fft.opt
ulimit -s 98304; ocamlopt.opt  -I rnd_access `ocamldep.opt -sort rnd_access/*.ml` main_nogcstats.ml -o rnd_access.opt
ulimit -s 98304; ocamlopt.opt  -I k-means `ocamldep.opt -sort k-means/*.ml` main_nogcstats.ml -o k-means.opt
Fatal error: exception Stack overflow
Makefile:20: recipe for target 'k-means.opt' failed
make: *** [k-means.opt] Error 2
Close

Error on dune.1.10.0 (4.08.0+trunk+bench)

Command:

~/.opam/4.08.0+trunk+bench/.opam-switch/build/dune.1.10.0/./boot.exe --release -j 7

Output

File "src/stdune/result/result.mli", line 6, characters 7-17:
6 |   open Pervasives
           ^^^^^^^^^^
Alert deprecated: module Stdlib.Pervasives
Use Stdlib instead.

If you need to stay compatible with OCaml < 4.07, you can use the 
stdlib-shims library: https://github.com/ocaml/stdlib-shims
File "src/stdune/result/result.ml", line 4, characters 7-17:
4 |   open Pervasives
           ^^^^^^^^^^
Alert deprecated: module Stdlib.Pervasives
Use Stdlib instead.

If you need to stay compatible with OCaml < 4.07, you can use the 
stdlib-shims library: https://github.com/ocaml/stdlib-shims
File "src/stdune/sexp.ml", line 66, characters 45-59:
66 | let string_equal (x : string) (y : string) = Pervasives.(=) x y
                                                  ^^^^^^^^^^^^^^
Alert deprecated: module Stdlib.Pervasives
Use Stdlib instead.

If you need to stay compatible with OCaml < 4.07, you can use the 
stdlib-shims library: https://github.com/ocaml/stdlib-shims
File "src/stdune/result/result.ml", line 4, characters 7-17:
4 |   open Pervasives
           ^^^^^^^^^^
Alert deprecated: module Stdlib.Pervasives
Use Stdlib instead.

If you need to stay compatible with OCaml < 4.07, you can use the 
stdlib-shims library: https://github.com/ocaml/stdlib-shims
File "src/stdune/pp.ml", line 113, characters 8-19:
113 |         pp_open_tag ppf (embed_tag ~opening ~closing);
              ^^^^^^^^^^^
Alert deprecated: Stdlib.Format.pp_open_tag
Use Format.pp_open_stag.
File "src/stdune/pp.ml", line 115, characters 8-20:
115 |         pp_close_tag ppf ()
              ^^^^^^^^^^^^
Alert deprecated: Stdlib.Format.pp_close_tag
Use Format.pp_close_stag.
File "src/stdune/pp.ml", line 118, characters 18-48:
118 |       let funcs = pp_get_formatter_tag_functions ppf () in
                        ^^^^^^^^^^^^^^^^^^^^^^^^^^^^^^
Alert deprecated: Stdlib.Format.pp_get_formatter_tag_functions
Use Format.pp_get_formatter_stag_functions.
File "src/stdune/pp.ml", line 120, characters 6-36:
120 |       pp_set_formatter_tag_functions ppf
            ^^^^^^^^^^^^^^^^^^^^^^^^^^^^^^
Alert deprecated: Stdlib.Format.pp_set_formatter_tag_functions
This function will erase non-string tag formatting functions. Use Format.pp_set_formatter_stag_functions.
File "src/stdune/list.ml", line 140, characters 23-38:
140 | let physically_equal = Pervasives.(==)
                             ^^^^^^^^^^^^^^^
Alert deprecated: module Stdlib.Pervasives
Use Stdlib instead.

If you need to stay compatible with OCaml < 4.07, you can use the 
stdlib-shims library: https://github.com/ocaml/stdlib-shims
File "src/stdune/sexp.ml", line 66, characters 45-59:
66 | let string_equal (x : string) (y : string) = Pervasives.(=) x y
                                                  ^^^^^^^^^^^^^^
Alert deprecated: module Stdlib.Pervasives
Use Stdlib instead.

If you need to stay compatible with OCaml < 4.07, you can use the 
stdlib-shims library: https://github.com/ocaml/stdlib-shims
File "src/stdune/list.ml", line 140, characters 23-38:
140 | let physically_equal = Pervasives.(==)
                             ^^^^^^^^^^^^^^^
Alert deprecated: module Stdlib.Pervasives
Use Stdlib instead.

If you need to stay compatible with OCaml < 4.07, you can use the 
stdlib-shims library: https://github.com/ocaml/stdlib-shims
File "src/stdune/io.ml", line 1, characters 11-21:
1 | module P = Pervasives
               ^^^^^^^^^^
Alert deprecated: module Stdlib.Pervasives
Use Stdlib instead.

If you need to stay compatible with OCaml < 4.07, you can use the 
stdlib-shims library: https://github.com/ocaml/stdlib-shims
File "src/stdune/pp.ml", line 113, characters 8-19:
113 |         pp_open_tag ppf (embed_tag ~opening ~closing);
              ^^^^^^^^^^^
Alert deprecated: Stdlib.Format.pp_open_tag
Use Format.pp_open_stag.
File "src/stdune/pp.ml", line 115, characters 8-20:
115 |         pp_close_tag ppf ()
              ^^^^^^^^^^^^
Alert deprecated: Stdlib.Format.pp_close_tag
Use Format.pp_close_stag.
File "src/stdune/pp.ml", line 118, characters 18-48:
118 |       let funcs = pp_get_formatter_tag_functions ppf () in
                        ^^^^^^^^^^^^^^^^^^^^^^^^^^^^^^
Alert deprecated: Stdlib.Format.pp_get_formatter_tag_functions
Use Format.pp_get_formatter_stag_functions.
File "src/stdune/pp.ml", line 120, characters 6-36:
120 |       pp_set_formatter_tag_functions ppf
            ^^^^^^^^^^^^^^^^^^^^^^^^^^^^^^
Alert deprecated: Stdlib.Format.pp_set_formatter_tag_functions
This function will erase non-string tag formatting functions. Use Format.pp_set_formatter_stag_functions.
File "src/dune_lang/dune_lang.ml", line 105, characters 15-52:
105 |   let tfuncs = Format.pp_get_formatter_tag_functions ppf () in
                     ^^^^^^^^^^^^^^^^^^^^^^^^^^^^^^^^^^^^^
Alert deprecated: Stdlib.Format.pp_get_formatter_tag_functions
Use Format.pp_get_formatter_stag_functions.
File "src/dune_lang/dune_lang.ml", line 106, characters 2-39:
106 |   Format.pp_set_formatter_tag_functions ppf
        ^^^^^^^^^^^^^^^^^^^^^^^^^^^^^^^^^^^^^
Alert deprecated: Stdlib.Format.pp_set_formatter_tag_functions
This function will erase non-string tag formatting functions. Use Format.pp_set_formatter_stag_functions.
File "src/stdune/io.ml", line 1, characters 11-21:
1 | module P = Pervasives
               ^^^^^^^^^^
Alert deprecated: module Stdlib.Pervasives
Use Stdlib instead.

If you need to stay compatible with OCaml < 4.07, you can use the 
stdlib-shims library: https://github.com/ocaml/stdlib-shims
File "src/catapult/catapult.ml", line 49, characters 16-35:
49 |   let channel = Pervasives.open_out path in
                     ^^^^^^^^^^^^^^^^^^^
Alert deprecated: module Stdlib.Pervasives
Use Stdlib instead.

If you need to stay compatible with OCaml < 4.07, you can use the 
stdlib-shims library: https://github.com/ocaml/stdlib-shims
File "src/catapult/catapult.ml", line 50, characters 16-40:
50 |   let print s = Pervasives.output_string channel s in
                     ^^^^^^^^^^^^^^^^^^^^^^^^
Alert deprecated: module Stdlib.Pervasives
Use Stdlib instead.

If you need to stay compatible with OCaml < 4.07, you can use the 
stdlib-shims library: https://github.com/ocaml/stdlib-shims
File "src/catapult/catapult.ml", line 51, characters 17-37:
51 |   let close () = Pervasives.close_out channel in
                      ^^^^^^^^^^^^^^^^^^^^
Alert deprecated: module Stdlib.Pervasives
Use Stdlib instead.

If you need to stay compatible with OCaml < 4.07, you can use the 
stdlib-shims library: https://github.com/ocaml/stdlib-shims
File "src/dune_lang/dune_lang.ml", line 105, characters 15-52:
105 |   let tfuncs = Format.pp_get_formatter_tag_functions ppf () in
                     ^^^^^^^^^^^^^^^^^^^^^^^^^^^^^^^^^^^^^
Alert deprecated: Stdlib.Format.pp_get_formatter_tag_functions
Use Format.pp_get_formatter_stag_functions.
File "src/dune_lang/dune_lang.ml", line 106, characters 2-39:
106 |   Format.pp_set_formatter_tag_functions ppf
        ^^^^^^^^^^^^^^^^^^^^^^^^^^^^^^^^^^^^^
Alert deprecated: Stdlib.Format.pp_set_formatter_tag_functions
This function will erase non-string tag formatting functions. Use Format.pp_set_formatter_stag_functions.
File "src/colors.ml", line 105, characters 18-48:
105 |       let funcs = pp_get_formatter_tag_functions ppf () in
                        ^^^^^^^^^^^^^^^^^^^^^^^^^^^^^^
Alert deprecated: Stdlib.Format.pp_get_formatter_tag_functions
Use Format.pp_get_formatter_stag_functions.
File "src/colors.ml", line 107, characters 6-36:
107 |       pp_set_formatter_tag_functions ppf
            ^^^^^^^^^^^^^^^^^^^^^^^^^^^^^^
Alert deprecated: Stdlib.Format.pp_set_formatter_tag_functions
This function will erase non-string tag formatting functions. Use Format.pp_set_formatter_stag_functions.
File "src/watermarks.ml", line 47, characters 13-16:
47 |       | _ -> err
                  ^^^
Error: This expression has type
         (string list, string) Dune.Import.result =
           (string list, string) Dune_caml.result
       but an expression was expected of type
         (string, string) Dune.Import.result =
           (string, string) Dune_caml.result
       Type string list is not compatible with type string 
-> required by src/.dune.objs/native/dune__Watermarks.cmx
-> required by bin/.main.objs/native/main.cmx
-> required by bin/main.a
-> required by bin/main/main_dune.exe
-> required by install bin/dune
-> required by dune.install
Close

Error on dune.1.10.0 (4.08.0+mutmatch+bench)

Command:

~/.opam/4.08.0+mutmatch+bench/bin/ocaml bootstrap.ml

Output

/home/louis/.opam/4.08.0+mutmatch+bench/bin/ocamllex.opt -q src/ocamlobjinfo.mll
/home/louis/.opam/4.08.0+mutmatch+bench/bin/ocamllex.opt -q src/meta_lexer.mll
/home/louis/.opam/4.08.0+mutmatch+bench/bin/ocamllex.opt -q src/dune_lexer.mll
/home/louis/.opam/4.08.0+mutmatch+bench/bin/ocamllex.opt -q src/dune_lang/dune_lexer.mll
/home/louis/.opam/4.08.0+mutmatch+bench/bin/ocamldep.opt -modules src/action.ml src/action_ast.ml src/action_dune_lang.ml src/action_exec.ml src/action_intf.ml src/action_to_sh.boot.ml src/action_unexpanded.ml src/alias.ml src/artifacts.ml src/binary_kind.ml src/bindings.ml src/blang.ml src/bootstrap.boot.ml src/build.ml src/build_system.ml src/c.ml src/c_sources.ml src/check_rules.ml src/clflags.ml src/cm_kind.ml src/colors.ml src/command.ml src/compilation_context.ml src/config.ml src/config0.ml src/console.ml src/context.ml src/coq_module.ml src/coq_rules.boot.ml src/dep.ml src/dep_graph.ml src/dep_path.ml src/diff.ml src/dir_contents.ml src/dir_set.ml src/dir_status.ml src/dir_with_dune.ml src/dune_env.ml src/dune_file.ml src/dune_init.ml src/dune_lexer.ml src/dune_load.ml src/dune_package.ml src/dune_project.ml vendor/boot/dune_re.ml src/dynlink_supported.ml src/env_node.ml src/errors.ml src/exe.ml src/exe_rules.ml src/expander.ml src/file_binding.ml src/file_selector.ml src/file_tree.ml src/findlib.ml src/format_dune_lang.ml src/format_rules.ml src/gen_meta.ml src/gen_rules.ml src/glob.ml src/glob_lexer.boot.ml src/hooks.ml src/import.ml src/inline_tests.boot.ml src/install.ml src/install_rules.ml src/installed_dune_file.ml src/js_of_ocaml_rules.boot.ml src/lib.ml src/lib_archives.ml src/lib_config.ml src/lib_deps_info.ml src/lib_file_deps.ml src/lib_info.ml src/lib_kind.ml src/lib_modules.ml src/lib_name.ml src/lib_rules.ml src/link_time_code_gen.ml src/local_package.ml src/log.ml src/main.ml src/menhir.boot.ml src/merlin.ml src/meta.ml src/meta_lexer.ml src/ml_kind.ml src/mode.ml src/module.ml src/module_compilation.ml src/modules_field_evaluator.ml src/obj_dir.ml src/ocaml_flags.ml src/ocaml_version.ml src/ocamldep.ml src/ocamlobjinfo.ml src/odoc.boot.ml vendor/boot/opamBaseParser.ml vendor/boot/opamLexer.ml vendor/boot/opamParserTypes.ml vendor/boot/opamPrinter.ml src/opam_create.boot.ml src/opam_file.ml src/ordered_set_lang.ml src/package.ml src/packages.ml src/path_dune_lang.ml src/per_item.ml src/pform.ml src/predicate.ml src/predicate_lang.ml src/preprocessing.ml src/print_diff.ml src/process.ml src/promotion.ml src/refmt.ml src/report_error.ml src/response_file.ml src/rule.ml src/rules.ml src/scheduler.ml src/scheme.ml src/scope.ml src/setup.boot.ml src/simple_rules.ml src/spawn.ml src/stanza.ml src/static_deps.ml src/stats.boot.ml src/string_with_vars.ml src/sub_dirs.ml src/sub_system.ml src/sub_system_info.ml src/sub_system_intf.ml src/sub_system_name.ml src/super_context.ml src/syntax.ml src/test_rules.boot.ml src/top_closure.ml src/toplevel.ml src/upgrader.boot.ml src/utils.ml src/utop.boot.ml src/value.ml src/variant.ml src/vcs.ml src/versioned_file.ml src/vimpl.ml src/virtual_rules.ml src/visibility.ml src/watermarks.ml src/workspace.ml src/wrapped.ml > boot-depends.txt
File "src/action_ast.ml", line 32, characters 16-20:
Error: Syntax error: operator expected.
File "src/action_exec.ml", line 185, characters 7-8:
Error: Syntax error
File "src/bindings.ml", line 44, characters 9-10:
Error: Syntax error: operator expected.
File "src/blang.ml", line 85, characters 14-15:
Error: Syntax error: operator expected.
File "src/build.ml", line 427, characters 9-12:
Error: Syntax error: operator expected.
File "src/build_system.ml", line 156, characters 9-10:
Error: Syntax error
File "src/config.ml", line 106, characters 7-14:
Error: Syntax error
File "src/context.ml", line 35, characters 12-13:
Error: Syntax error: operator expected.
File "src/diff.ml", line 28, characters 7-12:
Error: Syntax error
File "src/dir_contents.ml", line 65, characters 21-22:
Error: Syntax error: operator expected.
File "src/dune_env.ml", line 12, characters 9-10:
Error: Syntax error
File "src/dune_file.ml", line 66, characters 7-8:
Error: Syntax error: operator expected.
File "src/dune_init.ml", line 87, characters 11-12:
Error: Syntax error
File "src/dune_load.ml", line 208, characters 9-10:
Error: Syntax error: operator expected.
File "src/dune_package.ml", line 140, characters 9-10:
Error: Syntax error: operator expected.
File "src/dune_project.ml", line 354, characters 11-12:
Error: Syntax error
File "src/file_binding.ml", line 66, characters 13-20:
Error: Syntax error
File "src/file_tree.ml", line 224, characters 9-10:
Error: Syntax error
File "src/findlib.ml", line 355, characters 9-10:
Error: Syntax error
File "src/gen_rules.ml", line 337, characters 11-18:
Error: Syntax error
File "src/installed_dune_file.ml", line 62, characters 10-11:
Error: Syntax error: operator expected.
File "src/lib.ml", line 293, characters 9-13:
Error: Syntax error
File "src/lib_kind.ml", line 10, characters 9-10:
Error: Syntax error
File "src/lib_modules.ml", line 226, characters 9-21:
Error: Syntax error: operator expected.
File "src/main.ml", line 65, characters 7-15:
Error: Syntax error
File "src/merlin.ml", line 136, characters 9-10:
Error: Syntax error
File "src/mode.ml", line 126, characters 13-17:
Error: Syntax error: operator expected.
File "src/module.ml", line 464, characters 9-13:
Error: Syntax error: operator expected.
File "src/obj_dir.ml", line 58, characters 11-22:
Error: Syntax error: operator expected.
File "src/ocaml_flags.ml", line 50, characters 9-15:
Error: Syntax error
File "src/ordered_set_lang.ml", line 67, characters 13-22:
Error: Syntax error
File "src/package.ml", line 90, characters 13-14:
Error: Syntax error
File "src/path_dune_lang.ml", line 47, characters 9-10:
Error: Syntax error
File "src/pform.ml", line 242, characters 7-8:
Error: Syntax error
File "src/predicate_lang.ml", line 23, characters 19-20:
Error: Syntax error
File "src/preprocessing.ml", line 135, characters 16-19:
Error: Syntax error: operator expected.
File "src/print_diff.ml", line 29, characters 9-10:
Error: Syntax error
File "src/process.ml", line 254, characters 5-6:
Error: Syntax error
File "src/scheduler.ml", line 553, characters 7-8:
Error: Syntax error
File "src/stanza.ml", line 64, characters 23-24:
Error: Syntax error: operator expected.
File "src/string_with_vars.ml", line 138, characters 7-21:
Error: Syntax error
File "src/sub_dirs.ml", line 71, characters 9-16:
Error: Syntax error
File "src/sub_system.ml", line 40, characters 7-8:
Error: Syntax error
File "src/super_context.ml", line 98, characters 7-8:
Error: Syntax error
File "src/syntax.ml", line 162, characters 9-16:
Error: Syntax error
File "src/vcs.ml", line 53, characters 12-16:
Error: Syntax error: operator expected.
File "src/versioned_file.ml", line 93, characters 7-8:
Error: Syntax error
File "src/watermarks.ml", line 197, characters 13-16:
Error: Syntax error
File "src/workspace.ml", line 60, characters 11-14:
Error: Syntax error
File "src/wrapped.ml", line 14, characters 11-12:
Error: Syntax error
Close

Error on core-micro-bench.1.0 (4.07.1+oclassic+bench)

Command:

/usr/bin/make -C core_micro

Output

make: Entering directory '/home/louis/.opam/4.07.1+oclassic+bench/.opam-switch/build/core-micro-bench.1.0/core_micro'
ocamlbuild -use-ocamlfind runner.native
ocamlfind ocamldep -package str -package core -package core_bench.inline_benchmarks -modules runner.ml > runner.ml.depends
ocamlfind ocamlc -c -thread -package str -package core -package core_bench.inline_benchmarks -o runner.cmo runner.ml
+ ocamlfind ocamlc -c -thread -package str -package core -package core_bench.inline_benchmarks -o runner.cmo runner.ml
File "runner.ml", line 1, characters 5-13:
Error: Unbound module Core.Std
Command exited with code 2.
Makefile:4: recipe for target 'all' failed
make: *** [all] Error 10
make: Leaving directory '/home/louis/.opam/4.07.1+oclassic+bench/.opam-switch/build/core-micro-bench.1.0/core_micro'
Close

Error on core-micro-bench.1.0 (4.07.1+flambda+bench)

Command:

/usr/bin/make -C core_micro

Output

make: Entering directory '/home/louis/.opam/4.07.1+flambda+bench/.opam-switch/build/core-micro-bench.1.0/core_micro'
ocamlbuild -use-ocamlfind runner.native
ocamlfind ocamldep -package str -package core -package core_bench.inline_benchmarks -modules runner.ml > runner.ml.depends
ocamlfind ocamlc -c -thread -package str -package core -package core_bench.inline_benchmarks -o runner.cmo runner.ml
+ ocamlfind ocamlc -c -thread -package str -package core -package core_bench.inline_benchmarks -o runner.cmo runner.ml
File "runner.ml", line 1, characters 5-13:
Error: Unbound module Core.Std
Command exited with code 2.
Makefile:4: recipe for target 'all' failed
make: *** [all] Error 10
make: Leaving directory '/home/louis/.opam/4.07.1+flambda+bench/.opam-switch/build/core-micro-bench.1.0/core_micro'
Close

Error on core-micro-bench.1.0 (4.07.1+clambda+bench)

Command:

/usr/bin/make -C core_micro

Output

make: Entering directory '/home/louis/.opam/4.07.1+flambda+bench/.opam-switch/build/core-micro-bench.1.0/core_micro'
ocamlbuild -use-ocamlfind runner.native
ocamlfind ocamldep -package str -package core -package core_bench.inline_benchmarks -modules runner.ml > runner.ml.depends
ocamlfind ocamlc -c -thread -package str -package core -package core_bench.inline_benchmarks -o runner.cmo runner.ml
+ ocamlfind ocamlc -c -thread -package str -package core -package core_bench.inline_benchmarks -o runner.cmo runner.ml
File "runner.ml", line 1, characters 5-13:
Warning 3: deprecated: module Core.Std
[since 2017-02] Use Core. The Std sub-module is no longer needed
File "runner.ml", line 3, characters 15-55:
Error: Unbound module Pa_bench_lib
Command exited with code 2.
Makefile:4: recipe for target 'all' failed
make: *** [all] Error 10
make: Leaving directory '/home/louis/.opam/4.07.1+flambda+bench/.opam-switch/build/core-micro-bench.1.0/core_micro'
make: Entering directory '/home/louis/.opam/4.07.1+oclassic+bench/.opam-switch/build/core-micro-bench.1.0/core_micro'
ocamlbuild -use-ocamlfind runner.native
ocamlfind ocamldep -package str -package core -package core_bench.inline_benchmarks -modules runner.ml > runner.ml.depends
ocamlfind ocamlc -c -thread -package str -package core -package core_bench.inline_benchmarks -o runner.cmo runner.ml
+ ocamlfind ocamlc -c -thread -package str -package core -package core_bench.inline_benchmarks -o runner.cmo runner.ml
File "runner.ml", line 1, characters 5-13:
Error: Unbound module Core.Std
Command exited with code 2.
Makefile:4: recipe for target 'all' failed
make: *** [all] Error 10
make: Leaving directory '/home/louis/.opam/4.07.1+oclassic+bench/.opam-switch/build/core-micro-bench.1.0/core_micro'
make: Entering directory '/home/louis/.opam/4.07.1+clambda+bench/.opam-switch/build/core-micro-bench.1.0/core_micro'
ocamlbuild -use-ocamlfind runner.native
ocamlfind ocamldep -package str -package core -package core_bench.inline_benchmarks -modules runner.ml > runner.ml.depends
ocamlfind ocamlc -c -thread -package str -package core -package core_bench.inline_benchmarks -o runner.cmo runner.ml
+ ocamlfind ocamlc -c -thread -package str -package core -package core_bench.inline_benchmarks -o runner.cmo runner.ml
File "runner.ml", line 1, characters 5-13:
Error: Unbound module Core.Std
Command exited with code 2.
Makefile:4: recipe for target 'all' failed
make: *** [all] Error 10
make: Leaving directory '/home/louis/.opam/4.07.1+clambda+bench/.opam-switch/build/core-micro-bench.1.0/core_micro'
Close

Error on core-micro-bench.1.0 (4.03.1+bench)

Command:

/usr/bin/make -C core_micro

Output

make: Entering directory '/home/louis/.opam/4.03.1+bench/.opam-switch/build/core-micro-bench.1.0/core_micro'
ocamlbuild -use-ocamlfind runner.native
ocamlfind ocamldep -package str -package core -package core_bench.inline_benchmarks -modules runner.ml > runner.ml.depends
ocamlfind ocamlc -c -thread -package str -package core -package core_bench.inline_benchmarks -o runner.cmo runner.ml
+ ocamlfind ocamlc -c -thread -package str -package core -package core_bench.inline_benchmarks -o runner.cmo runner.ml
File "runner.ml", line 1, characters 5-13:
Warning 3: deprecated: module Core.Std
[since 2017-02] Use Core. The Std sub-module is no longer needed
File "runner.ml", line 3, characters 15-55:
Error: Unbound module Pa_bench_lib
Command exited with code 2.
Makefile:4: recipe for target 'all' failed
make: *** [all] Error 10
make: Leaving directory '/home/louis/.opam/4.03.1+bench/.opam-switch/build/core-micro-bench.1.0/core_micro'
Close

Error on conf-graphviz.0.1 (4.07.1+oclassic+bench)

Command:

/usr/bin/which dot

Output


Close

Error on conf-graphviz.0.1 (4.07.1+flambda+bench)

Command:

/usr/bin/which dot

Output


Close

Error on conf-graphviz.0.1 (4.07.1+clambda+bench)

Command:

/usr/bin/which dot

Output


Close

Error on conf-graphviz.0.1 (4.03.1+bench)

Command:

/usr/bin/which dot

Output


Close

Error on cohttp-bench.1.0 (4.07.1+oclassic+bench)

Command:

/usr/bin/make -C cohttp

Output

make: Entering directory '/home/louis/.opam/4.07.1+oclassic+bench/.opam-switch/build/cohttp-bench.1.0/cohttp'
ocamlbuild -use-ocamlfind cohttp_lwt_bench.native cohttp_async_bench.native
ocamlfind ocamldep -package lwt.unix -package cohttp.lwt -modules cohttp_lwt_bench.ml > cohttp_lwt_bench.ml.depends
+ ocamlfind ocamldep -package lwt.unix -package cohttp.lwt -modules cohttp_lwt_bench.ml > cohttp_lwt_bench.ml.depends
ocamlfind: Package `cohttp.lwt' not found
Command exited with code 2.
Makefile:6: recipe for target 'all' failed
make: *** [all] Error 10
make: Leaving directory '/home/louis/.opam/4.07.1+oclassic+bench/.opam-switch/build/cohttp-bench.1.0/cohttp'
Close

Error on cohttp-bench.1.0 (4.07.1+flambda+bench)

Command:

/usr/bin/make -C cohttp

Output

make: Entering directory '/home/louis/.opam/4.07.1+flambda+bench/.opam-switch/build/cohttp-bench.1.0/cohttp'
ocamlbuild -use-ocamlfind cohttp_lwt_bench.native cohttp_async_bench.native
ocamlfind ocamldep -package lwt.unix -package cohttp.lwt -modules cohttp_lwt_bench.ml > cohttp_lwt_bench.ml.depends
+ ocamlfind ocamldep -package lwt.unix -package cohttp.lwt -modules cohttp_lwt_bench.ml > cohttp_lwt_bench.ml.depends
ocamlfind: Package `cohttp.lwt' not found
Command exited with code 2.
Makefile:6: recipe for target 'all' failed
make: *** [all] Error 10
make: Leaving directory '/home/louis/.opam/4.07.1+flambda+bench/.opam-switch/build/cohttp-bench.1.0/cohttp'
Close

Error on cohttp-bench.1.0 (4.07.1+clambda+bench)

Command:

/usr/bin/make -C cohttp

Output

make: Entering directory '/home/louis/.opam/4.07.1+flambda+bench/.opam-switch/build/cohttp-bench.1.0/cohttp'
ocamlbuild -use-ocamlfind cohttp_lwt_bench.native cohttp_async_bench.native
ocamlfind ocamldep -package lwt.unix -package cohttp.lwt -modules cohttp_lwt_bench.ml > cohttp_lwt_bench.ml.depends
+ ocamlfind ocamldep -package lwt.unix -package cohttp.lwt -modules cohttp_lwt_bench.ml > cohttp_lwt_bench.ml.depends
ocamlfind: Package `cohttp-lwt-unix' not found - required by `cohttp.lwt'
Command exited with code 2.
Makefile:6: recipe for target 'all' failed
make: *** [all] Error 10
make: Leaving directory '/home/louis/.opam/4.07.1+flambda+bench/.opam-switch/build/cohttp-bench.1.0/cohttp'
make: Entering directory '/home/louis/.opam/4.07.1+oclassic+bench/.opam-switch/build/cohttp-bench.1.0/cohttp'
ocamlbuild -use-ocamlfind cohttp_lwt_bench.native cohttp_async_bench.native
ocamlfind ocamldep -package lwt.unix -package cohttp.lwt -modules cohttp_lwt_bench.ml > cohttp_lwt_bench.ml.depends
+ ocamlfind ocamldep -package lwt.unix -package cohttp.lwt -modules cohttp_lwt_bench.ml > cohttp_lwt_bench.ml.depends
ocamlfind: Package `cohttp.lwt' not found
Command exited with code 2.
Makefile:6: recipe for target 'all' failed
make: *** [all] Error 10
make: Leaving directory '/home/louis/.opam/4.07.1+oclassic+bench/.opam-switch/build/cohttp-bench.1.0/cohttp'
make: Entering directory '/home/louis/.opam/4.07.1+clambda+bench/.opam-switch/build/cohttp-bench.1.0/cohttp'
ocamlbuild -use-ocamlfind cohttp_lwt_bench.native cohttp_async_bench.native
ocamlfind ocamldep -package lwt.unix -package cohttp.lwt -modules cohttp_lwt_bench.ml > cohttp_lwt_bench.ml.depends
+ ocamlfind ocamldep -package lwt.unix -package cohttp.lwt -modules cohttp_lwt_bench.ml > cohttp_lwt_bench.ml.depends
ocamlfind: Package `cohttp.lwt' not found
Command exited with code 2.
Makefile:6: recipe for target 'all' failed
make: *** [all] Error 10
make: Leaving directory '/home/louis/.opam/4.07.1+clambda+bench/.opam-switch/build/cohttp-bench.1.0/cohttp'
Close

Error on cohttp-bench.1.0 (4.03.1+bench)

Command:

/usr/bin/make -C cohttp

Output

make: Entering directory '/home/louis/.opam/4.03.1+bench/.opam-switch/build/cohttp-bench.1.0/cohttp'
ocamlbuild -use-ocamlfind cohttp_lwt_bench.native cohttp_async_bench.native
ocamlfind ocamldep -package lwt.unix -package cohttp.lwt -modules cohttp_lwt_bench.ml > cohttp_lwt_bench.ml.depends
+ ocamlfind ocamldep -package lwt.unix -package cohttp.lwt -modules cohttp_lwt_bench.ml > cohttp_lwt_bench.ml.depends
ocamlfind: Package `cohttp-lwt-unix' not found - required by `cohttp.lwt'
Command exited with code 2.
Makefile:6: recipe for target 'all' failed
make: *** [all] Error 10
make: Leaving directory '/home/louis/.opam/4.03.1+bench/.opam-switch/build/cohttp-bench.1.0/cohttp'
Close

Error on chameneos-bench.1.0 (4.07.1+oclassic+bench)

Command:

/usr/bin/make -C chameneos-redux

Output

make: Entering directory '/home/louis/.opam/4.07.1+oclassic+bench/.opam-switch/build/chameneos-bench.1.0/chameneos-redux'
ocamlopt -bin-annot -thread unix.cmxa threads.cmxa chameneos_redux_th.ml -o chameneos_redux_th
ocamlopt -bin-annot -thread unix.cmxa threads.cmxa chameneos_redux_evtchn.ml -o chameneos_redux_evtchn
ocamlfind ocamlopt -bin-annot -package lwt.unix -linkpkg chameneos_redux_lwt.ml -o chameneos_redux_lwt
ocamlfind: [WARNING] Package `threads': Linking problems may arise because of the missing -thread or -vmthread switch
ocamlfind ocamlopt -bin-annot  -thread -package async -linkpkg chameneos_redux_async.ml -o chameneos_redux_async
File "chameneos_redux_async.ml", line 7, characters 5-13:
Error: Unbound module Core.Std
Makefile:9: recipe for target 'chameneos_redux_async' failed
make: *** [chameneos_redux_async] Error 2
make: Leaving directory '/home/louis/.opam/4.07.1+oclassic+bench/.opam-switch/build/chameneos-bench.1.0/chameneos-redux'
Close

Error on chameneos-bench.1.0 (4.07.1+flambda+bench)

Command:

/usr/bin/make -C chameneos-redux

Output

make: Entering directory '/home/louis/.opam/4.07.1+flambda+bench/.opam-switch/build/chameneos-bench.1.0/chameneos-redux'
ocamlopt -bin-annot -thread unix.cmxa threads.cmxa chameneos_redux_th.ml -o chameneos_redux_th
ocamlopt -bin-annot -thread unix.cmxa threads.cmxa chameneos_redux_evtchn.ml -o chameneos_redux_evtchn
ocamlfind ocamlopt -bin-annot -package lwt.unix -linkpkg chameneos_redux_lwt.ml -o chameneos_redux_lwt
ocamlfind: [WARNING] Package `threads': Linking problems may arise because of the missing -thread or -vmthread switch
ocamlfind ocamlopt -bin-annot  -thread -package async -linkpkg chameneos_redux_async.ml -o chameneos_redux_async
File "chameneos_redux_async.ml", line 7, characters 5-13:
Error: Unbound module Core.Std
Makefile:9: recipe for target 'chameneos_redux_async' failed
make: *** [chameneos_redux_async] Error 2
make: Leaving directory '/home/louis/.opam/4.07.1+flambda+bench/.opam-switch/build/chameneos-bench.1.0/chameneos-redux'
Close

Error on chameneos-bench.1.0 (4.07.1+clambda+bench)

Command:

/usr/bin/make -C chameneos-redux

Output

make: Entering directory '/home/louis/.opam/4.07.1+flambda+bench/.opam-switch/build/chameneos-bench.1.0/chameneos-redux'
ocamlopt -bin-annot -thread unix.cmxa threads.cmxa chameneos_redux_th.ml -o chameneos_redux_th
ocamlopt -bin-annot -thread unix.cmxa threads.cmxa chameneos_redux_evtchn.ml -o chameneos_redux_evtchn
ocamlfind ocamlopt -bin-annot -package lwt.unix -linkpkg chameneos_redux_lwt.ml -o chameneos_redux_lwt
ocamlfind: [WARNING] Package `threads': Linking problems may arise because of the missing -thread or -vmthread switch
ocamlfind ocamlopt -bin-annot  -thread -package async -linkpkg chameneos_redux_async.ml -o chameneos_redux_async
File "chameneos_redux_async.ml", line 7, characters 5-13:
Warning 3: deprecated: module Core.Std
[since 2017-02] Use Core. The Std sub-module is no longer needed
File "chameneos_redux_async.ml", line 8, characters 5-14:
Error: Unbound module Async.Std
Makefile:9: recipe for target 'chameneos_redux_async' failed
make: *** [chameneos_redux_async] Error 2
make: Leaving directory '/home/louis/.opam/4.07.1+flambda+bench/.opam-switch/build/chameneos-bench.1.0/chameneos-redux'
make: Entering directory '/home/louis/.opam/4.07.1+oclassic+bench/.opam-switch/build/chameneos-bench.1.0/chameneos-redux'
ocamlopt -bin-annot -thread unix.cmxa threads.cmxa chameneos_redux_th.ml -o chameneos_redux_th
ocamlopt -bin-annot -thread unix.cmxa threads.cmxa chameneos_redux_evtchn.ml -o chameneos_redux_evtchn
ocamlfind ocamlopt -bin-annot -package lwt.unix -linkpkg chameneos_redux_lwt.ml -o chameneos_redux_lwt
ocamlfind: [WARNING] Package `threads': Linking problems may arise because of the missing -thread or -vmthread switch
ocamlfind ocamlopt -bin-annot  -thread -package async -linkpkg chameneos_redux_async.ml -o chameneos_redux_async
File "chameneos_redux_async.ml", line 7, characters 5-13:
Error: Unbound module Core.Std
Makefile:9: recipe for target 'chameneos_redux_async' failed
make: *** [chameneos_redux_async] Error 2
make: Leaving directory '/home/louis/.opam/4.07.1+oclassic+bench/.opam-switch/build/chameneos-bench.1.0/chameneos-redux'
make: Entering directory '/home/louis/.opam/4.07.1+clambda+bench/.opam-switch/build/chameneos-bench.1.0/chameneos-redux'
ocamlopt -bin-annot -thread unix.cmxa threads.cmxa chameneos_redux_th.ml -o chameneos_redux_th
ocamlopt -bin-annot -thread unix.cmxa threads.cmxa chameneos_redux_evtchn.ml -o chameneos_redux_evtchn
ocamlfind ocamlopt -bin-annot -package lwt.unix -linkpkg chameneos_redux_lwt.ml -o chameneos_redux_lwt
ocamlfind: [WARNING] Package `threads': Linking problems may arise because of the missing -thread or -vmthread switch
ocamlfind ocamlopt -bin-annot  -thread -package async -linkpkg chameneos_redux_async.ml -o chameneos_redux_async
File "chameneos_redux_async.ml", line 7, characters 5-13:
Error: Unbound module Core.Std
Makefile:9: recipe for target 'chameneos_redux_async' failed
make: *** [chameneos_redux_async] Error 2
make: Leaving directory '/home/louis/.opam/4.07.1+clambda+bench/.opam-switch/build/chameneos-bench.1.0/chameneos-redux'
Close

Error on chameneos-bench.1.0 (4.03.1+bench)

Command:

/usr/bin/make -C chameneos-redux

Output

make: Entering directory '/home/louis/.opam/4.03.1+bench/.opam-switch/build/chameneos-bench.1.0/chameneos-redux'
ocamlopt -bin-annot -thread unix.cmxa threads.cmxa chameneos_redux_th.ml -o chameneos_redux_th
ocamlopt -bin-annot -thread unix.cmxa threads.cmxa chameneos_redux_evtchn.ml -o chameneos_redux_evtchn
ocamlfind ocamlopt -bin-annot -package lwt.unix -linkpkg chameneos_redux_lwt.ml -o chameneos_redux_lwt
ocamlfind: [WARNING] Package `threads': Linking problems may arise because of the missing -thread or -vmthread switch
ocamlfind ocamlopt -bin-annot  -thread -package async -linkpkg chameneos_redux_async.ml -o chameneos_redux_async
File "chameneos_redux_async.ml", line 7, characters 5-13:
Warning 3: deprecated: module Core.Std
[since 2017-02] Use Core. The Std sub-module is no longer needed
File "chameneos_redux_async.ml", line 8, characters 5-14:
Warning 3: deprecated: module Async.Std
[since 2017-02] use Async. The Std sub-module is no longer needed
File "chameneos_redux_async.ml", line 128, characters 10-16:
Error: This expression has type
         [> `Probably_should_not_use_blocking_Core_Printf_functions_with_Async ]
       This is not a function; it cannot be applied.
Makefile:9: recipe for target 'chameneos_redux_async' failed
make: *** [chameneos_redux_async] Error 2
make: Leaving directory '/home/louis/.opam/4.03.1+bench/.opam-switch/build/chameneos-bench.1.0/chameneos-redux'
Close

Error on camlpdf.1.7.1 (4.07.1+oclassic+bench)

Command:

/usr/bin/make

Output

make[1]: Entering directory '/home/louis/.opam/4.07.1+oclassic+bench/.opam-switch/build/camlpdf.1.7.1'
ocamlfind ocamldep -native pdfmerge.mli > ._ncdi/pdfmerge.di
ocamlfind ocamldep -native pdftype0.mli > ._ncdi/pdftype0.di
ocamlfind ocamldep -native pdftruetype.mli > ._ncdi/pdftruetype.di
ocamlfind ocamldep -native pdftype1.mli > ._ncdi/pdftype1.di
ocamlfind ocamldep -native pdfcff.mli > ._ncdi/pdfcff.di
ocamlfind ocamldep -native pdfocg.mli > ._ncdi/pdfocg.di
ocamlfind ocamldep -native pdfdate.mli > ._ncdi/pdfdate.di
ocamlfind ocamldep -native pdfshapes.mli > ._ncdi/pdfshapes.di
ocamlfind ocamldep -native pdfgraphics.mli > ._ncdi/pdfgraphics.di
ocamlfind ocamldep -native pdfstandard14.mli > ._ncdi/pdfstandard14.di
ocamlfind ocamldep -native pdftext.mli > ._ncdi/pdftext.di
ocamlfind ocamldep -native pdfglyphlist.mli > ._ncdi/pdfglyphlist.di
ocamlfind ocamldep -native pdfafmdata.mli > ._ncdi/pdfafmdata.di
ocamlfind ocamldep -native pdfafm.mli > ._ncdi/pdfafm.di
ocamlfind ocamldep -native pdfimage.mli > ._ncdi/pdfimage.di
ocamlfind ocamldep -native pdfspace.mli > ._ncdi/pdfspace.di
ocamlfind ocamldep -native pdffun.mli > ._ncdi/pdffun.di
ocamlfind ocamldep -native pdfannot.mli > ._ncdi/pdfannot.di
ocamlfind ocamldep -native pdfpage.mli > ._ncdi/pdfpage.di
ocamlfind ocamldep -native pdfpagelabels.mli > ._ncdi/pdfpagelabels.di
ocamlfind ocamldep -native pdfmarks.mli > ._ncdi/pdfmarks.di
ocamlfind ocamldep -native pdfdest.mli > ._ncdi/pdfdest.di
ocamlfind ocamldep -native pdfops.mli > ._ncdi/pdfops.di
ocamlfind ocamldep -native pdfjpeg.mli > ._ncdi/pdfjpeg.di
ocamlfind ocamldep -native pdfread.mli > ._ncdi/pdfread.di
ocamlfind ocamldep -native pdfgenlex.mli > ._ncdi/pdfgenlex.di
ocamlfind ocamldep -native pdfwrite.mli > ._ncdi/pdfwrite.di
ocamlfind ocamldep -native pdfcodec.mli > ._ncdi/pdfcodec.di
ocamlfind ocamldep -native pdfflate.mli > ._ncdi/pdfflate.di
ocamlfind ocamldep -native pdfcrypt.mli > ._ncdi/pdfcrypt.di
ocamlfind ocamldep -native pdf.mli > ._ncdi/pdf.di
ocamlfind ocamldep -native pdfpaper.mli > ._ncdi/pdfpaper.di
ocamlfind ocamldep -native pdfunits.mli > ._ncdi/pdfunits.di
ocamlfind ocamldep -native pdftransform.mli > ._ncdi/pdftransform.di
ocamlfind ocamldep -native pdfio.mli > ._ncdi/pdfio.di
ocamlfind ocamldep -native pdfutil.mli > ._ncdi/pdfutil.di
ocamlfind ocamldep pdfmerge.ml > ._d/pdfmerge.d
ocamlfind ocamldep pdftype0.ml > ._d/pdftype0.d
ocamlfind ocamldep pdftruetype.ml > ._d/pdftruetype.d
ocamlfind ocamldep pdftype1.ml > ._d/pdftype1.d
ocamlfind ocamldep pdfcff.ml > ._d/pdfcff.d
ocamlfind ocamldep pdfocg.ml > ._d/pdfocg.d
ocamlfind ocamldep pdfdate.ml > ._d/pdfdate.d
ocamlfind ocamldep pdfshapes.ml > ._d/pdfshapes.d
ocamlfind ocamldep pdfgraphics.ml > ._d/pdfgraphics.d
ocamlfind ocamldep pdfstandard14.ml > ._d/pdfstandard14.d
ocamlfind ocamldep pdftext.ml > ._d/pdftext.d
ocamlfind ocamldep pdfglyphlist.ml > ._d/pdfglyphlist.d
ocamlfind ocamldep pdfafmdata.ml > ._d/pdfafmdata.d
ocamlfind ocamldep pdfafm.ml > ._d/pdfafm.d
ocamlfind ocamldep pdfimage.ml > ._d/pdfimage.d
ocamlfind ocamldep pdfspace.ml > ._d/pdfspace.d
ocamlfind ocamldep pdffun.ml > ._d/pdffun.d
ocamlfind ocamldep pdfannot.ml > ._d/pdfannot.d
ocamlfind ocamldep pdfpage.ml > ._d/pdfpage.d
ocamlfind ocamldep pdfpagelabels.ml > ._d/pdfpagelabels.d
ocamlfind ocamldep pdfmarks.ml > ._d/pdfmarks.d
ocamlfind ocamldep pdfdest.ml > ._d/pdfdest.d
ocamlfind ocamldep pdfops.ml > ._d/pdfops.d
ocamlfind ocamldep pdfjpeg.ml > ._d/pdfjpeg.d
ocamlfind ocamldep pdfread.ml > ._d/pdfread.d
ocamlfind ocamldep pdfgenlex.ml > ._d/pdfgenlex.d
ocamlfind ocamldep pdfwrite.ml > ._d/pdfwrite.d
ocamlfind ocamldep pdfcodec.ml > ._d/pdfcodec.d
ocamlfind ocamldep pdfflate.ml > ._d/pdfflate.d
ocamlfind ocamldep pdfcrypt.ml > ._d/pdfcrypt.d
ocamlfind ocamldep pdf.ml > ._d/pdf.d
ocamlfind ocamldep pdfpaper.ml > ._d/pdfpaper.d
ocamlfind ocamldep pdfunits.ml > ._d/pdfunits.d
ocamlfind ocamldep pdftransform.ml > ._d/pdftransform.d
ocamlfind ocamldep pdfio.ml > ._d/pdfio.d
ocamlfind ocamldep pdfutil.ml > ._d/pdfutil.d
ocamlc -c -cc "cc" -ccopt "-fPIC  \
			-DPIC -DNATIVE_CODE   \
			    -o flatestubs.o " flatestubs.c
flatestubs.c: In function ‘camlzip_update_crc32’:
flatestubs.c:173:28: error: ‘uint32’ undeclared (first use in this function)
   return copy_int32(crc32((uint32) Int32_val(crc), 
                            ^
flatestubs.c:173:28: note: each undeclared identifier is reported only once for each function it appears in
In file included from flatestubs.c:20:0:
At top level:
miniz.c:2440:28: warning: always_inline function might not be inlinable [-Wattributes]
 static MZ_FORCEINLINE void tdefl_record_match(tdefl_compressor *d, mz_uint match_len, mz_uint match_dist)
                            ^
miniz.c:2432:28: warning: always_inline function might not be inlinable [-Wattributes]
 static MZ_FORCEINLINE void tdefl_record_literal(tdefl_compressor *d, mz_uint8 lit)
                            ^
miniz.c:2230:28: warning: always_inline function might not be inlinable [-Wattributes]
 static MZ_FORCEINLINE void tdefl_find_match(tdefl_compressor *d, mz_uint lookahead_pos, mz_uint max_dist, mz_uint max_match_len, mz_uint *pMatch_dist, mz_uint *pMatch_len)
                            ^
OCamlMakefile:1132: recipe for target 'flatestubs.o' failed
make[1]: *** [flatestubs.o] Error 2
make[1]: Leaving directory '/home/louis/.opam/4.07.1+oclassic+bench/.opam-switch/build/camlpdf.1.7.1'
OCamlMakefile:801: recipe for target 'native-code-library' failed
make: *** [native-code-library] Error 2
Close

Error on camlpdf.1.7.1 (4.07.1+flambda+bench)

Command:

/usr/bin/make

Output

make[1]: Entering directory '/home/louis/.opam/4.07.1+flambda+bench/.opam-switch/build/camlpdf.1.7.1'
ocamlfind ocamldep -native pdfmerge.mli > ._ncdi/pdfmerge.di
ocamlfind ocamldep -native pdftype0.mli > ._ncdi/pdftype0.di
ocamlfind ocamldep -native pdftruetype.mli > ._ncdi/pdftruetype.di
ocamlfind ocamldep -native pdftype1.mli > ._ncdi/pdftype1.di
ocamlfind ocamldep -native pdfcff.mli > ._ncdi/pdfcff.di
ocamlfind ocamldep -native pdfocg.mli > ._ncdi/pdfocg.di
ocamlfind ocamldep -native pdfdate.mli > ._ncdi/pdfdate.di
ocamlfind ocamldep -native pdfshapes.mli > ._ncdi/pdfshapes.di
ocamlfind ocamldep -native pdfgraphics.mli > ._ncdi/pdfgraphics.di
ocamlfind ocamldep -native pdfstandard14.mli > ._ncdi/pdfstandard14.di
ocamlfind ocamldep -native pdftext.mli > ._ncdi/pdftext.di
ocamlfind ocamldep -native pdfglyphlist.mli > ._ncdi/pdfglyphlist.di
ocamlfind ocamldep -native pdfafmdata.mli > ._ncdi/pdfafmdata.di
ocamlfind ocamldep -native pdfafm.mli > ._ncdi/pdfafm.di
ocamlfind ocamldep -native pdfimage.mli > ._ncdi/pdfimage.di
ocamlfind ocamldep -native pdfspace.mli > ._ncdi/pdfspace.di
ocamlfind ocamldep -native pdffun.mli > ._ncdi/pdffun.di
ocamlfind ocamldep -native pdfannot.mli > ._ncdi/pdfannot.di
ocamlfind ocamldep -native pdfpage.mli > ._ncdi/pdfpage.di
ocamlfind ocamldep -native pdfpagelabels.mli > ._ncdi/pdfpagelabels.di
ocamlfind ocamldep -native pdfmarks.mli > ._ncdi/pdfmarks.di
ocamlfind ocamldep -native pdfdest.mli > ._ncdi/pdfdest.di
ocamlfind ocamldep -native pdfops.mli > ._ncdi/pdfops.di
ocamlfind ocamldep -native pdfjpeg.mli > ._ncdi/pdfjpeg.di
ocamlfind ocamldep -native pdfread.mli > ._ncdi/pdfread.di
ocamlfind ocamldep -native pdfgenlex.mli > ._ncdi/pdfgenlex.di
ocamlfind ocamldep -native pdfwrite.mli > ._ncdi/pdfwrite.di
ocamlfind ocamldep -native pdfcodec.mli > ._ncdi/pdfcodec.di
ocamlfind ocamldep -native pdfflate.mli > ._ncdi/pdfflate.di
ocamlfind ocamldep -native pdfcrypt.mli > ._ncdi/pdfcrypt.di
ocamlfind ocamldep -native pdf.mli > ._ncdi/pdf.di
ocamlfind ocamldep -native pdfpaper.mli > ._ncdi/pdfpaper.di
ocamlfind ocamldep -native pdfunits.mli > ._ncdi/pdfunits.di
ocamlfind ocamldep -native pdftransform.mli > ._ncdi/pdftransform.di
ocamlfind ocamldep -native pdfio.mli > ._ncdi/pdfio.di
ocamlfind ocamldep -native pdfutil.mli > ._ncdi/pdfutil.di
ocamlfind ocamldep pdfmerge.ml > ._d/pdfmerge.d
ocamlfind ocamldep pdftype0.ml > ._d/pdftype0.d
ocamlfind ocamldep pdftruetype.ml > ._d/pdftruetype.d
ocamlfind ocamldep pdftype1.ml > ._d/pdftype1.d
ocamlfind ocamldep pdfcff.ml > ._d/pdfcff.d
ocamlfind ocamldep pdfocg.ml > ._d/pdfocg.d
ocamlfind ocamldep pdfdate.ml > ._d/pdfdate.d
ocamlfind ocamldep pdfshapes.ml > ._d/pdfshapes.d
ocamlfind ocamldep pdfgraphics.ml > ._d/pdfgraphics.d
ocamlfind ocamldep pdfstandard14.ml > ._d/pdfstandard14.d
ocamlfind ocamldep pdftext.ml > ._d/pdftext.d
ocamlfind ocamldep pdfglyphlist.ml > ._d/pdfglyphlist.d
ocamlfind ocamldep pdfafmdata.ml > ._d/pdfafmdata.d
ocamlfind ocamldep pdfafm.ml > ._d/pdfafm.d
ocamlfind ocamldep pdfimage.ml > ._d/pdfimage.d
ocamlfind ocamldep pdfspace.ml > ._d/pdfspace.d
ocamlfind ocamldep pdffun.ml > ._d/pdffun.d
ocamlfind ocamldep pdfannot.ml > ._d/pdfannot.d
ocamlfind ocamldep pdfpage.ml > ._d/pdfpage.d
ocamlfind ocamldep pdfpagelabels.ml > ._d/pdfpagelabels.d
ocamlfind ocamldep pdfmarks.ml > ._d/pdfmarks.d
ocamlfind ocamldep pdfdest.ml > ._d/pdfdest.d
ocamlfind ocamldep pdfops.ml > ._d/pdfops.d
ocamlfind ocamldep pdfjpeg.ml > ._d/pdfjpeg.d
ocamlfind ocamldep pdfread.ml > ._d/pdfread.d
ocamlfind ocamldep pdfgenlex.ml > ._d/pdfgenlex.d
ocamlfind ocamldep pdfwrite.ml > ._d/pdfwrite.d
ocamlfind ocamldep pdfcodec.ml > ._d/pdfcodec.d
ocamlfind ocamldep pdfflate.ml > ._d/pdfflate.d
ocamlfind ocamldep pdfcrypt.ml > ._d/pdfcrypt.d
ocamlfind ocamldep pdf.ml > ._d/pdf.d
ocamlfind ocamldep pdfpaper.ml > ._d/pdfpaper.d
ocamlfind ocamldep pdfunits.ml > ._d/pdfunits.d
ocamlfind ocamldep pdftransform.ml > ._d/pdftransform.d
ocamlfind ocamldep pdfio.ml > ._d/pdfio.d
ocamlfind ocamldep pdfutil.ml > ._d/pdfutil.d
ocamlc -c -cc "cc" -ccopt "-fPIC  \
			-DPIC -DNATIVE_CODE   \
			    -o flatestubs.o " flatestubs.c
flatestubs.c: In function ‘camlzip_update_crc32’:
flatestubs.c:173:28: error: ‘uint32’ undeclared (first use in this function)
   return copy_int32(crc32((uint32) Int32_val(crc), 
                            ^
flatestubs.c:173:28: note: each undeclared identifier is reported only once for each function it appears in
In file included from flatestubs.c:20:0:
At top level:
miniz.c:2440:28: warning: always_inline function might not be inlinable [-Wattributes]
 static MZ_FORCEINLINE void tdefl_record_match(tdefl_compressor *d, mz_uint match_len, mz_uint match_dist)
                            ^
miniz.c:2432:28: warning: always_inline function might not be inlinable [-Wattributes]
 static MZ_FORCEINLINE void tdefl_record_literal(tdefl_compressor *d, mz_uint8 lit)
                            ^
miniz.c:2230:28: warning: always_inline function might not be inlinable [-Wattributes]
 static MZ_FORCEINLINE void tdefl_find_match(tdefl_compressor *d, mz_uint lookahead_pos, mz_uint max_dist, mz_uint max_match_len, mz_uint *pMatch_dist, mz_uint *pMatch_len)
                            ^
OCamlMakefile:1132: recipe for target 'flatestubs.o' failed
make[1]: *** [flatestubs.o] Error 2
make[1]: Leaving directory '/home/louis/.opam/4.07.1+flambda+bench/.opam-switch/build/camlpdf.1.7.1'
OCamlMakefile:801: recipe for target 'native-code-library' failed
make: *** [native-code-library] Error 2
Close

Error on camlpdf.1.7.1 (4.07.1+clambda+bench)

Command:

/usr/bin/make

Output

make[1]: Entering directory '/home/louis/.opam/4.07.1+flambda+bench/.opam-switch/build/camlpdf.1.7.1'
ocamlfind ocamldep -native pdfmerge.mli > ._ncdi/pdfmerge.di
ocamlfind ocamldep -native pdftype0.mli > ._ncdi/pdftype0.di
ocamlfind ocamldep -native pdftruetype.mli > ._ncdi/pdftruetype.di
ocamlfind ocamldep -native pdftype1.mli > ._ncdi/pdftype1.di
ocamlfind ocamldep -native pdfcff.mli > ._ncdi/pdfcff.di
ocamlfind ocamldep -native pdfocg.mli > ._ncdi/pdfocg.di
ocamlfind ocamldep -native pdfdate.mli > ._ncdi/pdfdate.di
ocamlfind ocamldep -native pdfshapes.mli > ._ncdi/pdfshapes.di
ocamlfind ocamldep -native pdfgraphics.mli > ._ncdi/pdfgraphics.di
ocamlfind ocamldep -native pdfstandard14.mli > ._ncdi/pdfstandard14.di
ocamlfind ocamldep -native pdftext.mli > ._ncdi/pdftext.di
ocamlfind ocamldep -native pdfglyphlist.mli > ._ncdi/pdfglyphlist.di
ocamlfind ocamldep -native pdfafmdata.mli > ._ncdi/pdfafmdata.di
ocamlfind ocamldep -native pdfafm.mli > ._ncdi/pdfafm.di
ocamlfind ocamldep -native pdfimage.mli > ._ncdi/pdfimage.di
ocamlfind ocamldep -native pdfspace.mli > ._ncdi/pdfspace.di
ocamlfind ocamldep -native pdffun.mli > ._ncdi/pdffun.di
ocamlfind ocamldep -native pdfannot.mli > ._ncdi/pdfannot.di
ocamlfind ocamldep -native pdfpage.mli > ._ncdi/pdfpage.di
ocamlfind ocamldep -native pdfpagelabels.mli > ._ncdi/pdfpagelabels.di
ocamlfind ocamldep -native pdfmarks.mli > ._ncdi/pdfmarks.di
ocamlfind ocamldep -native pdfdest.mli > ._ncdi/pdfdest.di
ocamlfind ocamldep -native pdfops.mli > ._ncdi/pdfops.di
ocamlfind ocamldep -native pdfjpeg.mli > ._ncdi/pdfjpeg.di
ocamlfind ocamldep -native pdfread.mli > ._ncdi/pdfread.di
ocamlfind ocamldep -native pdfgenlex.mli > ._ncdi/pdfgenlex.di
ocamlfind ocamldep -native pdfwrite.mli > ._ncdi/pdfwrite.di
ocamlfind ocamldep -native pdfcodec.mli > ._ncdi/pdfcodec.di
ocamlfind ocamldep -native pdfflate.mli > ._ncdi/pdfflate.di
ocamlfind ocamldep -native pdfcrypt.mli > ._ncdi/pdfcrypt.di
ocamlfind ocamldep -native pdf.mli > ._ncdi/pdf.di
ocamlfind ocamldep -native pdfpaper.mli > ._ncdi/pdfpaper.di
ocamlfind ocamldep -native pdfunits.mli > ._ncdi/pdfunits.di
ocamlfind ocamldep -native pdftransform.mli > ._ncdi/pdftransform.di
ocamlfind ocamldep -native pdfio.mli > ._ncdi/pdfio.di
ocamlfind ocamldep -native pdfutil.mli > ._ncdi/pdfutil.di
ocamlfind ocamldep pdfmerge.ml > ._d/pdfmerge.d
ocamlfind ocamldep pdftype0.ml > ._d/pdftype0.d
ocamlfind ocamldep pdftruetype.ml > ._d/pdftruetype.d
ocamlfind ocamldep pdftype1.ml > ._d/pdftype1.d
ocamlfind ocamldep pdfcff.ml > ._d/pdfcff.d
ocamlfind ocamldep pdfocg.ml > ._d/pdfocg.d
ocamlfind ocamldep pdfdate.ml > ._d/pdfdate.d
ocamlfind ocamldep pdfshapes.ml > ._d/pdfshapes.d
ocamlfind ocamldep pdfgraphics.ml > ._d/pdfgraphics.d
ocamlfind ocamldep pdfstandard14.ml > ._d/pdfstandard14.d
ocamlfind ocamldep pdftext.ml > ._d/pdftext.d
ocamlfind ocamldep pdfglyphlist.ml > ._d/pdfglyphlist.d
ocamlfind ocamldep pdfafmdata.ml > ._d/pdfafmdata.d
ocamlfind ocamldep pdfafm.ml > ._d/pdfafm.d
ocamlfind ocamldep pdfimage.ml > ._d/pdfimage.d
ocamlfind ocamldep pdfspace.ml > ._d/pdfspace.d
ocamlfind ocamldep pdffun.ml > ._d/pdffun.d
ocamlfind ocamldep pdfannot.ml > ._d/pdfannot.d
ocamlfind ocamldep pdfpage.ml > ._d/pdfpage.d
ocamlfind ocamldep pdfpagelabels.ml > ._d/pdfpagelabels.d
ocamlfind ocamldep pdfmarks.ml > ._d/pdfmarks.d
ocamlfind ocamldep pdfdest.ml > ._d/pdfdest.d
ocamlfind ocamldep pdfops.ml > ._d/pdfops.d
ocamlfind ocamldep pdfjpeg.ml > ._d/pdfjpeg.d
ocamlfind ocamldep pdfread.ml > ._d/pdfread.d
ocamlfind ocamldep pdfgenlex.ml > ._d/pdfgenlex.d
ocamlfind ocamldep pdfwrite.ml > ._d/pdfwrite.d
ocamlfind ocamldep pdfcodec.ml > ._d/pdfcodec.d
ocamlfind ocamldep pdfflate.ml > ._d/pdfflate.d
ocamlfind ocamldep pdfcrypt.ml > ._d/pdfcrypt.d
ocamlfind ocamldep pdf.ml > ._d/pdf.d
ocamlfind ocamldep pdfpaper.ml > ._d/pdfpaper.d
ocamlfind ocamldep pdfunits.ml > ._d/pdfunits.d
ocamlfind ocamldep pdftransform.ml > ._d/pdftransform.d
ocamlfind ocamldep pdfio.ml > ._d/pdfio.d
ocamlfind ocamldep pdfutil.ml > ._d/pdfutil.d
ocamlc -c -cc "cc" -ccopt "-fPIC  \
			-DPIC -DNATIVE_CODE   \
			    -o flatestubs.o " flatestubs.c
flatestubs.c: In function ‘camlzip_update_crc32’:
flatestubs.c:173:28: error: ‘uint32’ undeclared (first use in this function)
   return copy_int32(crc32((uint32) Int32_val(crc), 
                            ^
flatestubs.c:173:28: note: each undeclared identifier is reported only once for each function it appears in
In file included from flatestubs.c:20:0:
At top level:
miniz.c:2440:28: warning: always_inline function might not be inlinable [-Wattributes]
 static MZ_FORCEINLINE void tdefl_record_match(tdefl_compressor *d, mz_uint match_len, mz_uint match_dist)
                            ^
miniz.c:2432:28: warning: always_inline function might not be inlinable [-Wattributes]
 static MZ_FORCEINLINE void tdefl_record_literal(tdefl_compressor *d, mz_uint8 lit)
                            ^
miniz.c:2230:28: warning: always_inline function might not be inlinable [-Wattributes]
 static MZ_FORCEINLINE void tdefl_find_match(tdefl_compressor *d, mz_uint lookahead_pos, mz_uint max_dist, mz_uint max_match_len, mz_uint *pMatch_dist, mz_uint *pMatch_len)
                            ^
OCamlMakefile:1132: recipe for target 'flatestubs.o' failed
make[1]: *** [flatestubs.o] Error 2
make[1]: Leaving directory '/home/louis/.opam/4.07.1+flambda+bench/.opam-switch/build/camlpdf.1.7.1'
OCamlMakefile:801: recipe for target 'native-code-library' failed
make: *** [native-code-library] Error 2
make[1]: Entering directory '/home/louis/.opam/4.07.1+oclassic+bench/.opam-switch/build/camlpdf.1.7.1'
ocamlfind ocamldep -native pdfmerge.mli > ._ncdi/pdfmerge.di
ocamlfind ocamldep -native pdftype0.mli > ._ncdi/pdftype0.di
ocamlfind ocamldep -native pdftruetype.mli > ._ncdi/pdftruetype.di
ocamlfind ocamldep -native pdftype1.mli > ._ncdi/pdftype1.di
ocamlfind ocamldep -native pdfcff.mli > ._ncdi/pdfcff.di
ocamlfind ocamldep -native pdfocg.mli > ._ncdi/pdfocg.di
ocamlfind ocamldep -native pdfdate.mli > ._ncdi/pdfdate.di
ocamlfind ocamldep -native pdfshapes.mli > ._ncdi/pdfshapes.di
ocamlfind ocamldep -native pdfgraphics.mli > ._ncdi/pdfgraphics.di
ocamlfind ocamldep -native pdfstandard14.mli > ._ncdi/pdfstandard14.di
ocamlfind ocamldep -native pdftext.mli > ._ncdi/pdftext.di
ocamlfind ocamldep -native pdfglyphlist.mli > ._ncdi/pdfglyphlist.di
ocamlfind ocamldep -native pdfafmdata.mli > ._ncdi/pdfafmdata.di
ocamlfind ocamldep -native pdfafm.mli > ._ncdi/pdfafm.di
ocamlfind ocamldep -native pdfimage.mli > ._ncdi/pdfimage.di
ocamlfind ocamldep -native pdfspace.mli > ._ncdi/pdfspace.di
ocamlfind ocamldep -native pdffun.mli > ._ncdi/pdffun.di
ocamlfind ocamldep -native pdfannot.mli > ._ncdi/pdfannot.di
ocamlfind ocamldep -native pdfpage.mli > ._ncdi/pdfpage.di
ocamlfind ocamldep -native pdfpagelabels.mli > ._ncdi/pdfpagelabels.di
ocamlfind ocamldep -native pdfmarks.mli > ._ncdi/pdfmarks.di
ocamlfind ocamldep -native pdfdest.mli > ._ncdi/pdfdest.di
ocamlfind ocamldep -native pdfops.mli > ._ncdi/pdfops.di
ocamlfind ocamldep -native pdfjpeg.mli > ._ncdi/pdfjpeg.di
ocamlfind ocamldep -native pdfread.mli > ._ncdi/pdfread.di
ocamlfind ocamldep -native pdfgenlex.mli > ._ncdi/pdfgenlex.di
ocamlfind ocamldep -native pdfwrite.mli > ._ncdi/pdfwrite.di
ocamlfind ocamldep -native pdfcodec.mli > ._ncdi/pdfcodec.di
ocamlfind ocamldep -native pdfflate.mli > ._ncdi/pdfflate.di
ocamlfind ocamldep -native pdfcrypt.mli > ._ncdi/pdfcrypt.di
ocamlfind ocamldep -native pdf.mli > ._ncdi/pdf.di
ocamlfind ocamldep -native pdfpaper.mli > ._ncdi/pdfpaper.di
ocamlfind ocamldep -native pdfunits.mli > ._ncdi/pdfunits.di
ocamlfind ocamldep -native pdftransform.mli > ._ncdi/pdftransform.di
ocamlfind ocamldep -native pdfio.mli > ._ncdi/pdfio.di
ocamlfind ocamldep -native pdfutil.mli > ._ncdi/pdfutil.di
ocamlfind ocamldep pdfmerge.ml > ._d/pdfmerge.d
ocamlfind ocamldep pdftype0.ml > ._d/pdftype0.d
ocamlfind ocamldep pdftruetype.ml > ._d/pdftruetype.d
ocamlfind ocamldep pdftype1.ml > ._d/pdftype1.d
ocamlfind ocamldep pdfcff.ml > ._d/pdfcff.d
ocamlfind ocamldep pdfocg.ml > ._d/pdfocg.d
ocamlfind ocamldep pdfdate.ml > ._d/pdfdate.d
ocamlfind ocamldep pdfshapes.ml > ._d/pdfshapes.d
ocamlfind ocamldep pdfgraphics.ml > ._d/pdfgraphics.d
ocamlfind ocamldep pdfstandard14.ml > ._d/pdfstandard14.d
ocamlfind ocamldep pdftext.ml > ._d/pdftext.d
ocamlfind ocamldep pdfglyphlist.ml > ._d/pdfglyphlist.d
ocamlfind ocamldep pdfafmdata.ml > ._d/pdfafmdata.d
ocamlfind ocamldep pdfafm.ml > ._d/pdfafm.d
ocamlfind ocamldep pdfimage.ml > ._d/pdfimage.d
ocamlfind ocamldep pdfspace.ml > ._d/pdfspace.d
ocamlfind ocamldep pdffun.ml > ._d/pdffun.d
ocamlfind ocamldep pdfannot.ml > ._d/pdfannot.d
ocamlfind ocamldep pdfpage.ml > ._d/pdfpage.d
ocamlfind ocamldep pdfpagelabels.ml > ._d/pdfpagelabels.d
ocamlfind ocamldep pdfmarks.ml > ._d/pdfmarks.d
ocamlfind ocamldep pdfdest.ml > ._d/pdfdest.d
ocamlfind ocamldep pdfops.ml > ._d/pdfops.d
ocamlfind ocamldep pdfjpeg.ml > ._d/pdfjpeg.d
ocamlfind ocamldep pdfread.ml > ._d/pdfread.d
ocamlfind ocamldep pdfgenlex.ml > ._d/pdfgenlex.d
ocamlfind ocamldep pdfwrite.ml > ._d/pdfwrite.d
ocamlfind ocamldep pdfcodec.ml > ._d/pdfcodec.d
ocamlfind ocamldep pdfflate.ml > ._d/pdfflate.d
ocamlfind ocamldep pdfcrypt.ml > ._d/pdfcrypt.d
ocamlfind ocamldep pdf.ml > ._d/pdf.d
ocamlfind ocamldep pdfpaper.ml > ._d/pdfpaper.d
ocamlfind ocamldep pdfunits.ml > ._d/pdfunits.d
ocamlfind ocamldep pdftransform.ml > ._d/pdftransform.d
ocamlfind ocamldep pdfio.ml > ._d/pdfio.d
ocamlfind ocamldep pdfutil.ml > ._d/pdfutil.d
ocamlc -c -cc "cc" -ccopt "-fPIC  \
			-DPIC -DNATIVE_CODE   \
			    -o flatestubs.o " flatestubs.c
flatestubs.c: In function ‘camlzip_update_crc32’:
flatestubs.c:173:28: error: ‘uint32’ undeclared (first use in this function)
   return copy_int32(crc32((uint32) Int32_val(crc), 
                            ^
flatestubs.c:173:28: note: each undeclared identifier is reported only once for each function it appears in
In file included from flatestubs.c:20:0:
At top level:
miniz.c:2440:28: warning: always_inline function might not be inlinable [-Wattributes]
 static MZ_FORCEINLINE void tdefl_record_match(tdefl_compressor *d, mz_uint match_len, mz_uint match_dist)
                            ^
miniz.c:2432:28: warning: always_inline function might not be inlinable [-Wattributes]
 static MZ_FORCEINLINE void tdefl_record_literal(tdefl_compressor *d, mz_uint8 lit)
                            ^
miniz.c:2230:28: warning: always_inline function might not be inlinable [-Wattributes]
 static MZ_FORCEINLINE void tdefl_find_match(tdefl_compressor *d, mz_uint lookahead_pos, mz_uint max_dist, mz_uint max_match_len, mz_uint *pMatch_dist, mz_uint *pMatch_len)
                            ^
OCamlMakefile:1132: recipe for target 'flatestubs.o' failed
make[1]: *** [flatestubs.o] Error 2
make[1]: Leaving directory '/home/louis/.opam/4.07.1+oclassic+bench/.opam-switch/build/camlpdf.1.7.1'
OCamlMakefile:801: recipe for target 'native-code-library' failed
make: *** [native-code-library] Error 2
make[1]: Entering directory '/home/louis/.opam/4.07.1+clambda+bench/.opam-switch/build/camlpdf.1.7.1'
ocamlfind ocamldep -native pdfmerge.mli > ._ncdi/pdfmerge.di
ocamlfind ocamldep -native pdftype0.mli > ._ncdi/pdftype0.di
ocamlfind ocamldep -native pdftruetype.mli > ._ncdi/pdftruetype.di
ocamlfind ocamldep -native pdftype1.mli > ._ncdi/pdftype1.di
ocamlfind ocamldep -native pdfcff.mli > ._ncdi/pdfcff.di
ocamlfind ocamldep -native pdfocg.mli > ._ncdi/pdfocg.di
ocamlfind ocamldep -native pdfdate.mli > ._ncdi/pdfdate.di
ocamlfind ocamldep -native pdfshapes.mli > ._ncdi/pdfshapes.di
ocamlfind ocamldep -native pdfgraphics.mli > ._ncdi/pdfgraphics.di
ocamlfind ocamldep -native pdfstandard14.mli > ._ncdi/pdfstandard14.di
ocamlfind ocamldep -native pdftext.mli > ._ncdi/pdftext.di
ocamlfind ocamldep -native pdfglyphlist.mli > ._ncdi/pdfglyphlist.di
ocamlfind ocamldep -native pdfafmdata.mli > ._ncdi/pdfafmdata.di
ocamlfind ocamldep -native pdfafm.mli > ._ncdi/pdfafm.di
ocamlfind ocamldep -native pdfimage.mli > ._ncdi/pdfimage.di
ocamlfind ocamldep -native pdfspace.mli > ._ncdi/pdfspace.di
ocamlfind ocamldep -native pdffun.mli > ._ncdi/pdffun.di
ocamlfind ocamldep -native pdfannot.mli > ._ncdi/pdfannot.di
ocamlfind ocamldep -native pdfpage.mli > ._ncdi/pdfpage.di
ocamlfind ocamldep -native pdfpagelabels.mli > ._ncdi/pdfpagelabels.di
ocamlfind ocamldep -native pdfmarks.mli > ._ncdi/pdfmarks.di
ocamlfind ocamldep -native pdfdest.mli > ._ncdi/pdfdest.di
ocamlfind ocamldep -native pdfops.mli > ._ncdi/pdfops.di
ocamlfind ocamldep -native pdfjpeg.mli > ._ncdi/pdfjpeg.di
ocamlfind ocamldep -native pdfread.mli > ._ncdi/pdfread.di
ocamlfind ocamldep -native pdfgenlex.mli > ._ncdi/pdfgenlex.di
ocamlfind ocamldep -native pdfwrite.mli > ._ncdi/pdfwrite.di
ocamlfind ocamldep -native pdfcodec.mli > ._ncdi/pdfcodec.di
ocamlfind ocamldep -native pdfflate.mli > ._ncdi/pdfflate.di
ocamlfind ocamldep -native pdfcrypt.mli > ._ncdi/pdfcrypt.di
ocamlfind ocamldep -native pdf.mli > ._ncdi/pdf.di
ocamlfind ocamldep -native pdfpaper.mli > ._ncdi/pdfpaper.di
ocamlfind ocamldep -native pdfunits.mli > ._ncdi/pdfunits.di
ocamlfind ocamldep -native pdftransform.mli > ._ncdi/pdftransform.di
ocamlfind ocamldep -native pdfio.mli > ._ncdi/pdfio.di
ocamlfind ocamldep -native pdfutil.mli > ._ncdi/pdfutil.di
ocamlfind ocamldep pdfmerge.ml > ._d/pdfmerge.d
ocamlfind ocamldep pdftype0.ml > ._d/pdftype0.d
ocamlfind ocamldep pdftruetype.ml > ._d/pdftruetype.d
ocamlfind ocamldep pdftype1.ml > ._d/pdftype1.d
ocamlfind ocamldep pdfcff.ml > ._d/pdfcff.d
ocamlfind ocamldep pdfocg.ml > ._d/pdfocg.d
ocamlfind ocamldep pdfdate.ml > ._d/pdfdate.d
ocamlfind ocamldep pdfshapes.ml > ._d/pdfshapes.d
ocamlfind ocamldep pdfgraphics.ml > ._d/pdfgraphics.d
ocamlfind ocamldep pdfstandard14.ml > ._d/pdfstandard14.d
ocamlfind ocamldep pdftext.ml > ._d/pdftext.d
ocamlfind ocamldep pdfglyphlist.ml > ._d/pdfglyphlist.d
ocamlfind ocamldep pdfafmdata.ml > ._d/pdfafmdata.d
ocamlfind ocamldep pdfafm.ml > ._d/pdfafm.d
ocamlfind ocamldep pdfimage.ml > ._d/pdfimage.d
ocamlfind ocamldep pdfspace.ml > ._d/pdfspace.d
ocamlfind ocamldep pdffun.ml > ._d/pdffun.d
ocamlfind ocamldep pdfannot.ml > ._d/pdfannot.d
ocamlfind ocamldep pdfpage.ml > ._d/pdfpage.d
ocamlfind ocamldep pdfpagelabels.ml > ._d/pdfpagelabels.d
ocamlfind ocamldep pdfmarks.ml > ._d/pdfmarks.d
ocamlfind ocamldep pdfdest.ml > ._d/pdfdest.d
ocamlfind ocamldep pdfops.ml > ._d/pdfops.d
ocamlfind ocamldep pdfjpeg.ml > ._d/pdfjpeg.d
ocamlfind ocamldep pdfread.ml > ._d/pdfread.d
ocamlfind ocamldep pdfgenlex.ml > ._d/pdfgenlex.d
ocamlfind ocamldep pdfwrite.ml > ._d/pdfwrite.d
ocamlfind ocamldep pdfcodec.ml > ._d/pdfcodec.d
ocamlfind ocamldep pdfflate.ml > ._d/pdfflate.d
ocamlfind ocamldep pdfcrypt.ml > ._d/pdfcrypt.d
ocamlfind ocamldep pdf.ml > ._d/pdf.d
ocamlfind ocamldep pdfpaper.ml > ._d/pdfpaper.d
ocamlfind ocamldep pdfunits.ml > ._d/pdfunits.d
ocamlfind ocamldep pdftransform.ml > ._d/pdftransform.d
ocamlfind ocamldep pdfio.ml > ._d/pdfio.d
ocamlfind ocamldep pdfutil.ml > ._d/pdfutil.d
ocamlc -c -cc "cc" -ccopt "-fPIC  \
			-DPIC -DNATIVE_CODE   \
			    -o flatestubs.o " flatestubs.c
flatestubs.c: In function ‘camlzip_update_crc32’:
flatestubs.c:173:28: error: ‘uint32’ undeclared (first use in this function)
   return copy_int32(crc32((uint32) Int32_val(crc), 
                            ^
flatestubs.c:173:28: note: each undeclared identifier is reported only once for each function it appears in
In file included from flatestubs.c:20:0:
At top level:
miniz.c:2440:28: warning: always_inline function might not be inlinable [-Wattributes]
 static MZ_FORCEINLINE void tdefl_record_match(tdefl_compressor *d, mz_uint match_len, mz_uint match_dist)
                            ^
miniz.c:2432:28: warning: always_inline function might not be inlinable [-Wattributes]
 static MZ_FORCEINLINE void tdefl_record_literal(tdefl_compressor *d, mz_uint8 lit)
                            ^
miniz.c:2230:28: warning: always_inline function might not be inlinable [-Wattributes]
 static MZ_FORCEINLINE void tdefl_find_match(tdefl_compressor *d, mz_uint lookahead_pos, mz_uint max_dist, mz_uint max_match_len, mz_uint *pMatch_dist, mz_uint *pMatch_len)
                            ^
OCamlMakefile:1132: recipe for target 'flatestubs.o' failed
make[1]: *** [flatestubs.o] Error 2
make[1]: Leaving directory '/home/louis/.opam/4.07.1+clambda+bench/.opam-switch/build/camlpdf.1.7.1'
OCamlMakefile:801: recipe for target 'native-code-library' failed
make: *** [native-code-library] Error 2
Close

Error on async-rpc-bench.1.0 (4.07.1+oclassic+bench)

Command:

/usr/bin/make -C async_rpc

Output

make: Entering directory '/home/louis/.opam/4.07.1+oclassic+bench/.opam-switch/build/async-rpc-bench.1.0/async_rpc'
ocamlfind ocamlopt -thread -syntax camlp4o -package async -package bin_prot.syntax -package core -c rpc_common.ml
ocamlfind: Package `bin_prot.syntax' not found
Makefile:12: recipe for target 'rpc_common.cmx' failed
make: *** [rpc_common.cmx] Error 2
make: Leaving directory '/home/louis/.opam/4.07.1+oclassic+bench/.opam-switch/build/async-rpc-bench.1.0/async_rpc'
Close

Error on async-rpc-bench.1.0 (4.07.1+flambda+bench)

Command:

/usr/bin/make -C async_rpc

Output

make: Entering directory '/home/louis/.opam/4.07.1+flambda+bench/.opam-switch/build/async-rpc-bench.1.0/async_rpc'
ocamlfind ocamlopt -thread -syntax camlp4o -package async -package bin_prot.syntax -package core -c rpc_common.ml
ocamlfind: Package `bin_prot.syntax' not found
Makefile:12: recipe for target 'rpc_common.cmx' failed
make: *** [rpc_common.cmx] Error 2
make: Leaving directory '/home/louis/.opam/4.07.1+flambda+bench/.opam-switch/build/async-rpc-bench.1.0/async_rpc'
Close

Error on async-rpc-bench.1.0 (4.07.1+clambda+bench)

Command:

/usr/bin/make -C async_rpc

Output

make: Entering directory '/home/louis/.opam/4.07.1+flambda+bench/.opam-switch/build/async-rpc-bench.1.0/async_rpc'
ocamlfind ocamlopt -thread -syntax camlp4o -package async -package bin_prot.syntax -package core -c rpc_common.ml
ocamlfind: Package `bin_prot.syntax' not found
Makefile:12: recipe for target 'rpc_common.cmx' failed
make: *** [rpc_common.cmx] Error 2
make: Leaving directory '/home/louis/.opam/4.07.1+flambda+bench/.opam-switch/build/async-rpc-bench.1.0/async_rpc'
make: Entering directory '/home/louis/.opam/4.07.1+oclassic+bench/.opam-switch/build/async-rpc-bench.1.0/async_rpc'
ocamlfind ocamlopt -thread -syntax camlp4o -package async -package bin_prot.syntax -package core -c rpc_common.ml
ocamlfind: Package `bin_prot.syntax' not found
Makefile:12: recipe for target 'rpc_common.cmx' failed
make: *** [rpc_common.cmx] Error 2
make: Leaving directory '/home/louis/.opam/4.07.1+oclassic+bench/.opam-switch/build/async-rpc-bench.1.0/async_rpc'
make: Entering directory '/home/louis/.opam/4.07.1+clambda+bench/.opam-switch/build/async-rpc-bench.1.0/async_rpc'
ocamlfind ocamlopt -thread -syntax camlp4o -package async -package bin_prot.syntax -package core -c rpc_common.ml
ocamlfind: Package `bin_prot.syntax' not found
Makefile:12: recipe for target 'rpc_common.cmx' failed
make: *** [rpc_common.cmx] Error 2
make: Leaving directory '/home/louis/.opam/4.07.1+clambda+bench/.opam-switch/build/async-rpc-bench.1.0/async_rpc'
Close

Error on async-rpc-bench.1.0 (4.03.1+bench)

Command:

/usr/bin/make -C async_rpc

Output

make: Entering directory '/home/louis/.opam/4.03.1+bench/.opam-switch/build/async-rpc-bench.1.0/async_rpc'
ocamlfind ocamlopt -thread -syntax camlp4o -package async -package bin_prot.syntax -package core -c rpc_common.ml
ocamlfind: Package `bin_prot.syntax' not found
Makefile:12: recipe for target 'rpc_common.cmx' failed
make: *** [rpc_common.cmx] Error 2
make: Leaving directory '/home/louis/.opam/4.03.1+bench/.opam-switch/build/async-rpc-bench.1.0/async_rpc'
Close

Error on async-echo-bench.1.0 (4.07.1+oclassic+bench)

Command:

/usr/bin/make -C async_echo

Output

make: Entering directory '/home/louis/.opam/4.07.1+oclassic+bench/.opam-switch/build/async-echo-bench.1.0/async_echo'
ocamlfind ocamlopt -thread -syntax camlp4o -package async -package bin_prot.syntax -package core -c echo_common.ml
ocamlfind: Package `bin_prot.syntax' not found
Makefile:20: recipe for target 'echo_common.cmx' failed
make: *** [echo_common.cmx] Error 2
make: Leaving directory '/home/louis/.opam/4.07.1+oclassic+bench/.opam-switch/build/async-echo-bench.1.0/async_echo'
Close

Error on async-echo-bench.1.0 (4.07.1+flambda+bench)

Command:

/usr/bin/make -C async_echo

Output

make: Entering directory '/home/louis/.opam/4.07.1+flambda+bench/.opam-switch/build/async-echo-bench.1.0/async_echo'
ocamlfind ocamlopt -thread -syntax camlp4o -package async -package bin_prot.syntax -package core -c echo_common.ml
ocamlfind: Package `bin_prot.syntax' not found
Makefile:20: recipe for target 'echo_common.cmx' failed
make: *** [echo_common.cmx] Error 2
make: Leaving directory '/home/louis/.opam/4.07.1+flambda+bench/.opam-switch/build/async-echo-bench.1.0/async_echo'
Close

Error on async-echo-bench.1.0 (4.07.1+clambda+bench)

Command:

/usr/bin/make -C async_echo

Output

make: Entering directory '/home/louis/.opam/4.07.1+flambda+bench/.opam-switch/build/async-echo-bench.1.0/async_echo'
ocamlfind ocamlopt -thread -syntax camlp4o -package async -package bin_prot.syntax -package core -c echo_common.ml
ocamlfind: Package `bin_prot.syntax' not found
Makefile:20: recipe for target 'echo_common.cmx' failed
make: *** [echo_common.cmx] Error 2
make: Leaving directory '/home/louis/.opam/4.07.1+flambda+bench/.opam-switch/build/async-echo-bench.1.0/async_echo'
make: Entering directory '/home/louis/.opam/4.07.1+oclassic+bench/.opam-switch/build/async-echo-bench.1.0/async_echo'
ocamlfind ocamlopt -thread -syntax camlp4o -package async -package bin_prot.syntax -package core -c echo_common.ml
ocamlfind: Package `bin_prot.syntax' not found
Makefile:20: recipe for target 'echo_common.cmx' failed
make: *** [echo_common.cmx] Error 2
make: Leaving directory '/home/louis/.opam/4.07.1+oclassic+bench/.opam-switch/build/async-echo-bench.1.0/async_echo'
make: Entering directory '/home/louis/.opam/4.07.1+clambda+bench/.opam-switch/build/async-echo-bench.1.0/async_echo'
ocamlfind ocamlopt -thread -syntax camlp4o -package async -package bin_prot.syntax -package core -c echo_common.ml
ocamlfind: Package `bin_prot.syntax' not found
Makefile:20: recipe for target 'echo_common.cmx' failed
make: *** [echo_common.cmx] Error 2
make: Leaving directory '/home/louis/.opam/4.07.1+clambda+bench/.opam-switch/build/async-echo-bench.1.0/async_echo'
Close

Error on async-echo-bench.1.0 (4.03.1+bench)

Command:

/usr/bin/make -C async_echo

Output

make: Entering directory '/home/louis/.opam/4.03.1+bench/.opam-switch/build/async-echo-bench.1.0/async_echo'
ocamlfind ocamlopt -thread -syntax camlp4o -package async -package bin_prot.syntax -package core -c echo_common.ml
ocamlfind: Package `bin_prot.syntax' not found
Makefile:20: recipe for target 'echo_common.cmx' failed
make: *** [echo_common.cmx] Error 2
make: Leaving directory '/home/louis/.opam/4.03.1+bench/.opam-switch/build/async-echo-bench.1.0/async_echo'