Package4.03.1+bench4.05.0+flambda+opt+bench4.06.1+flambda+bench4.06.1+flambda+opt+bench4.07.1+clambda+bench4.07.1+flambda+bench4.07.1+oclassic+bench4.08.0+gpr2165+bench4.08.0+mutmatch+bench4.08.0+trunk+bench4.08.0+trunk+flambda+bench4.08.0+trunk+flambda+oclassic+bench4.08.0+trunk+flambda+opt+bench4.03.1+bench time (s)4.05.0+flambda+opt+bench time (s)4.06.1+flambda+bench time (s)4.06.1+flambda+opt+bench time (s)4.07.1+clambda+bench time (s)4.07.1+flambda+bench time (s)4.07.1+oclassic+bench time (s)4.08.0+gpr2165+bench time (s)4.08.0+mutmatch+bench time (s)4.08.0+trunk+bench time (s)4.08.0+trunk+flambda+bench time (s)4.08.0+trunk+flambda+oclassic+bench time (s)4.08.0+trunk+flambda+opt+bench time (s)
almabench-bench.1.0--Aborted--------AbortedAborted--0.000--------0.0000.000
alt-ergo.2.3.0--Aborted--------AbortedAborted--0.000--------0.0000.000
alt-ergo-lib.2.3.0--Aborted-----Aborted--AbortedAborted--0.000-----0.000--0.0000.000
alt-ergo-parsers.2.3.0--Aborted-----Aborted--AbortedAborted--0.000-----0.000--0.0000.000
async.v0.11.0--Aborted------------0.000----------
async.v0.12.0-------AbortedAbortedAborted-AbortedAborted-------0.0000.0000.000-0.0000.000
async-echo-bench.1.0Failure (2)-Aborted-Failure (2)Failure (2)Failure (2)AbortedAbortedAborted-AbortedAborted0.563-0.000-0.5880.5650.5890.0000.0000.000-0.0000.000
async-rpc-bench.1.0Failure (2)-Aborted-Failure (2)Failure (2)Failure (2)AbortedAbortedAborted-AbortedAborted0.571-0.000-0.6560.6410.6570.0000.0000.000-0.0000.000
async_extra.v0.11.0--Aborted------------0.000----------
async_extra.v0.12.0-------AbortedAbortedAborted-AbortedAborted-------0.0000.0000.000-0.0000.000
async_kernel.v0.11.1--Aborted------------0.000----------
async_kernel.v0.12.0-------AbortedAbortedAborted-AbortedAborted-------0.0000.0000.000-0.0000.000
async_rpc_kernel.v0.11.0--Aborted------------0.000----------
async_rpc_kernel.v0.12.0-------AbortedAbortedAborted-AbortedAborted-------0.0000.0000.000-0.0000.000
async_unix.v0.11.0--Aborted------------0.000----------
async_unix.v0.12.0-------AbortedAbortedAborted-AbortedAborted-------0.0000.0000.000-0.0000.000
base.v0.11.1--Aborted------------0.000----------
base.v0.12.2--------Aborted--AbortedAborted--------0.000--0.0000.000
base-bytes.base--Aborted-----Aborted--AbortedAborted--0.000-----0.000--0.0000.000
base64.3.2.0--Aborted-----Aborted--AbortedAborted--0.000-----0.000--0.0000.000
base_bigstring.v0.12.0-------AbortedAbortedAborted-AbortedAborted-------0.0000.0000.000-0.0000.000
base_quickcheck.v0.12.1-------AbortedAbortedAborted-AbortedAborted-------0.0000.0000.000-0.0000.000
bdd-bench.1.0--Aborted--------AbortedAborted--0.000--------0.0000.000
bin_prot.v0.11.0--Aborted------------0.000----------
bin_prot.v0.12.0-------AbortedAbortedAborted-AbortedAborted-------0.0000.0000.000-0.0000.000
biniou.1.2.1--Aborted-----Aborted--AbortedAborted--0.000-----0.000--0.0000.000
camlimages.5.0.1--Aborted-----AbortedFailure (1)-AbortedAborted--0.000-----0.0001.156-0.0000.000
camlpdf.2.3--Aborted-----Aborted--AbortedAborted--0.000-----0.000--0.0000.000
camlzip.1.08--Aborted-----Aborted--AbortedAborted--0.000-----0.000--0.0000.000
chameneos-bench.1.0Failure (2)-Aborted-Failure (2)Failure (2)Failure (2)AbortedAbortedAborted-AbortedAborted0.759-0.000-0.6660.7020.6870.0000.0000.000-0.0000.000
cohttp.2.3.0--Aborted----AbortedAbortedAborted-AbortedAborted--0.000----0.0000.0000.000-0.0000.000
cohttp-bench.1.0Failure (2)-Aborted-Failure (2)Failure (2)Failure (2)AbortedAbortedAborted-AbortedAborted0.502-0.000-0.5790.5900.5910.0000.0000.000-0.0000.000
conf-graphviz.0.1Failure (1)-Failure (1)-Failure (1)Failure (1)Failure (1)------0.434-0.045-0.5050.5120.515------
configurator.v0.11.0--Aborted-----Aborted--AbortedAborted--0.000-----0.000--0.0000.000
core.v0.11.3--Aborted------------0.000----------
core.v0.12.4-------AbortedAbortedAborted-AbortedAborted-------0.0000.0000.000-0.0000.000
core-micro-bench.1.0Failure (2)-Aborted-Failure (2)Failure (2)Failure (2)AbortedAbortedAborted-AbortedAborted0.420-0.000-0.4880.4970.5000.0000.0000.000-0.0000.000
core-sequence-bench.1.0--Aborted----AbortedAbortedAborted-AbortedAborted--0.000----0.0000.0000.000-0.0000.000
core_bench.v0.11.0--Aborted------------0.000----------
core_bench.v0.12.0-------AbortedAbortedAborted-AbortedAborted-------0.0000.0000.000-0.0000.000
core_extended.v0.11.0--Aborted------------0.000----------
core_extended.v0.12.0-------AbortedAbortedAborted-AbortedAborted-------0.0000.0000.000-0.0000.000
core_kernel.v0.11.1--Aborted------------0.000----------
core_kernel.v0.12.3-------AbortedAbortedAborted-AbortedAborted-------0.0000.0000.000-0.0000.000
cpdf.2.3--Aborted-----Aborted--AbortedAborted--0.000-----0.000--0.0000.000
cpdf-bench.1.0--Aborted-----Aborted--AbortedAborted--0.000-----0.000--0.0000.000
cppo.1.6.6--Aborted-----Aborted--AbortedAborted--0.000-----0.000--0.0000.000
dune.1.11.3--Aborted-----Failure (2)--AbortedAborted--0.000-----0.481--0.0000.000
dune-configurator.1.0.0--Aborted-----Aborted--AbortedAborted--0.000-----0.000--0.0000.000
easy-format.1.3.2--Aborted-----Aborted--AbortedAborted--0.000-----0.000--0.0000.000
expect_test_helpers.v0.11.0--Aborted------------0.000----------
expect_test_helpers.v0.12.0-------AbortedAbortedAborted-AbortedAborted-------0.0000.0000.000-0.0000.000
expect_test_helpers_kernel.v0.11.0--Aborted------------0.000----------
expect_test_helpers_kernel.v0.12.0-------AbortedAbortedAborted-AbortedAborted-------0.0000.0000.000-0.0000.000
fieldslib.v0.11.0--Aborted------------0.000----------
fieldslib.v0.12.0--------Aborted--AbortedAborted--------0.000--0.0000.000
frama-c.19.0OK-Aborted-OKOKOK------55.404-0.000-59.862106.96271.402------
frama-c-bench.1.0OK-Aborted-OKOKOK------0.122-0.000-0.1220.1230.109------
jane-street-headers.v0.11.0--Aborted------------0.000----------
jane-street-headers.v0.12.0--------Aborted--AbortedAborted--------0.000--0.0000.000
jbuilder.transition--Aborted-----Aborted--AbortedAborted--0.000-----0.000--0.0000.000
json-bench-data.1.0--Aborted--------AbortedAborted--0.000--------0.0000.000
jsonm.1.0.1--Aborted--------AbortedAborted--0.000--------0.0000.000
jsonm-bench.1.0--Aborted--------AbortedAborted--0.000--------0.0000.000
jst-config.v0.12.0-------AbortedAbortedAborted-AbortedAborted-------0.0000.0000.000-0.0000.000
kb-bench.1.0--Aborted--------AbortedAborted--0.000--------0.0000.000
lablgtk.2.18.8--Aborted------------0.000----------
lexifi-g2pp-bench.1.0--Aborted--------AbortedAborted--0.000--------0.0000.000
lwt.4.3.0--Aborted-----Aborted--AbortedAborted--0.000-----0.000--0.0000.000
menhir.20190626--Aborted-----Aborted--AbortedAborted--0.000-----0.000--0.0000.000
menhir-bench.1.0--Aborted-----Aborted--AbortedAborted--0.000-----0.000--0.0000.000
minilight.1.6--Aborted--------AbortedAborted--0.000--------0.0000.000
minilight-bench.1.0--Aborted--------AbortedAborted--0.000--------0.0000.000
mmap.1.1.0--Aborted-----Aborted--AbortedAborted--0.000-----0.000--0.0000.000
nbcodec.1.0--Aborted-----Aborted--AbortedAborted--0.000-----0.000--0.0000.000
nbcodec-bench.1.0--Aborted-----Aborted--AbortedAborted--0.000-----0.000--0.0000.000
num.1.2--Aborted-----Aborted--AbortedAborted--0.000-----0.000--0.0000.000
numerical-analysis-bench.1.0--Aborted----Failure (2)-Failure (2)-AbortedAborted--0.000----6.151-6.452-0.0000.000
ocaml.4.06.1--Failure (1)------------0.082----------
ocaml.4.08.0-----------AbortedAborted-----------0.0000.000
ocaml-compiler-libs.v0.12.1--Aborted-----Aborted--AbortedAborted--0.000-----0.000--0.0000.000
ocaml-migrate-parsetree.1.4.0--Aborted----Failure (1)AbortedFailure (1)-AbortedAborted--0.000----0.7500.0001.110-0.0000.000
ocaml-variants.4.08.0+trunk+flambda+oclassic-----------Failure (1)------------0.348-
ocaml-variants.4.08.0+trunk+flambda+opt------------Failure (1)------------0.312
ocamlbuild.0.14.0--Aborted--------AbortedAborted--0.000--------0.0000.000
ocamlfind.1.8.1--Aborted-----OK--AbortedAborted--0.000-----1.683--0.0000.000
ocamlgraph.1.8.8--Aborted------------0.000----------
ocplib-endian.1.0--Aborted-----Aborted--AbortedAborted--0.000-----0.000--0.0000.000
ocplib-simplex.0.4--Aborted-----Aborted--AbortedAborted--0.000-----0.000--0.0000.000
octavius.1.2.1--Aborted-----Aborted--AbortedAborted--0.000-----0.000--0.0000.000
parsexp.v0.11.0--Aborted------------0.000----------
parsexp.v0.12.0--------Aborted--AbortedAborted--------0.000--0.0000.000
patdiff.v0.11.0--Aborted------------0.000----------
patdiff.v0.12.0-------AbortedAbortedAborted-AbortedAborted-------0.0000.0000.000-0.0000.000
patdiff-bench.1.0--Aborted----AbortedAbortedAborted-AbortedAborted--0.000----0.0000.0000.000-0.0000.000
patience_diff.v0.11.0--Aborted------------0.000----------
patience_diff.v0.12.0-------AbortedAbortedAborted-AbortedAborted-------0.0000.0000.000-0.0000.000
pcre.7.4.1--Aborted-----AbortedFailure (1)-AbortedAborted--0.000-----0.0000.753-0.0000.000
ppx_assert.v0.11.0--Aborted------------0.000----------
ppx_assert.v0.12.0-------AbortedAbortedAborted-AbortedAborted-------0.0000.0000.000-0.0000.000
ppx_base.v0.11.0--Aborted------------0.000----------
ppx_base.v0.12.0-------AbortedAbortedAborted-AbortedAborted-------0.0000.0000.000-0.0000.000
ppx_bench.v0.11.0--Aborted------------0.000----------
ppx_bench.v0.12.0-------AbortedAbortedAborted-AbortedAborted-------0.0000.0000.000-0.0000.000
ppx_bin_prot.v0.11.1--Aborted------------0.000----------
ppx_bin_prot.v0.12.1-------AbortedAbortedAborted-AbortedAborted-------0.0000.0000.000-0.0000.000
ppx_compare.v0.11.1--Aborted------------0.000----------
ppx_compare.v0.12.0-------AbortedAbortedAborted-AbortedAborted-------0.0000.0000.000-0.0000.000
ppx_custom_printf.v0.11.0--Aborted------------0.000----------
ppx_custom_printf.v0.12.1-------AbortedAbortedAborted-AbortedAborted-------0.0000.0000.000-0.0000.000
ppx_derivers.1.2.1--Aborted-----Aborted--AbortedAborted--0.000-----0.000--0.0000.000
ppx_enumerate.v0.11.1--Aborted------------0.000----------
ppx_enumerate.v0.12.0-------AbortedAbortedAborted-AbortedAborted-------0.0000.0000.000-0.0000.000
ppx_expect.v0.11.1--Aborted------------0.000----------
ppx_expect.v0.12.0-------AbortedAbortedAborted-AbortedAborted-------0.0000.0000.000-0.0000.000
ppx_fail.v0.11.0--Aborted------------0.000----------
ppx_fail.v0.12.0-------AbortedAbortedAborted-AbortedAborted-------0.0000.0000.000-0.0000.000
ppx_fields_conv.v0.11.0--Aborted------------0.000----------
ppx_fields_conv.v0.12.0-------AbortedAbortedAborted-AbortedAborted-------0.0000.0000.000-0.0000.000
ppx_hash.v0.11.1--Aborted------------0.000----------
ppx_hash.v0.12.0-------AbortedAbortedAborted-AbortedAborted-------0.0000.0000.000-0.0000.000
ppx_here.v0.11.0--Aborted------------0.000----------
ppx_here.v0.12.0-------AbortedAbortedAborted-AbortedAborted-------0.0000.0000.000-0.0000.000
ppx_inline_test.v0.11.0--Aborted------------0.000----------
ppx_inline_test.v0.12.0-------AbortedAbortedAborted-AbortedAborted-------0.0000.0000.000-0.0000.000
ppx_jane.v0.11.0--Aborted------------0.000----------
ppx_jane.v0.12.0-------AbortedAbortedAborted-AbortedAborted-------0.0000.0000.000-0.0000.000
ppx_js_style.v0.11.0--Aborted------------0.000----------
ppx_js_style.v0.12.0-------AbortedAbortedAborted-AbortedAborted-------0.0000.0000.000-0.0000.000
ppx_let.v0.11.0--Aborted------------0.000----------
ppx_let.v0.12.0-------AbortedAbortedAborted-AbortedAborted-------0.0000.0000.000-0.0000.000
ppx_module_timer.v0.12.0-------AbortedAbortedAborted-AbortedAborted-------0.0000.0000.000-0.0000.000
ppx_optcomp.v0.11.0--Aborted------------0.000----------
ppx_optcomp.v0.12.0-------AbortedAbortedAborted-AbortedAborted-------0.0000.0000.000-0.0000.000
ppx_optional.v0.11.0--Aborted------------0.000----------
ppx_optional.v0.12.0-------AbortedAbortedAborted-AbortedAborted-------0.0000.0000.000-0.0000.000
ppx_pipebang.v0.11.0--Aborted------------0.000----------
ppx_pipebang.v0.12.0-------AbortedAbortedAborted-AbortedAborted-------0.0000.0000.000-0.0000.000
ppx_sexp_conv.v0.11.2--Aborted------------0.000----------
ppx_sexp_conv.v0.12.0-------AbortedAbortedAborted-AbortedAborted-------0.0000.0000.000-0.0000.000
ppx_sexp_message.v0.11.0--Aborted------------0.000----------
ppx_sexp_message.v0.12.0-------AbortedAbortedAborted-AbortedAborted-------0.0000.0000.000-0.0000.000
ppx_sexp_value.v0.11.0--Aborted------------0.000----------
ppx_sexp_value.v0.12.0-------AbortedAbortedAborted-AbortedAborted-------0.0000.0000.000-0.0000.000
ppx_stable.v0.12.0-------AbortedAbortedAborted-AbortedAborted-------0.0000.0000.000-0.0000.000
ppx_typerep_conv.v0.11.1--Aborted------------0.000----------
ppx_typerep_conv.v0.12.0-------AbortedAbortedAborted-AbortedAborted-------0.0000.0000.000-0.0000.000
ppx_variants_conv.v0.11.1--Aborted------------0.000----------
ppx_variants_conv.v0.12.0-------AbortedAbortedAborted-AbortedAborted-------0.0000.0000.000-0.0000.000
ppxlib.0.8.1--Aborted----AbortedAbortedAborted-AbortedAborted--0.000----0.0000.0000.000-0.0000.000
protocol_version_header.v0.11.0--Aborted------------0.000----------
protocol_version_header.v0.12.0-------AbortedAbortedAborted-AbortedAborted-------0.0000.0000.000-0.0000.000
psmt2-frontend.0.2--Aborted-----Aborted--AbortedAborted--0.000-----0.000--0.0000.000
re.1.9.0--Aborted-----Aborted--AbortedAborted--0.000-----0.000--0.0000.000
re2.v0.11.0--Aborted------------0.000----------
re2.v0.12.0-------AbortedAbortedAborted-AbortedAborted-------0.0000.0000.000-0.0000.000
result.1.4--Aborted-----Aborted--AbortedAborted--0.000-----0.000--0.0000.000
sauvola-bench.1.0--Aborted-----AbortedAborted-AbortedAborted--0.000-----0.0000.000-0.0000.000
seq.0.1--Aborted------------0.000----------
seq.base-----------AbortedAborted-----------0.0000.000
sequence-bench.1.0--Aborted--------AbortedAborted--0.000--------0.0000.000
sexp_pretty.v0.11.0--Aborted------------0.000----------
sexp_pretty.v0.12.0-------AbortedAbortedAborted-AbortedAborted-------0.0000.0000.000-0.0000.000
sexplib.v0.11.0--Aborted------------0.000----------
sexplib.v0.12.0--------Aborted--AbortedAborted--------0.000--0.0000.000
sexplib0.v0.11.0--Aborted------------0.000----------
sexplib0.v0.12.0--------Aborted--AbortedAborted--------0.000--0.0000.000
shell.v0.12.0-------AbortedAbortedAborted-AbortedAborted-------0.0000.0000.000-0.0000.000
spawn.v0.13.0--Aborted-----Aborted--AbortedAborted--0.000-----0.000--0.0000.000
splittable_random.v0.11.0--Aborted------------0.000----------
splittable_random.v0.12.0-------AbortedAbortedAborted-AbortedAborted-------0.0000.0000.000-0.0000.000
stdio.v0.11.0--Aborted------------0.000----------
stdio.v0.12.0--------Aborted--AbortedAborted--------0.000--0.0000.000
stdlib-shims.0.1.0--Aborted-----Aborted--AbortedAborted--0.000-----0.000--0.0000.000
stringext.1.6.0--Aborted-----Aborted--AbortedAborted--0.000-----0.000--0.0000.000
textutils.v0.11.0--Aborted------------0.000----------
textutils.v0.12.0-------AbortedAbortedAborted-AbortedAborted-------0.0000.0000.000-0.0000.000
textutils_kernel.v0.11.0--Aborted------------0.000----------
thread-bench.1.0--Aborted-Failure (2)Failure (2)Failure (2)AbortedAbortedAborted-AbortedAborted--0.000-0.6390.7300.6940.0000.0000.000-0.0000.000
time_now.v0.12.0-------AbortedAbortedAborted-AbortedAborted-------0.0000.0000.000-0.0000.000
topkg.1.0.1--Aborted-----Aborted--AbortedAborted--0.000-----0.000--0.0000.000
typerep.v0.11.0--Aborted------------0.000----------
typerep.v0.12.0--------Aborted--AbortedAborted--------0.000--0.0000.000
uchar.0.0.2--Aborted--------AbortedAborted--0.000--------0.0000.000
uri.3.0.0--Aborted-----Aborted--AbortedAborted--0.000-----0.000--0.0000.000
uri-sexp.3.0.0--Aborted----AbortedAbortedAborted-AbortedAborted--0.000----0.0000.0000.000-0.0000.000
uutf.1.0.2--Aborted--------AbortedAborted--0.000--------0.0000.000
valet-bench.1.0Failure (2)------------0.535------------
variantslib.v0.11.0--Aborted------------0.000----------
variantslib.v0.12.0--------Aborted--AbortedAborted--------0.000--0.0000.000
yojson.1.7.0--Aborted-----Aborted--AbortedAborted--0.000-----0.000--0.0000.000
yojson-bench.1.0Failure (2)-Aborted-Failure (2)Failure (2)Failure (2)Failure (2)AbortedFailure (2)-AbortedAborted0.139-0.000-0.1460.2000.1710.1490.0000.345-0.0000.000
zarith.1.9.1--Aborted-----Aborted--AbortedAborted--0.000-----0.000--0.0000.000
Close

Error on yojson-bench.1.0 (4.08.0+trunk+bench)

Command:

/usr/bin/make -C yojson

Output

make: Entering directory '/home/louis/.opam/4.08.0+trunk+bench/.opam-switch/build/yojson-bench.1.0/yojson'
ocamlfind ocamlopt -I `ocamlfind query yojson` -o ydump_bench -package easy-format,biniou -linkpkg yojson.cmx yojson_biniou.cmx ydump.ml
gcc: error: /home/louis/.opam/4.08.0+trunk+bench/lib/yojson/yojson_biniou.o: No such file or directory
gcc: error: /home/louis/.opam/4.08.0+trunk+bench/lib/yojson/yojson.o: No such file or directory
File "caml_startup", line 1:
Error: Error during linking
Makefile:6: recipe for target 'all' failed
make: *** [all] Error 2
make: Leaving directory '/home/louis/.opam/4.08.0+trunk+bench/.opam-switch/build/yojson-bench.1.0/yojson'
Close

Error on yojson-bench.1.0 (4.08.0+gpr2165+bench)

Command:

/usr/bin/make -C yojson

Output

make: Entering directory '/home/louis/.opam/4.08.0+gpr2165+bench/.opam-switch/build/yojson-bench.1.0/yojson'
ocamlfind ocamlopt -I `ocamlfind query yojson` -o ydump_bench -package easy-format,biniou -linkpkg yojson.cmx yojson_biniou.cmx ydump.ml
gcc: error: /home/louis/.opam/4.08.0+gpr2165+bench/lib/yojson/yojson_biniou.o: No such file or directory
gcc: error: /home/louis/.opam/4.08.0+gpr2165+bench/lib/yojson/yojson.o: No such file or directory
File "caml_startup", line 1:
Error: Error during linking
Makefile:6: recipe for target 'all' failed
make: *** [all] Error 2
make: Leaving directory '/home/louis/.opam/4.08.0+gpr2165+bench/.opam-switch/build/yojson-bench.1.0/yojson'
Close

Error on yojson-bench.1.0 (4.07.1+oclassic+bench)

Command:

/usr/bin/make -C yojson

Output

make: Entering directory '/home/louis/.opam/4.07.1+oclassic+bench/.opam-switch/build/yojson-bench.1.0/yojson'
ocamlfind ocamlopt -I `ocamlfind query yojson` -o ydump_bench -package easy-format,biniou -linkpkg yojson.cmx yojson_biniou.cmx ydump.ml
gcc: error: /home/louis/.opam/4.07.1+oclassic+bench/lib/yojson/yojson_biniou.o: No such file or directory
gcc: error: /home/louis/.opam/4.07.1+oclassic+bench/lib/yojson/yojson.o: No such file or directory
File "caml_startup", line 1:
Error: Error during linking
Makefile:6: recipe for target 'all' failed
make: *** [all] Error 2
make: Leaving directory '/home/louis/.opam/4.07.1+oclassic+bench/.opam-switch/build/yojson-bench.1.0/yojson'
Close

Error on yojson-bench.1.0 (4.07.1+flambda+bench)

Command:

/usr/bin/make -C yojson

Output

make: Entering directory '/home/louis/.opam/4.07.1+flambda+bench/.opam-switch/build/yojson-bench.1.0/yojson'
ocamlfind ocamlopt -I `ocamlfind query yojson` -o ydump_bench -package easy-format,biniou -linkpkg yojson.cmx yojson_biniou.cmx ydump.ml
gcc: error: /home/louis/.opam/4.07.1+flambda+bench/lib/yojson/yojson_biniou.o: No such file or directory
gcc: error: /home/louis/.opam/4.07.1+flambda+bench/lib/yojson/yojson.o: No such file or directory
File "caml_startup", line 1:
Error: Error during linking
Makefile:6: recipe for target 'all' failed
make: *** [all] Error 2
make: Leaving directory '/home/louis/.opam/4.07.1+flambda+bench/.opam-switch/build/yojson-bench.1.0/yojson'
Close

Error on yojson-bench.1.0 (4.07.1+clambda+bench)

Command:

/usr/bin/make -C yojson

Output

make: Entering directory '/home/louis/.opam/4.07.1+clambda+bench/.opam-switch/build/yojson-bench.1.0/yojson'
ocamlfind ocamlopt -I `ocamlfind query yojson` -o ydump_bench -package easy-format,biniou -linkpkg yojson.cmx yojson_biniou.cmx ydump.ml
gcc: error: /home/louis/.opam/4.07.1+clambda+bench/lib/yojson/yojson_biniou.o: No such file or directory
gcc: error: /home/louis/.opam/4.07.1+clambda+bench/lib/yojson/yojson.o: No such file or directory
File "caml_startup", line 1:
Error: Error during linking
Makefile:6: recipe for target 'all' failed
make: *** [all] Error 2
make: Leaving directory '/home/louis/.opam/4.07.1+clambda+bench/.opam-switch/build/yojson-bench.1.0/yojson'
Close

Error on yojson-bench.1.0 (4.03.1+bench)

Command:

/usr/bin/make -C yojson

Output

make: Entering directory '/home/louis/.opam/4.03.1+bench/.opam-switch/build/yojson-bench.1.0/yojson'
ocamlfind ocamlopt -I `ocamlfind query yojson` -o ydump_bench -package easy-format,biniou -linkpkg yojson.cmx yojson_biniou.cmx ydump.ml
gcc: error: /home/louis/.opam/4.03.1+bench/lib/yojson/yojson_biniou.o: No such file or directory
gcc: error: /home/louis/.opam/4.03.1+bench/lib/yojson/yojson.o: No such file or directory
File "caml_startup", line 1:
Error: Error during linking
Makefile:6: recipe for target 'all' failed
make: *** [all] Error 2
make: Leaving directory '/home/louis/.opam/4.03.1+bench/.opam-switch/build/yojson-bench.1.0/yojson'
Close

Error on valet-bench.1.0 (4.03.1+bench)

Command:

/usr/bin/make -C valet

Output

make: Entering directory '/home/louis/.opam/4.03.1+bench/.opam-switch/build/valet-bench.1.0/valet'
ocamlbuild -use-ocamlfind test_lwt.native test_async.native
ocamlfind ocamldep -package react -package uuidm -package unix -package ocplib-endian -package lwt.unix -modules test_lwt.ml > test_lwt.ml.depends
ocamlfind ocamldep -package react -package uuidm -package ocplib-endian -modules test_lib.ml > test_lib.ml.depends
ocamlfind ocamldep -package uuidm -package unix -package ocplib-endian -modules valet_core.ml > valet_core.ml.depends
ocamlfind ocamldep -package react -package uuidm -package ocplib-endian -modules valet_react.ml > valet_react.ml.depends
ocamlfind ocamlc -c -g -bin-annot -package uuidm -package unix -package ocplib-endian -o valet_core.cmo valet_core.ml
ocamlfind ocamlc -c -g -bin-annot -package react -package uuidm -package ocplib-endian -o valet_react.cmo valet_react.ml
ocamlfind ocamlc -c -g -bin-annot -package react -package uuidm -package ocplib-endian -o test_lib.cmo test_lib.ml
ocamlfind ocamlc -c -g -bin-annot -package react -package uuidm -package unix -package ocplib-endian -package lwt.unix -o test_lwt.cmo test_lwt.ml
+ ocamlfind ocamlc -c -g -bin-annot -package react -package uuidm -package unix -package ocplib-endian -package lwt.unix -o test_lwt.cmo test_lwt.ml
ocamlfind: [WARNING] Package `threads': Linking problems may arise because of the missing -thread or -vmthread switch
ocamlfind ocamlopt -c -g -bin-annot -package uuidm -package unix -package ocplib-endian -o valet_core.cmx valet_core.ml
ocamlfind ocamlopt -c -g -bin-annot -package react -package uuidm -package ocplib-endian -o valet_react.cmx valet_react.ml
ocamlfind ocamlopt -c -g -bin-annot -package react -package uuidm -package ocplib-endian -o test_lib.cmx test_lib.ml
ocamlfind ocamlopt -c -g -bin-annot -package react -package uuidm -package unix -package ocplib-endian -package lwt.unix -o test_lwt.cmx test_lwt.ml
+ ocamlfind ocamlopt -c -g -bin-annot -package react -package uuidm -package unix -package ocplib-endian -package lwt.unix -o test_lwt.cmx test_lwt.ml
ocamlfind: [WARNING] Package `threads': Linking problems may arise because of the missing -thread or -vmthread switch
ocamlfind ocamlopt -linkpkg -g -package react -package uuidm -package unix -package ocplib-endian -package lwt.unix valet_core.cmx valet_react.cmx test_lib.cmx test_lwt.cmx -o test_lwt.native
+ ocamlfind ocamlopt -linkpkg -g -package react -package uuidm -package unix -package ocplib-endian -package lwt.unix valet_core.cmx valet_react.cmx test_lib.cmx test_lwt.cmx -o test_lwt.native
ocamlfind: [WARNING] Package `threads': Linking problems may arise because of the missing -thread or -vmthread switch
ocamlfind ocamldep -package react -package uuidm -package unix -package ocplib-endian -package async -modules test_async.ml > test_async.ml.depends
ocamlfind ocamlc -c -g -bin-annot -thread -package react -package uuidm -package unix -package ocplib-endian -package async -o test_async.cmo test_async.ml
+ ocamlfind ocamlc -c -g -bin-annot -thread -package react -package uuidm -package unix -package ocplib-endian -package async -o test_async.cmo test_async.ml
File "test_async.ml", line 3, characters 5-13:
Warning 3: deprecated: module Core.Std
[since 2017-02] Use Core. The Std sub-module is no longer needed
File "test_async.ml", line 4, characters 5-14:
Warning 3: deprecated: module Async.Std
[since 2017-02] use Async. The Std sub-module is no longer needed
File "test_async.ml", line 23, characters 13-22:
Warning 3: deprecated: module Async.Std
[since 2017-02] use Async. The Std sub-module is no longer needed
File "test_async.ml", line 64, characters 5-19:
Error: This expression has type
         [> `Probably_should_not_use_blocking_Core_Printf_functions_with_Async ]
       This is not a function; it cannot be applied.
Command exited with code 2.
Makefile:6: recipe for target 'all' failed
make: *** [all] Error 10
make: Leaving directory '/home/louis/.opam/4.03.1+bench/.opam-switch/build/valet-bench.1.0/valet'
Close

Error on thread-bench.1.0 (4.07.1+oclassic+bench)

Command:

/usr/bin/make -C thread

Output

make: Entering directory '/home/louis/.opam/4.07.1+oclassic+bench/.opam-switch/build/thread-bench.1.0/thread'
ocamlfind ocamlopt -package lwt.unix -linkpkg -o thread_sleep_lwt thread_sleep_lwt.ml
ocamlfind: [WARNING] Package `threads': Linking problems may arise because of the missing -thread or -vmthread switch
ocamlfind ocamlopt -package lwt.unix -linkpkg -o thread_ring_lwt_mvar thread_ring_lwt_mvar.ml
ocamlfind: [WARNING] Package `threads': Linking problems may arise because of the missing -thread or -vmthread switch
ocamlfind ocamlopt -package lwt.unix -linkpkg -o thread_ring_lwt_stream thread_ring_lwt_stream.ml
ocamlfind: [WARNING] Package `threads': Linking problems may arise because of the missing -thread or -vmthread switch
ocamlfind ocamlopt -thread -package async -linkpkg -o thread_sleep_async thread_sleep_async.ml
File "thread_sleep_async.ml", line 1, characters 5-13:
Error: Unbound module Core.Std
Makefile:10: recipe for target 'thread_sleep_async' failed
make: *** [thread_sleep_async] Error 2
make: Leaving directory '/home/louis/.opam/4.07.1+oclassic+bench/.opam-switch/build/thread-bench.1.0/thread'
Close

Error on thread-bench.1.0 (4.07.1+flambda+bench)

Command:

/usr/bin/make -C thread

Output

make: Entering directory '/home/louis/.opam/4.07.1+flambda+bench/.opam-switch/build/thread-bench.1.0/thread'
ocamlfind ocamlopt -package lwt.unix -linkpkg -o thread_sleep_lwt thread_sleep_lwt.ml
ocamlfind: [WARNING] Package `threads': Linking problems may arise because of the missing -thread or -vmthread switch
ocamlfind ocamlopt -package lwt.unix -linkpkg -o thread_ring_lwt_mvar thread_ring_lwt_mvar.ml
ocamlfind: [WARNING] Package `threads': Linking problems may arise because of the missing -thread or -vmthread switch
ocamlfind ocamlopt -package lwt.unix -linkpkg -o thread_ring_lwt_stream thread_ring_lwt_stream.ml
ocamlfind: [WARNING] Package `threads': Linking problems may arise because of the missing -thread or -vmthread switch
ocamlfind ocamlopt -thread -package async -linkpkg -o thread_sleep_async thread_sleep_async.ml
File "thread_sleep_async.ml", line 1, characters 5-13:
Error: Unbound module Core.Std
Makefile:10: recipe for target 'thread_sleep_async' failed
make: *** [thread_sleep_async] Error 2
make: Leaving directory '/home/louis/.opam/4.07.1+flambda+bench/.opam-switch/build/thread-bench.1.0/thread'
Close

Error on thread-bench.1.0 (4.07.1+clambda+bench)

Command:

/usr/bin/make -C thread

Output

make: Entering directory '/home/louis/.opam/4.07.1+clambda+bench/.opam-switch/build/thread-bench.1.0/thread'
ocamlfind ocamlopt -package lwt.unix -linkpkg -o thread_sleep_lwt thread_sleep_lwt.ml
ocamlfind: [WARNING] Package `threads': Linking problems may arise because of the missing -thread or -vmthread switch
ocamlfind ocamlopt -package lwt.unix -linkpkg -o thread_ring_lwt_mvar thread_ring_lwt_mvar.ml
ocamlfind: [WARNING] Package `threads': Linking problems may arise because of the missing -thread or -vmthread switch
ocamlfind ocamlopt -package lwt.unix -linkpkg -o thread_ring_lwt_stream thread_ring_lwt_stream.ml
ocamlfind: [WARNING] Package `threads': Linking problems may arise because of the missing -thread or -vmthread switch
ocamlfind ocamlopt -thread -package async -linkpkg -o thread_sleep_async thread_sleep_async.ml
File "thread_sleep_async.ml", line 1, characters 5-13:
Error: Unbound module Core.Std
Makefile:10: recipe for target 'thread_sleep_async' failed
make: *** [thread_sleep_async] Error 2
make: Leaving directory '/home/louis/.opam/4.07.1+clambda+bench/.opam-switch/build/thread-bench.1.0/thread'
Close

Error on pcre.7.4.1 (4.08.0+trunk+bench)

Command:

~/.opam/4.08.0+trunk+bench/bin/dune build -p pcre -j 7

Output

    ocamlopt src/config/discover.exe (exit 2)
(cd _build/default && /home/louis/.opam/4.08.0+trunk+bench/bin/ocamlopt.opt -w -40 -g -O3 -o src/config/discover.exe -I /home/louis/.opam/4.08.0+trunk+bench/lib/base -I /home/louis/.opam/4.08.0+trunk+bench/lib/base/caml -I /home/louis/.opam/4.08.0+trunk+bench/lib/base/shadow_stdlib -I /home/louis/.opam/4.08.0+trunk+bench/lib/dune/_caml -I /home/louis/.opam/4.08.0+trunk+bench/lib/dune/_dune_lang -I /home/louis/.opam/4.08.0+trunk+bench/lib/dune/_ocaml_config -I /home/louis/.opam/4.08.0+trunk+bench/lib/dune/_result -I /home/louis/.opam/4.08.0+trunk+bench/lib/dune/_stdune -I /home/louis/.opam/4.08.0+trunk+bench/lib/dune/configurator -I /home/louis/.opam/4.08.0+trunk+bench/lib/sexplib0 /home/louis/.opam/4.08.0+trunk+bench/lib/base/caml/caml.cmxa /home/louis/.opam/4.08.0+trunk+bench/lib/sexplib0/sexplib0.cmxa /home/louis/.opam/4.08.0+trunk+bench/lib/base/shadow_stdlib/shadow_stdlib.cmxa /home/louis/.opam/4.08.0+trunk+bench/lib/base/base.cmxa /home/louis/.opam/4.08.0+trunk+bench/lib/dune/_result/dune_result.cmxa /home/louis/.opam/4.08.0+trunk+bench/lib/dune/_caml/dune_caml.cmxa /home/louis/.opam/4.08.0+trunk+bench/lib/ocaml/unix.cmxa /home/louis/.opam/4.08.0+trunk+bench/lib/dune/_stdune/stdune.cmxa /home/louis/.opam/4.08.0+trunk+bench/lib/dune/_ocaml_config/ocaml_config.cmxa /home/louis/.opam/4.08.0+trunk+bench/lib/dune/_dune_lang/dune_lang.cmxa /home/louis/.opam/4.08.0+trunk+bench/lib/dune/configurator/configurator.cmxa src/config/.discover.eobjs/native/discover.cmx)
/home/louis/.opam/4.08.0+trunk+bench/lib/base/libbase_stubs.a(exn_stubs.o): In function `Base_clear_caml_backtrace_pos':
/home/louis/.opam/4.08.0+trunk+bench/.opam-switch/build/base.v0.12.2/_build/default/src/exn_stubs.c:6: undefined reference to `caml_backtrace_pos'
collect2: error: ld returned 1 exit status
File "caml_startup", line 1:
Error: Error during linking
Close

Error on ocaml-variants.4.08.0+trunk+flambda+opt (4.08.0+trunk+flambda+opt+bench)

Command:

~/.opam/4.08.0+trunk+flambda+opt+bench/.opam-switch/build/ocaml-variants.4.08.0+trunk+flambda+opt/./configure -prefix /home/louis/.opam/4.08.0+trunk+flambda+opt+bench -flambda -with-debug-runtime

Output

configure: error: unrecognized option: `-flambda'
Try `/home/louis/.opam/4.08.0+trunk+flambda+opt+bench/.opam-switch/build/ocaml-variants.4.08.0+trunk+flambda+opt/./configure --help' for more information
Close

Error on ocaml-variants.4.08.0+trunk+flambda+oclassic (4.08.0+trunk+flambda+oclassic+bench)

Command:

~/.opam/4.08.0+trunk+flambda+oclassic+bench/.opam-switch/build/ocaml-variants.4.08.0+trunk+flambda+oclassic/./configure -prefix /home/louis/.opam/4.08.0+trunk+flambda+oclassic+bench -flambda -with-debug-runtime

Output

configure: error: unrecognized option: `-flambda'
Try `/home/louis/.opam/4.08.0+trunk+flambda+oclassic+bench/.opam-switch/build/ocaml-variants.4.08.0+trunk+flambda+oclassic/./configure --help' for more information
Close

Error on ocaml-migrate-parsetree.1.4.0 (4.08.0+trunk+bench)

Command:

~/.opam/4.08.0+trunk+bench/bin/dune build -p ocaml-migrate-parsetree -j 7

Output

       ocaml src/ast-version,src/compiler-functions-file (exit 1)
(cd _build/default/src && /home/louis/.opam/4.08.0+trunk+bench/bin/ocaml config/gen.ml 4.10.0+dev0-2019-04-23)
Unkown OCaml version 4.10.0+dev0-2019-04-23
Close

Error on ocaml-migrate-parsetree.1.4.0 (4.08.0+gpr2165+bench)

Command:

~/.opam/4.08.0+gpr2165+bench/bin/dune build -p ocaml-migrate-parsetree -j 7

Output

       ocaml src/ast-version,src/compiler-functions-file (exit 1)
(cd _build/default/src && /home/louis/.opam/4.08.0+gpr2165+bench/bin/ocaml config/gen.ml 4.10.0+dev0-2019-04-23)
Unkown OCaml version 4.10.0+dev0-2019-04-23
Close

Error on ocaml.4.06.1 (4.06.1+flambda+bench)

Command:

~/.opam/4.06.1+flambda+bench/bin/ocaml /home/louis/.opam/4.06.1+flambda+bench/share/ocaml-config/gen_ocaml_config.ml 4.06.1 ocaml

Output

OCaml version mismatch: 4.06.2, expected 4.06.1
Close

Error on numerical-analysis-bench.1.0 (4.08.0+trunk+bench)

Command:

/usr/bin/make

Output

ulimit -s 98304; ocamlopt.opt  -I simple_access `ocamldep.opt -sort simple_access/*.ml` main_nogcstats.ml -o simple_access.opt
ulimit -s 98304; ocamlopt.opt  -I lu-decomposition `ocamldep.opt -sort lu-decomposition/*.ml` main_nogcstats.ml -o lu-decomposition.opt
ulimit -s 98304; ocamlopt.opt  -I fft `ocamldep.opt -sort fft/*.ml` main_nogcstats.ml -o fft.opt
ulimit -s 98304; ocamlopt.opt  -I rnd_access `ocamldep.opt -sort rnd_access/*.ml` main_nogcstats.ml -o rnd_access.opt
ulimit -s 98304; ocamlopt.opt  -I k-means `ocamldep.opt -sort k-means/*.ml` main_nogcstats.ml -o k-means.opt
Fatal error: exception Stack overflow
Makefile:20: recipe for target 'k-means.opt' failed
make: *** [k-means.opt] Error 2
Close

Error on numerical-analysis-bench.1.0 (4.08.0+gpr2165+bench)

Command:

/usr/bin/make

Output

ulimit -s 98304; ocamlopt.opt  -I simple_access `ocamldep.opt -sort simple_access/*.ml` main_nogcstats.ml -o simple_access.opt
ulimit -s 98304; ocamlopt.opt  -I lu-decomposition `ocamldep.opt -sort lu-decomposition/*.ml` main_nogcstats.ml -o lu-decomposition.opt
ulimit -s 98304; ocamlopt.opt  -I fft `ocamldep.opt -sort fft/*.ml` main_nogcstats.ml -o fft.opt
ulimit -s 98304; ocamlopt.opt  -I rnd_access `ocamldep.opt -sort rnd_access/*.ml` main_nogcstats.ml -o rnd_access.opt
ulimit -s 98304; ocamlopt.opt  -I k-means `ocamldep.opt -sort k-means/*.ml` main_nogcstats.ml -o k-means.opt
Fatal error: exception Stack overflow
Makefile:20: recipe for target 'k-means.opt' failed
make: *** [k-means.opt] Error 2
Close

Error on dune.1.11.3 (4.08.0+mutmatch+bench)

Command:

~/.opam/4.08.0+mutmatch+bench/bin/ocaml bootstrap.ml

Output

/home/louis/.opam/4.08.0+mutmatch+bench/bin/ocamllex.opt -q src/ocamlobjinfo.mll
/home/louis/.opam/4.08.0+mutmatch+bench/bin/ocamllex.opt -q src/meta_lexer.mll
/home/louis/.opam/4.08.0+mutmatch+bench/bin/ocamllex.opt -q src/dune_lexer.mll
/home/louis/.opam/4.08.0+mutmatch+bench/bin/ocamllex.opt -q src/dune_lang/dune_lexer.mll
/home/louis/.opam/4.08.0+mutmatch+bench/bin/ocamldep.opt -modules src/action.mli src/action.ml src/action_ast.ml src/action_dune_lang.mli src/action_dune_lang.ml src/action_exec.mli src/action_exec.ml src/action_intf.ml src/action_mapper.mli src/action_mapper.ml src/action_to_sh.mli src/action_to_sh.boot.ml src/action_unexpanded.mli src/action_unexpanded.ml src/alias.mli src/alias.ml src/artifact_substitution.mli src/artifact_substitution.ml src/artifacts.mli src/artifacts.ml src/binary_kind.mli src/binary_kind.ml src/bindings.mli src/bindings.ml src/blang.mli src/blang.ml src/bootstrap.mli src/bootstrap.boot.ml src/build.mli src/build.ml otherlibs/build-info/src/build_info.mli otherlibs/build-info/src/build_info.ml otherlibs/build-info/src/build_info_data.mli otherlibs/build-info/src/build_info_data.boot.ml src/build_system.mli src/build_system.ml src/c.mli src/c.ml src/c_sources.mli src/c_sources.ml src/cached_digest.mli src/cached_digest.ml src/check_rules.mli src/check_rules.ml src/cinaps.mli src/cinaps.boot.ml src/clflags.mli src/clflags.ml src/cm_files.mli src/cm_files.ml src/cm_kind.mli src/cm_kind.ml src/colors.mli src/colors.ml src/command.mli src/command.ml src/compilation_context.mli src/compilation_context.ml src/config.mli src/config.ml src/context.mli src/context.ml src/coq_module.mli src/coq_module.ml src/coq_rules.mli src/coq_rules.boot.ml src/dep.mli src/dep.ml src/dep_graph.mli src/dep_graph.ml src/dep_path.mli src/dep_path.ml src/dep_rules.mli src/dep_rules.ml src/dialect.mli src/dialect.ml src/diff.mli src/diff.ml src/dir_contents.mli src/dir_contents.ml src/dir_set.mli src/dir_set.ml src/dir_status.mli src/dir_status.ml src/dir_with_dune.mli src/dir_with_dune.ml src/dpath.mli src/dpath.ml src/dune_env.mli src/dune_env.ml src/dune_file.mli src/dune_file.ml src/dune_init.mli src/dune_init.ml src/dune_lexer.mli src/dune_lexer.ml src/dune_load.mli src/dune_load.ml src/dune_package.mli src/dune_package.ml src/dune_project.mli src/dune_project.ml vendor/boot/dune_re.ml src/dynlink_supported.mli src/dynlink_supported.ml src/env_node.mli src/env_node.ml src/exe.mli src/exe.ml src/exe_rules.mli src/exe_rules.ml src/expander.mli src/expander.ml src/file_binding.mli src/file_binding.ml src/file_selector.mli src/file_selector.ml src/file_tree.mli src/file_tree.ml src/findlib.mli src/findlib.ml src/format_dune_lang.mli src/format_dune_lang.ml src/format_rules.mli src/format_rules.ml src/gen_meta.mli src/gen_meta.ml src/gen_rules.mli src/gen_rules.ml src/glob.mli src/glob.ml src/glob_lexer.mli src/glob_lexer.boot.ml src/hooks.mli src/hooks.ml src/import.ml src/inline_tests.mli src/inline_tests.boot.ml src/install.mli src/install.ml src/install_rules.mli src/install_rules.ml src/installed_dune_file.mli src/installed_dune_file.ml src/js_of_ocaml_rules.mli src/js_of_ocaml_rules.boot.ml src/lib.mli src/lib.ml src/lib_archives.mli src/lib_archives.ml src/lib_config.mli src/lib_config.ml src/lib_deps_info.mli src/lib_deps_info.ml src/lib_file_deps.mli src/lib_file_deps.ml src/lib_info.mli src/lib_info.ml src/lib_kind.mli src/lib_kind.ml src/lib_name.mli src/lib_name.ml src/lib_rules.mli src/lib_rules.ml src/link_time_code_gen.mli src/link_time_code_gen.ml src/local_package.mli src/local_package.ml src/main.mli src/main.ml src/menhir.mli src/menhir.boot.ml src/merlin.mli src/merlin.ml src/meta.mli src/meta.ml src/meta_lexer.mli src/meta_lexer.ml src/ml_kind.mli src/ml_kind.ml src/mode.mli src/mode.ml src/module.mli src/module.ml src/module_compilation.mli src/module_compilation.ml src/modules.mli src/modules.ml src/modules_field_evaluator.mli src/modules_field_evaluator.ml src/obj_dir.mli src/obj_dir.ml src/ocaml_flags.mli src/ocaml_flags.ml src/ocaml_version.mli src/ocaml_version.ml src/ocamldep.mli src/ocamldep.ml src/ocamlobjinfo.mli src/ocamlobjinfo.ml src/odoc.mli src/odoc.boot.ml vendor/boot/opamBaseParser.ml vendor/boot/opamLexer.ml vendor/boot/opamParserTypes.ml vendor/boot/opamPrinter.ml src/opam_create.mli src/opam_create.boot.ml src/opam_file.mli src/opam_file.ml src/ordered_set_lang.mli src/ordered_set_lang.ml src/package.mli src/package.ml src/packages.mli src/packages.ml src/per_item.mli src/per_item.ml src/persistent.mli src/persistent.ml src/pform.mli src/pform.ml src/predicate.mli src/predicate.ml src/predicate_lang.mli src/predicate_lang.ml src/preprocessing.mli src/preprocessing.ml src/print_diff.mli src/print_diff.ml src/process.mli src/process.ml src/promotion.mli src/promotion.ml src/report_error.mli src/report_error.ml src/response_file.mli src/response_file.ml src/rule.mli src/rule.ml src/rules.mli src/rules.ml src/scheduler.mli src/scheduler.ml src/scheme.mli src/scheme.ml src/scope.mli src/scope.ml src/setup.mli src/setup.boot.ml src/simple_rules.mli src/simple_rules.ml src/spawn.mli src/spawn.ml src/stanza.mli src/stanza.ml src/static_deps.mli src/static_deps.ml src/stats.mli src/stats.boot.ml src/string_with_vars.mli src/string_with_vars.ml src/sub_dirs.mli src/sub_dirs.ml src/sub_system.mli src/sub_system.ml src/sub_system_info.mli src/sub_system_info.ml src/sub_system_intf.ml src/sub_system_name.mli src/sub_system_name.ml src/super_context.mli src/super_context.ml src/syntax.mli src/syntax.ml src/test_rules.mli src/test_rules.boot.ml src/top_closure.mli src/top_closure.ml src/toplevel.mli src/toplevel.ml src/upgrader.mli src/upgrader.boot.ml src/utils.mli src/utils.ml src/utop.mli src/utop.boot.ml src/value.mli src/value.ml src/variant.mli src/variant.ml src/vcs.mli src/vcs.ml src/versioned_file.mli src/versioned_file.ml src/vimpl.mli src/vimpl.ml src/virtual_rules.mli src/virtual_rules.ml src/visibility.mli src/visibility.ml src/watermarks.mli src/watermarks.ml src/workspace.mli src/workspace.ml src/wrapped.mli src/wrapped.ml > boot-depends.txt
File "src/action_ast.ml", line 48, characters 16-20:
Error: Syntax error: operator expected.
File "src/action_exec.ml", line 199, characters 7-8:
Error: Syntax error
File "src/artifact_substitution.ml", line 434, characters 13-14:
Error: Syntax error
File "src/artifacts.ml", line 67, characters 9-12:
Error: Syntax error
File "src/bindings.ml", line 45, characters 9-10:
Error: Syntax error: operator expected.
File "src/blang.ml", line 86, characters 14-15:
Error: Syntax error: operator expected.
File "src/build.mli", line 219, characters 9-12:
Error: Syntax error: operator expected.
File "src/build.ml", line 456, characters 9-12:
Error: Syntax error: operator expected.
File "src/build_system.ml", line 153, characters 9-10:
Error: Syntax error
File "src/config.ml", line 106, characters 7-14:
Error: Syntax error
File "src/context.ml", line 35, characters 12-13:
Error: Syntax error: operator expected.
File "src/dialect.ml", line 40, characters 9-12:
Error: Syntax error
File "src/diff.ml", line 28, characters 7-12:
Error: Syntax error
File "src/dir_contents.ml", line 265, characters 21-22:
Error: Syntax error: operator expected.
File "src/dpath.ml", line 112, characters 9-10:
Error: Syntax error
File "src/dune_env.ml", line 12, characters 9-10:
Error: Syntax error
File "src/dune_file.ml", line 65, characters 7-8:
Error: Syntax error: operator expected.
File "src/dune_init.ml", line 90, characters 11-12:
Error: Syntax error
File "src/dune_load.ml", line 222, characters 9-10:
Error: Syntax error: operator expected.
File "src/dune_package.ml", line 141, characters 9-10:
Error: Syntax error: operator expected.
File "src/dune_project.ml", line 392, characters 11-12:
Error: Syntax error
File "src/file_binding.ml", line 65, characters 13-20:
Error: Syntax error
File "src/file_tree.ml", line 230, characters 9-10:
Error: Syntax error
File "src/findlib.ml", line 361, characters 9-10:
Error: Syntax error
File "src/format_rules.ml", line 53, characters 11-12:
Error: Syntax error
File "src/gen_rules.ml", line 387, characters 11-18:
Error: Syntax error
File "src/installed_dune_file.ml", line 63, characters 10-11:
Error: Syntax error: operator expected.
File "src/lib.ml", line 375, characters 9-13:
Error: Syntax error
File "src/lib_kind.ml", line 12, characters 9-10:
Error: Syntax error
File "src/link_time_code_gen.ml", line 197, characters 7-15:
Error: Syntax error
File "src/main.ml", line 66, characters 7-15:
Error: Syntax error
File "src/merlin.ml", line 152, characters 9-10:
Error: Syntax error
File "src/mode.ml", line 129, characters 13-17:
Error: Syntax error: operator expected.
File "src/module.ml", line 332, characters 9-13:
Error: Syntax error: operator expected.
File "src/modules.ml", line 46, characters 11-27:
Error: Syntax error: operator expected.
File "src/obj_dir.ml", line 76, characters 11-22:
Error: Syntax error: operator expected.
File "src/ocaml_flags.ml", line 84, characters 9-15:
Error: Syntax error
File "src/ordered_set_lang.ml", line 70, characters 13-22:
Error: Syntax error
File "src/package.ml", line 90, characters 13-14:
Error: Syntax error
File "src/pform.ml", line 238, characters 7-8:
Error: Syntax error
File "src/predicate_lang.ml", line 23, characters 19-20:
Error: Syntax error
File "src/preprocessing.ml", line 149, characters 16-19:
Error: Syntax error: operator expected.
File "src/print_diff.ml", line 43, characters 7-8:
Error: Syntax error
File "src/process.ml", line 413, characters 5-6:
Error: Syntax error
File "src/scheduler.ml", line 557, characters 7-8:
Error: Syntax error
File "src/stanza.ml", line 50, characters 23-24:
Error: Syntax error: operator expected.
File "src/string_with_vars.ml", line 138, characters 7-21:
Error: Syntax error
File "src/sub_dirs.ml", line 120, characters 9-16:
Error: Syntax error
File "src/sub_system.ml", line 40, characters 7-8:
Error: Syntax error
File "src/super_context.ml", line 103, characters 7-8:
Error: Syntax error
File "src/syntax.ml", line 150, characters 9-16:
Error: Syntax error
File "src/vcs.ml", line 51, characters 12-16:
Error: Syntax error: operator expected.
File "src/versioned_file.ml", line 95, characters 7-8:
Error: Syntax error
File "src/watermarks.ml", line 192, characters 13-16:
Error: Syntax error
File "src/workspace.ml", line 60, characters 11-14:
Error: Syntax error
File "src/wrapped.ml", line 14, characters 11-12:
Error: Syntax error
Close

Error on core-micro-bench.1.0 (4.07.1+oclassic+bench)

Command:

/usr/bin/make -C core_micro

Output

make: Entering directory '/home/louis/.opam/4.07.1+oclassic+bench/.opam-switch/build/core-micro-bench.1.0/core_micro'
ocamlbuild -use-ocamlfind runner.native
ocamlfind ocamldep -package str -package core -package core_bench.inline_benchmarks -modules runner.ml > runner.ml.depends
ocamlfind ocamlc -c -thread -package str -package core -package core_bench.inline_benchmarks -o runner.cmo runner.ml
+ ocamlfind ocamlc -c -thread -package str -package core -package core_bench.inline_benchmarks -o runner.cmo runner.ml
File "runner.ml", line 1, characters 5-13:
Error: Unbound module Core.Std
Command exited with code 2.
Makefile:4: recipe for target 'all' failed
make: *** [all] Error 10
make: Leaving directory '/home/louis/.opam/4.07.1+oclassic+bench/.opam-switch/build/core-micro-bench.1.0/core_micro'
Close

Error on core-micro-bench.1.0 (4.07.1+flambda+bench)

Command:

/usr/bin/make -C core_micro

Output

make: Entering directory '/home/louis/.opam/4.07.1+flambda+bench/.opam-switch/build/core-micro-bench.1.0/core_micro'
ocamlbuild -use-ocamlfind runner.native
ocamlfind ocamldep -package str -package core -package core_bench.inline_benchmarks -modules runner.ml > runner.ml.depends
ocamlfind ocamlc -c -thread -package str -package core -package core_bench.inline_benchmarks -o runner.cmo runner.ml
+ ocamlfind ocamlc -c -thread -package str -package core -package core_bench.inline_benchmarks -o runner.cmo runner.ml
File "runner.ml", line 1, characters 5-13:
Error: Unbound module Core.Std
Command exited with code 2.
Makefile:4: recipe for target 'all' failed
make: *** [all] Error 10
make: Leaving directory '/home/louis/.opam/4.07.1+flambda+bench/.opam-switch/build/core-micro-bench.1.0/core_micro'
Close

Error on core-micro-bench.1.0 (4.07.1+clambda+bench)

Command:

/usr/bin/make -C core_micro

Output

make: Entering directory '/home/louis/.opam/4.07.1+clambda+bench/.opam-switch/build/core-micro-bench.1.0/core_micro'
ocamlbuild -use-ocamlfind runner.native
ocamlfind ocamldep -package str -package core -package core_bench.inline_benchmarks -modules runner.ml > runner.ml.depends
ocamlfind ocamlc -c -thread -package str -package core -package core_bench.inline_benchmarks -o runner.cmo runner.ml
+ ocamlfind ocamlc -c -thread -package str -package core -package core_bench.inline_benchmarks -o runner.cmo runner.ml
File "runner.ml", line 1, characters 5-13:
Error: Unbound module Core.Std
Command exited with code 2.
Makefile:4: recipe for target 'all' failed
make: *** [all] Error 10
make: Leaving directory '/home/louis/.opam/4.07.1+clambda+bench/.opam-switch/build/core-micro-bench.1.0/core_micro'
Close

Error on core-micro-bench.1.0 (4.03.1+bench)

Command:

/usr/bin/make -C core_micro

Output

make: Entering directory '/home/louis/.opam/4.03.1+bench/.opam-switch/build/core-micro-bench.1.0/core_micro'
ocamlbuild -use-ocamlfind runner.native
ocamlfind ocamldep -package str -package core -package core_bench.inline_benchmarks -modules runner.ml > runner.ml.depends
ocamlfind ocamlc -c -thread -package str -package core -package core_bench.inline_benchmarks -o runner.cmo runner.ml
+ ocamlfind ocamlc -c -thread -package str -package core -package core_bench.inline_benchmarks -o runner.cmo runner.ml
File "runner.ml", line 1, characters 5-13:
Warning 3: deprecated: module Core.Std
[since 2017-02] Use Core. The Std sub-module is no longer needed
File "runner.ml", line 3, characters 15-55:
Error: Unbound module Pa_bench_lib
Command exited with code 2.
Makefile:4: recipe for target 'all' failed
make: *** [all] Error 10
make: Leaving directory '/home/louis/.opam/4.03.1+bench/.opam-switch/build/core-micro-bench.1.0/core_micro'
Close

Error on conf-graphviz.0.1 (4.07.1+oclassic+bench)

Command:

/usr/bin/which dot

Output


Close

Error on conf-graphviz.0.1 (4.07.1+flambda+bench)

Command:

/usr/bin/which dot

Output


Close

Error on conf-graphviz.0.1 (4.07.1+clambda+bench)

Command:

/usr/bin/which dot

Output


Close

Error on conf-graphviz.0.1 (4.06.1+flambda+bench)

Command:

/usr/bin/which dot

Output


Close

Error on conf-graphviz.0.1 (4.03.1+bench)

Command:

/usr/bin/which dot

Output


Close

Error on cohttp-bench.1.0 (4.07.1+oclassic+bench)

Command:

/usr/bin/make -C cohttp

Output

make: Entering directory '/home/louis/.opam/4.07.1+oclassic+bench/.opam-switch/build/cohttp-bench.1.0/cohttp'
ocamlbuild -use-ocamlfind cohttp_lwt_bench.native cohttp_async_bench.native
ocamlfind ocamldep -package lwt.unix -package cohttp.lwt -modules cohttp_lwt_bench.ml > cohttp_lwt_bench.ml.depends
+ ocamlfind ocamldep -package lwt.unix -package cohttp.lwt -modules cohttp_lwt_bench.ml > cohttp_lwt_bench.ml.depends
ocamlfind: Package `cohttp.lwt' not found
Command exited with code 2.
Makefile:6: recipe for target 'all' failed
make: *** [all] Error 10
make: Leaving directory '/home/louis/.opam/4.07.1+oclassic+bench/.opam-switch/build/cohttp-bench.1.0/cohttp'
Close

Error on cohttp-bench.1.0 (4.07.1+flambda+bench)

Command:

/usr/bin/make -C cohttp

Output

make: Entering directory '/home/louis/.opam/4.07.1+flambda+bench/.opam-switch/build/cohttp-bench.1.0/cohttp'
ocamlbuild -use-ocamlfind cohttp_lwt_bench.native cohttp_async_bench.native
ocamlfind ocamldep -package lwt.unix -package cohttp.lwt -modules cohttp_lwt_bench.ml > cohttp_lwt_bench.ml.depends
+ ocamlfind ocamldep -package lwt.unix -package cohttp.lwt -modules cohttp_lwt_bench.ml > cohttp_lwt_bench.ml.depends
ocamlfind: Package `cohttp.lwt' not found
Command exited with code 2.
Makefile:6: recipe for target 'all' failed
make: *** [all] Error 10
make: Leaving directory '/home/louis/.opam/4.07.1+flambda+bench/.opam-switch/build/cohttp-bench.1.0/cohttp'
Close

Error on cohttp-bench.1.0 (4.07.1+clambda+bench)

Command:

/usr/bin/make -C cohttp

Output

make: Entering directory '/home/louis/.opam/4.07.1+clambda+bench/.opam-switch/build/cohttp-bench.1.0/cohttp'
ocamlbuild -use-ocamlfind cohttp_lwt_bench.native cohttp_async_bench.native
ocamlfind ocamldep -package lwt.unix -package cohttp.lwt -modules cohttp_lwt_bench.ml > cohttp_lwt_bench.ml.depends
+ ocamlfind ocamldep -package lwt.unix -package cohttp.lwt -modules cohttp_lwt_bench.ml > cohttp_lwt_bench.ml.depends
ocamlfind: Package `cohttp.lwt' not found
Command exited with code 2.
Makefile:6: recipe for target 'all' failed
make: *** [all] Error 10
make: Leaving directory '/home/louis/.opam/4.07.1+clambda+bench/.opam-switch/build/cohttp-bench.1.0/cohttp'
Close

Error on cohttp-bench.1.0 (4.03.1+bench)

Command:

/usr/bin/make -C cohttp

Output

make: Entering directory '/home/louis/.opam/4.03.1+bench/.opam-switch/build/cohttp-bench.1.0/cohttp'
ocamlbuild -use-ocamlfind cohttp_lwt_bench.native cohttp_async_bench.native
ocamlfind ocamldep -package lwt.unix -package cohttp.lwt -modules cohttp_lwt_bench.ml > cohttp_lwt_bench.ml.depends
+ ocamlfind ocamldep -package lwt.unix -package cohttp.lwt -modules cohttp_lwt_bench.ml > cohttp_lwt_bench.ml.depends
ocamlfind: Package `cohttp-lwt-unix' not found - required by `cohttp.lwt'
Command exited with code 2.
Makefile:6: recipe for target 'all' failed
make: *** [all] Error 10
make: Leaving directory '/home/louis/.opam/4.03.1+bench/.opam-switch/build/cohttp-bench.1.0/cohttp'
Close

Error on chameneos-bench.1.0 (4.07.1+oclassic+bench)

Command:

/usr/bin/make -C chameneos-redux

Output

make: Entering directory '/home/louis/.opam/4.07.1+oclassic+bench/.opam-switch/build/chameneos-bench.1.0/chameneos-redux'
ocamlopt -bin-annot -thread unix.cmxa threads.cmxa chameneos_redux_th.ml -o chameneos_redux_th
ocamlopt -bin-annot -thread unix.cmxa threads.cmxa chameneos_redux_evtchn.ml -o chameneos_redux_evtchn
ocamlfind ocamlopt -bin-annot -package lwt.unix -linkpkg chameneos_redux_lwt.ml -o chameneos_redux_lwt
ocamlfind: [WARNING] Package `threads': Linking problems may arise because of the missing -thread or -vmthread switch
ocamlfind ocamlopt -bin-annot  -thread -package async -linkpkg chameneos_redux_async.ml -o chameneos_redux_async
File "chameneos_redux_async.ml", line 7, characters 5-13:
Error: Unbound module Core.Std
Makefile:9: recipe for target 'chameneos_redux_async' failed
make: *** [chameneos_redux_async] Error 2
make: Leaving directory '/home/louis/.opam/4.07.1+oclassic+bench/.opam-switch/build/chameneos-bench.1.0/chameneos-redux'
Close

Error on chameneos-bench.1.0 (4.07.1+flambda+bench)

Command:

/usr/bin/make -C chameneos-redux

Output

make: Entering directory '/home/louis/.opam/4.07.1+flambda+bench/.opam-switch/build/chameneos-bench.1.0/chameneos-redux'
ocamlopt -bin-annot -thread unix.cmxa threads.cmxa chameneos_redux_th.ml -o chameneos_redux_th
ocamlopt -bin-annot -thread unix.cmxa threads.cmxa chameneos_redux_evtchn.ml -o chameneos_redux_evtchn
ocamlfind ocamlopt -bin-annot -package lwt.unix -linkpkg chameneos_redux_lwt.ml -o chameneos_redux_lwt
ocamlfind: [WARNING] Package `threads': Linking problems may arise because of the missing -thread or -vmthread switch
ocamlfind ocamlopt -bin-annot  -thread -package async -linkpkg chameneos_redux_async.ml -o chameneos_redux_async
File "chameneos_redux_async.ml", line 7, characters 5-13:
Error: Unbound module Core.Std
Makefile:9: recipe for target 'chameneos_redux_async' failed
make: *** [chameneos_redux_async] Error 2
make: Leaving directory '/home/louis/.opam/4.07.1+flambda+bench/.opam-switch/build/chameneos-bench.1.0/chameneos-redux'
Close

Error on chameneos-bench.1.0 (4.07.1+clambda+bench)

Command:

/usr/bin/make -C chameneos-redux

Output

make: Entering directory '/home/louis/.opam/4.07.1+clambda+bench/.opam-switch/build/chameneos-bench.1.0/chameneos-redux'
ocamlopt -bin-annot -thread unix.cmxa threads.cmxa chameneos_redux_th.ml -o chameneos_redux_th
ocamlopt -bin-annot -thread unix.cmxa threads.cmxa chameneos_redux_evtchn.ml -o chameneos_redux_evtchn
ocamlfind ocamlopt -bin-annot -package lwt.unix -linkpkg chameneos_redux_lwt.ml -o chameneos_redux_lwt
ocamlfind: [WARNING] Package `threads': Linking problems may arise because of the missing -thread or -vmthread switch
ocamlfind ocamlopt -bin-annot  -thread -package async -linkpkg chameneos_redux_async.ml -o chameneos_redux_async
File "chameneos_redux_async.ml", line 7, characters 5-13:
Error: Unbound module Core.Std
Makefile:9: recipe for target 'chameneos_redux_async' failed
make: *** [chameneos_redux_async] Error 2
make: Leaving directory '/home/louis/.opam/4.07.1+clambda+bench/.opam-switch/build/chameneos-bench.1.0/chameneos-redux'
Close

Error on chameneos-bench.1.0 (4.03.1+bench)

Command:

/usr/bin/make -C chameneos-redux

Output

make: Entering directory '/home/louis/.opam/4.03.1+bench/.opam-switch/build/chameneos-bench.1.0/chameneos-redux'
ocamlopt -bin-annot -thread unix.cmxa threads.cmxa chameneos_redux_th.ml -o chameneos_redux_th
ocamlopt -bin-annot -thread unix.cmxa threads.cmxa chameneos_redux_evtchn.ml -o chameneos_redux_evtchn
ocamlfind ocamlopt -bin-annot -package lwt.unix -linkpkg chameneos_redux_lwt.ml -o chameneos_redux_lwt
ocamlfind: [WARNING] Package `threads': Linking problems may arise because of the missing -thread or -vmthread switch
ocamlfind ocamlopt -bin-annot  -thread -package async -linkpkg chameneos_redux_async.ml -o chameneos_redux_async
File "chameneos_redux_async.ml", line 7, characters 5-13:
Warning 3: deprecated: module Core.Std
[since 2017-02] Use Core. The Std sub-module is no longer needed
File "chameneos_redux_async.ml", line 8, characters 5-14:
Warning 3: deprecated: module Async.Std
[since 2017-02] use Async. The Std sub-module is no longer needed
File "chameneos_redux_async.ml", line 128, characters 10-16:
Error: This expression has type
         [> `Probably_should_not_use_blocking_Core_Printf_functions_with_Async ]
       This is not a function; it cannot be applied.
Makefile:9: recipe for target 'chameneos_redux_async' failed
make: *** [chameneos_redux_async] Error 2
make: Leaving directory '/home/louis/.opam/4.03.1+bench/.opam-switch/build/chameneos-bench.1.0/chameneos-redux'
Close

Error on camlimages.5.0.1 (4.08.0+trunk+bench)

Command:

~/.opam/4.08.0+trunk+bench/bin/jbuilder build -p camlimages -j 7

Output

The jbuilder binary is deprecated and will cease to be maintained in July 2019.
Please switch to dune instead.
File "jbuild", line 1, characters 0-0:
Warning: jbuild files are deprecated, please convert this file to a dune file
instead.
Note: You can use "dune upgrade" to convert your project to dune.
File "config/jbuild", line 1, characters 0-0:
Warning: jbuild files are deprecated, please convert this file to a dune file
instead.
Note: You can use "dune upgrade" to convert your project to dune.
File "core/jbuild", line 1, characters 0-0:
Warning: jbuild files are deprecated, please convert this file to a dune file
instead.
Note: You can use "dune upgrade" to convert your project to dune.
File "examples/converter/jbuild", line 1, characters 0-0:
Warning: jbuild files are deprecated, please convert this file to a dune file
instead.
Note: You can use "dune upgrade" to convert your project to dune.
File "examples/crop/jbuild", line 1, characters 0-0:
Warning: jbuild files are deprecated, please convert this file to a dune file
instead.
Note: You can use "dune upgrade" to convert your project to dune.
File "examples/edgedetect/jbuild", line 1, characters 0-0:
Warning: jbuild files are deprecated, please convert this file to a dune file
instead.
Note: You can use "dune upgrade" to convert your project to dune.
File "examples/gifanim/jbuild", line 1, characters 0-0:
Warning: jbuild files are deprecated, please convert this file to a dune file
instead.
Note: You can use "dune upgrade" to convert your project to dune.
File "examples/imgstat/jbuild", line 1, characters 0-0:
Warning: jbuild files are deprecated, please convert this file to a dune file
instead.
Note: You can use "dune upgrade" to convert your project to dune.
File "examples/liv/jbuild", line 1, characters 0-0:
Warning: jbuild files are deprecated, please convert this file to a dune file
instead.
Note: You can use "dune upgrade" to convert your project to dune.
File "examples/monochrome/jbuild", line 1, characters 0-0:
Warning: jbuild files are deprecated, please convert this file to a dune file
instead.
Note: You can use "dune upgrade" to convert your project to dune.
File "examples/normalize/jbuild", line 1, characters 0-0:
Warning: jbuild files are deprecated, please convert this file to a dune file
instead.
Note: You can use "dune upgrade" to convert your project to dune.
File "examples/resize/jbuild", line 1, characters 0-0:
Warning: jbuild files are deprecated, please convert this file to a dune file
instead.
Note: You can use "dune upgrade" to convert your project to dune.
File "examples/tiffps/jbuild", line 1, characters 0-0:
Warning: jbuild files are deprecated, please convert this file to a dune file
instead.
Note: You can use "dune upgrade" to convert your project to dune.
File "examples/ttfimg/jbuild", line 1, characters 0-0:
Warning: jbuild files are deprecated, please convert this file to a dune file
instead.
Note: You can use "dune upgrade" to convert your project to dune.
File "exif/jbuild", line 1, characters 0-0:
Warning: jbuild files are deprecated, please convert this file to a dune file
instead.
Note: You can use "dune upgrade" to convert your project to dune.
File "freetype/jbuild", line 1, characters 0-0:
Warning: jbuild files are deprecated, please convert this file to a dune file
instead.
Note: You can use "dune upgrade" to convert your project to dune.
File "gif/jbuild", line 1, characters 0-0:
Warning: jbuild files are deprecated, please convert this file to a dune file
instead.
Note: You can use "dune upgrade" to convert your project to dune.
File "graphics/jbuild", line 1, characters 0-0:
Warning: jbuild files are deprecated, please convert this file to a dune file
instead.
Note: You can use "dune upgrade" to convert your project to dune.
File "include/jbuild", line 1, characters 0-0:
Warning: jbuild files are deprecated, please convert this file to a dune file
instead.
Note: You can use "dune upgrade" to convert your project to dune.
File "jpeg/jbuild", line 1, characters 0-0:
Warning: jbuild files are deprecated, please convert this file to a dune file
instead.
Note: You can use "dune upgrade" to convert your project to dune.
File "lablgtk2/jbuild", line 1, characters 0-0:
Warning: jbuild files are deprecated, please convert this file to a dune file
instead.
Note: You can use "dune upgrade" to convert your project to dune.
File "png/jbuild", line 1, characters 0-0:
Warning: jbuild files are deprecated, please convert this file to a dune file
instead.
Note: You can use "dune upgrade" to convert your project to dune.
File "test/jbuild", line 1, characters 0-0:
Warning: jbuild files are deprecated, please convert this file to a dune file
instead.
Note: You can use "dune upgrade" to convert your project to dune.
File "tiff/jbuild", line 1, characters 0-0:
Warning: jbuild files are deprecated, please convert this file to a dune file
instead.
Note: You can use "dune upgrade" to convert your project to dune.
File "xpm/jbuild", line 1, characters 0-0:
Warning: jbuild files are deprecated, please convert this file to a dune file
instead.
Note: You can use "dune upgrade" to convert your project to dune.
       ocaml (internal)
ocamlfind: Package `graphics' not found
    ocamlopt config/.ciconfig.eobjs/native/xConfigurator.{cmx,o}
File "config/xConfigurator.ml", line 23, characters 16-25:
23 |     | exception Not_found -> []
                     ^^^^^^^^^
Alert deprecated: Not_found
[2016-09] this element comes from the stdlib distributed with OCaml.
Instead of raising [Not_found], consider using [raise_s] with an informative error
message.  If code needs to distinguish [Not_found] from other exceptions, please change
it to handle both [Not_found] and [Not_found_s].  Then, instead of raising [Not_found],
raise [Not_found_s] with an informative error message.
    ocamlopt config/ciconfig.exe (exit 2)
(cd _build/default && /home/louis/.opam/4.08.0+trunk+bench/bin/ocamlopt.opt -w -40 -w -6 -g -o config/ciconfig.exe -I /home/louis/.opam/4.08.0+trunk+bench/lib/base -I /home/louis/.opam/4.08.0+trunk+bench/lib/base/caml -I /home/louis/.opam/4.08.0+trunk+bench/lib/base/shadow_stdlib -I /home/louis/.opam/4.08.0+trunk+bench/lib/configurator -I /home/louis/.opam/4.08.0+trunk+bench/lib/findlib -I /home/louis/.opam/4.08.0+trunk+bench/lib/sexplib0 -I /home/louis/.opam/4.08.0+trunk+bench/lib/stdio /home/louis/.opam/4.08.0+trunk+bench/lib/base/caml/caml.cmxa /home/louis/.opam/4.08.0+trunk+bench/lib/sexplib0/sexplib0.cmxa /home/louis/.opam/4.08.0+trunk+bench/lib/base/shadow_stdlib/shadow_stdlib.cmxa /home/louis/.opam/4.08.0+trunk+bench/lib/base/base.cmxa /home/louis/.opam/4.08.0+trunk+bench/lib/stdio/stdio.cmxa /home/louis/.opam/4.08.0+trunk+bench/lib/ocaml/unix.cmxa /home/louis/.opam/4.08.0+trunk+bench/lib/configurator/configurator.cmxa /home/louis/.opam/4.08.0+trunk+bench/lib/findlib/findlib.cmxa config/.ciconfig.eobjs/native/xConfigurator.cmx config/.ciconfig.eobjs/native/ciconfig.cmx)
/home/louis/.opam/4.08.0+trunk+bench/lib/base/libbase_stubs.a(exn_stubs.o): In function `Base_clear_caml_backtrace_pos':
/home/louis/.opam/4.08.0+trunk+bench/.opam-switch/build/base.v0.12.2/_build/default/src/exn_stubs.c:6: undefined reference to `caml_backtrace_pos'
collect2: error: ld returned 1 exit status
File "caml_startup", line 1:
Error: Error during linking
Close

Error on async-rpc-bench.1.0 (4.07.1+oclassic+bench)

Command:

/usr/bin/make -C async_rpc

Output

make: Entering directory '/home/louis/.opam/4.07.1+oclassic+bench/.opam-switch/build/async-rpc-bench.1.0/async_rpc'
ocamlfind ocamlopt -thread -syntax camlp4o -package async -package bin_prot.syntax -package core -c rpc_common.ml
ocamlfind: Package `bin_prot.syntax' not found
Makefile:12: recipe for target 'rpc_common.cmx' failed
make: *** [rpc_common.cmx] Error 2
make: Leaving directory '/home/louis/.opam/4.07.1+oclassic+bench/.opam-switch/build/async-rpc-bench.1.0/async_rpc'
Close

Error on async-rpc-bench.1.0 (4.07.1+flambda+bench)

Command:

/usr/bin/make -C async_rpc

Output

make: Entering directory '/home/louis/.opam/4.07.1+flambda+bench/.opam-switch/build/async-rpc-bench.1.0/async_rpc'
ocamlfind ocamlopt -thread -syntax camlp4o -package async -package bin_prot.syntax -package core -c rpc_common.ml
ocamlfind: Package `bin_prot.syntax' not found
Makefile:12: recipe for target 'rpc_common.cmx' failed
make: *** [rpc_common.cmx] Error 2
make: Leaving directory '/home/louis/.opam/4.07.1+flambda+bench/.opam-switch/build/async-rpc-bench.1.0/async_rpc'
Close

Error on async-rpc-bench.1.0 (4.07.1+clambda+bench)

Command:

/usr/bin/make -C async_rpc

Output

make: Entering directory '/home/louis/.opam/4.07.1+clambda+bench/.opam-switch/build/async-rpc-bench.1.0/async_rpc'
ocamlfind ocamlopt -thread -syntax camlp4o -package async -package bin_prot.syntax -package core -c rpc_common.ml
ocamlfind: Package `bin_prot.syntax' not found
Makefile:12: recipe for target 'rpc_common.cmx' failed
make: *** [rpc_common.cmx] Error 2
make: Leaving directory '/home/louis/.opam/4.07.1+clambda+bench/.opam-switch/build/async-rpc-bench.1.0/async_rpc'
Close

Error on async-rpc-bench.1.0 (4.03.1+bench)

Command:

/usr/bin/make -C async_rpc

Output

make: Entering directory '/home/louis/.opam/4.03.1+bench/.opam-switch/build/async-rpc-bench.1.0/async_rpc'
ocamlfind ocamlopt -thread -syntax camlp4o -package async -package bin_prot.syntax -package core -c rpc_common.ml
ocamlfind: Package `bin_prot.syntax' not found
Makefile:12: recipe for target 'rpc_common.cmx' failed
make: *** [rpc_common.cmx] Error 2
make: Leaving directory '/home/louis/.opam/4.03.1+bench/.opam-switch/build/async-rpc-bench.1.0/async_rpc'
Close

Error on async-echo-bench.1.0 (4.07.1+oclassic+bench)

Command:

/usr/bin/make -C async_echo

Output

make: Entering directory '/home/louis/.opam/4.07.1+oclassic+bench/.opam-switch/build/async-echo-bench.1.0/async_echo'
ocamlfind ocamlopt -thread -syntax camlp4o -package async -package bin_prot.syntax -package core -c echo_common.ml
ocamlfind: Package `bin_prot.syntax' not found
Makefile:20: recipe for target 'echo_common.cmx' failed
make: *** [echo_common.cmx] Error 2
make: Leaving directory '/home/louis/.opam/4.07.1+oclassic+bench/.opam-switch/build/async-echo-bench.1.0/async_echo'
Close

Error on async-echo-bench.1.0 (4.07.1+flambda+bench)

Command:

/usr/bin/make -C async_echo

Output

make: Entering directory '/home/louis/.opam/4.07.1+flambda+bench/.opam-switch/build/async-echo-bench.1.0/async_echo'
ocamlfind ocamlopt -thread -syntax camlp4o -package async -package bin_prot.syntax -package core -c echo_common.ml
ocamlfind: Package `bin_prot.syntax' not found
Makefile:20: recipe for target 'echo_common.cmx' failed
make: *** [echo_common.cmx] Error 2
make: Leaving directory '/home/louis/.opam/4.07.1+flambda+bench/.opam-switch/build/async-echo-bench.1.0/async_echo'
Close

Error on async-echo-bench.1.0 (4.07.1+clambda+bench)

Command:

/usr/bin/make -C async_echo

Output

make: Entering directory '/home/louis/.opam/4.07.1+clambda+bench/.opam-switch/build/async-echo-bench.1.0/async_echo'
ocamlfind ocamlopt -thread -syntax camlp4o -package async -package bin_prot.syntax -package core -c echo_common.ml
ocamlfind: Package `bin_prot.syntax' not found
Makefile:20: recipe for target 'echo_common.cmx' failed
make: *** [echo_common.cmx] Error 2
make: Leaving directory '/home/louis/.opam/4.07.1+clambda+bench/.opam-switch/build/async-echo-bench.1.0/async_echo'
Close

Error on async-echo-bench.1.0 (4.03.1+bench)

Command:

/usr/bin/make -C async_echo

Output

make: Entering directory '/home/louis/.opam/4.03.1+bench/.opam-switch/build/async-echo-bench.1.0/async_echo'
ocamlfind ocamlopt -thread -syntax camlp4o -package async -package bin_prot.syntax -package core -c echo_common.ml
ocamlfind: Package `bin_prot.syntax' not found
Makefile:20: recipe for target 'echo_common.cmx' failed
make: *** [echo_common.cmx] Error 2
make: Leaving directory '/home/louis/.opam/4.03.1+bench/.opam-switch/build/async-echo-bench.1.0/async_echo'