Package4.03.1+bench4.05.0+flambda+opt+bench4.06.1+flambda+bench4.06.1+flambda+opt+bench4.07.1+clambda+bench4.07.1+flambda+bench4.07.1+oclassic+bench4.08.0+gpr2165+bench4.08.0+mutmatch+bench4.08.0+trunk+bench4.08.0+trunk+flambda+bench4.08.0+trunk+flambda+oclassic+bench4.08.0+trunk+flambda+opt+bench4.03.1+bench time (s)4.05.0+flambda+opt+bench time (s)4.06.1+flambda+bench time (s)4.06.1+flambda+opt+bench time (s)4.07.1+clambda+bench time (s)4.07.1+flambda+bench time (s)4.07.1+oclassic+bench time (s)4.08.0+gpr2165+bench time (s)4.08.0+mutmatch+bench time (s)4.08.0+trunk+bench time (s)4.08.0+trunk+flambda+bench time (s)4.08.0+trunk+flambda+oclassic+bench time (s)4.08.0+trunk+flambda+opt+bench time (s)
almabench-bench.1.0--AbortedAborted------AbortedAbortedAborted--0.0000.000------0.0000.0000.000
alt-ergo.2.3.0--AbortedAborted------AbortedAbortedAborted--0.0000.000------0.0000.0000.000
alt-ergo-lib.2.3.0--AbortedAborted------AbortedAbortedAborted--0.0000.000------0.0000.0000.000
alt-ergo-parsers.2.3.0--AbortedAborted------AbortedAbortedAborted--0.0000.000------0.0000.0000.000
async.v0.11.0--AbortedAborted-----------0.0000.000---------
async.v0.12.0----OKOKOKAborted-AbortedAbortedAbortedAborted----2.3923.5572.5840.000-0.0000.0000.0000.000
async.v0.9.0OK------------0.908------------
async-echo-bench.1.0Failure (2)-AbortedAbortedFailure (2)Failure (2)Failure (2)Aborted-AbortedAbortedAbortedAborted0.628-0.0000.0000.6210.5561.8340.000-0.0000.0000.0000.000
async-rpc-bench.1.0Failure (2)-AbortedAbortedFailure (2)Failure (2)Failure (2)Aborted-AbortedAbortedAbortedAborted0.552-0.0000.0000.5460.4781.7600.000-0.0000.0000.0000.000
async_extra.v0.11.1--AbortedAborted-----------0.0000.000---------
async_extra.v0.12.0----OKOKOKAborted-AbortedAbortedAbortedAborted----3.8775.4924.1810.000-0.0000.0000.0000.000
async_extra.v0.9.0OK------------7.950------------
async_kernel.v0.11.1--AbortedAborted-----------0.0000.000---------
async_kernel.v0.12.0----OKOKOKAborted-AbortedAbortedAbortedAborted----18.10519.56718.0740.000-0.0000.0000.0000.000
async_kernel.v0.9.0OK------------12.501------------
async_rpc_kernel.v0.11.0--AbortedAborted-----------0.0000.000---------
async_rpc_kernel.v0.12.0----OKOKOKAborted-AbortedAbortedAbortedAborted----9.5068.09410.4780.000-0.0000.0000.0000.000
async_rpc_kernel.v0.9.0OK------------8.765------------
async_unix.v0.11.0--AbortedAborted-----------0.0000.000---------
async_unix.v0.12.0----OKOKOKAborted-AbortedAbortedAbortedAborted----17.02017.74418.5080.000-0.0000.0000.0000.000
async_unix.v0.9.0OK------------12.529------------
base.v0.11.1--AbortedAborted-----------0.0000.000---------
base.v0.12.2----------AbortedAbortedAborted----------0.0000.0000.000
base.v0.9.3OK------------7.084------------
base-bytes.base--AbortedAborted------AbortedAbortedAborted--0.0000.000------0.0000.0000.000
base64.2.2.0OK------------0.256------------
base64.3.2.0--AbortedAborted------AbortedAbortedAborted--0.0000.000------0.0000.0000.000
base_bigstring.v0.12.0----OKOKOKAborted-AbortedAbortedAbortedAborted----2.2673.2172.8430.000-0.0000.0000.0000.000
base_quickcheck.v0.12.1----OKOKOKAborted-AbortedAbortedAbortedAborted----5.7137.3366.5370.000-0.0000.0000.0000.000
bdd-bench.1.0--AbortedAborted------AbortedAbortedAborted--0.0000.000------0.0000.0000.000
bin_prot.v0.11.0--AbortedAborted-----------0.0000.000---------
bin_prot.v0.12.0-------Aborted-AbortedAbortedAbortedAborted-------0.000-0.0000.0000.0000.000
bin_prot.v0.9.1OK------------7.606------------
biniou.1.2.0OK------------9.084------------
biniou.1.2.1--AbortedAborted------AbortedAbortedAborted--0.0000.000------0.0000.0000.000
camlimages.5.0.1--AbortedAbortedOKOKOKOK-Failure (1)AbortedAbortedAborted--0.0000.0002.8623.3353.1103.123-1.6890.0000.0000.000
camlpdf.2.3--AbortedAborted------AbortedAbortedAborted--0.0000.000------0.0000.0000.000
camlzip.1.09--AbortedAborted------AbortedAbortedAborted--0.0000.000------0.0000.0000.000
chameneos-bench.1.0Failure (2)-AbortedAbortedFailure (2)Failure (2)Failure (2)Aborted-AbortedAbortedAbortedAborted0.820-0.0000.0000.6900.7821.6910.000-0.0000.0000.0000.000
cohttp.1.1.0OK------------3.651------------
cohttp.2.3.0--AbortedAborted---Aborted-AbortedAbortedAbortedAborted--0.0000.000---0.000-0.0000.0000.0000.000
cohttp-bench.1.0Failure (2)-AbortedAbortedFailure (2)Failure (2)Failure (2)Aborted-AbortedAbortedAbortedAborted0.351-0.0000.0000.3410.2761.5840.000-0.0000.0000.0000.000
conf-graphviz.0.1Failure (1)-Failure (1)Failure (1)Failure (1)Failure (1)Failure (1)------0.272-0.0410.0440.3850.3930.390------
configurator.v0.11.0--AbortedAbortedOKOKOKOK-OKAbortedAbortedAborted--0.0000.0000.3660.7320.5470.442-0.4890.0000.0000.000
configurator.v0.9.1OK------------16.976------------
core.v0.11.3--AbortedAborted-----------0.0000.000---------
core.v0.12.4----OKOKOKAborted-AbortedAbortedAbortedAborted----28.91338.90430.8810.000-0.0000.0000.0000.000
core.v0.9.1OK------------27.914------------
core-micro-bench.1.0Failure (2)-AbortedAbortedFailure (2)Failure (2)Failure (2)Aborted-AbortedAbortedAbortedAborted1.221-0.0000.0004.8150.2344.8550.000-0.0000.0000.0000.000
core-sequence-bench.1.0OK-AbortedAbortedOKOKOKAborted-AbortedAbortedAbortedAborted0.068-0.0000.0000.0570.0590.0650.000-0.0000.0000.0000.000
core_bench.v0.11.0--AbortedAborted-----------0.0000.000---------
core_bench.v0.12.0----OKOKOKAborted-AbortedAbortedAbortedAborted----4.0077.0645.4170.000-0.0000.0000.0000.000
core_bench.v0.9.0OK------------4.135------------
core_extended.v0.11.0--AbortedAborted-----------0.0000.000---------
core_extended.v0.12.0----OKOKOKAborted-AbortedAbortedAbortedAborted----5.7325.2675.6230.000-0.0000.0000.0000.000
core_extended.v0.9.0OK------------22.254------------
core_kernel.v0.11.1--AbortedAborted-----------0.0000.000---------
core_kernel.v0.12.3----OKOKOKAborted-AbortedAbortedAbortedAborted----57.40956.04561.9050.000-0.0000.0000.0000.000
core_kernel.v0.9.0OK------------31.270------------
cpdf.2.3--AbortedAborted------AbortedAbortedAborted--0.0000.000------0.0000.0000.000
cpdf-bench.1.0--AbortedAborted------AbortedAbortedAborted--0.0000.000------0.0000.0000.000
cppo.1.6.5OK------------0.846------------
cppo.1.6.6--AbortedAborted------AbortedAbortedAborted--0.0000.000------0.0000.0000.000
dune.1.11.4--AbortedAborted------AbortedAbortedAborted--0.0000.000------0.0000.0000.000
dune-configurator.1.0.0--AbortedAborted------AbortedAbortedAborted--0.0000.000------0.0000.0000.000
easy-format.1.3.1OK------------0.275------------
easy-format.1.3.2--AbortedAborted------AbortedAbortedAborted--0.0000.000------0.0000.0000.000
expect_test_helpers.v0.11.0--AbortedAborted-----------0.0000.000---------
expect_test_helpers.v0.12.0----OKOKOKAborted-AbortedAbortedAbortedAborted----2.1092.5353.0050.000-0.0000.0000.0000.000
expect_test_helpers_kernel.v0.11.0--AbortedAborted-----------0.0000.000---------
expect_test_helpers_kernel.v0.12.0----OKOKOKAborted-AbortedAbortedAbortedAborted----8.9249.7258.1550.000-0.0000.0000.0000.000
fieldslib.v0.11.0--AbortedAborted-----------0.0000.000---------
fieldslib.v0.12.0----------AbortedAbortedAborted----------0.0000.0000.000
fieldslib.v0.9.0OK------------1.481------------
frama-c.19.1OK-AbortedAbortedOKOKOK------82.001-0.0000.000109.117145.772119.761------
frama-c-bench.1.0OK-AbortedAbortedOKOKOK------0.460-0.0000.0000.6570.4170.401------
jane-street-headers.v0.11.0--AbortedAborted-----------0.0000.000---------
jane-street-headers.v0.12.0----------AbortedAbortedAborted----------0.0000.0000.000
jane-street-headers.v0.9.0OK------------0.344------------
jbuilder.transition--AbortedAborted------AbortedAbortedAborted--0.0000.000------0.0000.0000.000
json-bench-data.1.0--AbortedAborted------AbortedAbortedAborted--0.0000.000------0.0000.0000.000
jsonm.1.0.1--AbortedAborted------AbortedAbortedAborted--0.0000.000------0.0000.0000.000
jsonm-bench.1.0--AbortedAborted------AbortedAbortedAborted--0.0000.000------0.0000.0000.000
jst-config.v0.12.0-------Aborted-AbortedAbortedAbortedAborted-------0.000-0.0000.0000.0000.000
kb-bench.1.0--AbortedAborted------AbortedAbortedAborted--0.0000.000------0.0000.0000.000
lablgtk.2.18.8--AbortedAborted-----------0.0000.000---------
lexifi-g2pp-bench.1.0--AbortedAborted------AbortedAbortedAborted--0.0000.000------0.0000.0000.000
lwt.4.1.0OK------------19.621------------
lwt.4.4.0--AbortedAborted------AbortedAbortedAborted--0.0000.000------0.0000.0000.000
menhir.20190924--AbortedAborted------AbortedAbortedAborted--0.0000.000------0.0000.0000.000
menhir-bench.1.0--AbortedAborted------AbortedAbortedAborted--0.0000.000------0.0000.0000.000
minilight.1.6--AbortedAborted------AbortedAbortedAborted--0.0000.000------0.0000.0000.000
minilight-bench.1.0--AbortedAborted------AbortedAbortedAborted--0.0000.000------0.0000.0000.000
mmap.1.1.0--AbortedAborted------AbortedAbortedAborted--0.0000.000------0.0000.0000.000
nbcodec.1.0--AbortedAborted------AbortedAbortedAborted--0.0000.000------0.0000.0000.000
nbcodec-bench.1.0--AbortedAborted------AbortedAbortedAborted--0.0000.000------0.0000.0000.000
num.1.2--AbortedAborted------AbortedAbortedAborted--0.0000.000------0.0000.0000.000
numerical-analysis-bench.1.0--AbortedAborted---Failure (2)-Failure (2)AbortedAbortedAborted--0.0000.000---9.202-6.5820.0000.0000.000
ocaml.4.06.1--Failure (1)Failure (1)-----------0.0650.078---------
ocaml.4.08.0----------AbortedAbortedAborted----------0.0000.0000.000
ocaml-compiler-libs.v0.12.1--AbortedAborted------AbortedAbortedAborted--0.0000.000------0.0000.0000.000
ocaml-compiler-libs.v0.9.0OK------------1.463------------
ocaml-migrate-parsetree.1.0.7OK------------5.046------------
ocaml-migrate-parsetree.1.4.0--AbortedAborted---Failure (1)-Failure (1)AbortedAbortedAborted--0.0000.000---0.976-1.0510.0000.0000.000
ocaml-variants.4.08.0+trunk+flambda----------Failure (1)------------0.308--
ocaml-variants.4.08.0+trunk+flambda+oclassic-----------Failure (1)------------0.309-
ocaml-variants.4.08.0+trunk+flambda+opt------------Failure (1)------------0.348
ocamlbuild.0.14.0--AbortedAborted------AbortedAbortedAborted--0.0000.000------0.0000.0000.000
ocamlfind.1.8.1--AbortedAborted------AbortedAbortedAborted--0.0000.000------0.0000.0000.000
ocamlgraph.1.8.8--AbortedAborted-----------0.0000.000---------
ocplib-endian.0.8OK------------23.758------------
ocplib-endian.1.0--AbortedAborted------AbortedAbortedAborted--0.0000.000------0.0000.0000.000
ocplib-simplex.0.4--AbortedAborted------AbortedAbortedAborted--0.0000.000------0.0000.0000.000
octavius.1.2.1OK-AbortedAbortedOKOKOKOK-OKAbortedAbortedAborted1.441-0.0000.0000.8211.2241.4661.112-1.2830.0000.0000.000
parsexp.v0.11.0--AbortedAborted-----------0.0000.000---------
parsexp.v0.12.0----------AbortedAbortedAborted----------0.0000.0000.000
patdiff.v0.11.0--AbortedAborted-----------0.0000.000---------
patdiff.v0.12.1----OKOKOKAborted-AbortedAbortedAbortedAborted----5.0656.9926.2220.000-0.0000.0000.0000.000
patdiff.v0.9.0OK------------6.735------------
patdiff-bench.1.0OK-AbortedAbortedOKOKOKAborted-AbortedAbortedAbortedAborted0.151-0.0000.0000.1640.1610.1830.000-0.0000.0000.0000.000
patience_diff.v0.11.0--AbortedAborted-----------0.0000.000---------
patience_diff.v0.12.0----OKOKOKAborted-AbortedAbortedAbortedAborted----4.8667.1376.1760.000-0.0000.0000.0000.000
patience_diff.v0.9.0OK------------2.033------------
pcre.7.4.1--AbortedAborted-----------0.0000.000---------
pcre.7.4.3---------Failure (1)AbortedAbortedAborted---------0.8160.0000.0000.000
ppx_assert.v0.11.0--AbortedAborted-----------0.0000.000---------
ppx_assert.v0.12.0-------Aborted-AbortedAbortedAbortedAborted-------0.000-0.0000.0000.0000.000
ppx_assert.v0.9.0OK------------2.749------------
ppx_ast.v0.9.1OK------------9.160------------
ppx_base.v0.11.0--AbortedAborted-----------0.0000.000---------
ppx_base.v0.12.0----OKOKOKAborted-AbortedAbortedAbortedAborted----1.5042.6872.4900.000-0.0000.0000.0000.000
ppx_base.v0.9.0OK------------2.821------------
ppx_bench.v0.11.0--AbortedAborted-----------0.0000.000---------
ppx_bench.v0.12.0-------Aborted-AbortedAbortedAbortedAborted-------0.000-0.0000.0000.0000.000
ppx_bench.v0.9.1OK------------4.216------------
ppx_bin_prot.v0.11.1--AbortedAborted-----------0.0000.000---------
ppx_bin_prot.v0.12.1-------Aborted-AbortedAbortedAbortedAborted-------0.000-0.0000.0000.0000.000
ppx_bin_prot.v0.9.0OK------------6.800------------
ppx_compare.v0.11.1--AbortedAborted-----------0.0000.000---------
ppx_compare.v0.12.0-------Aborted-AbortedAbortedAbortedAborted-------0.000-0.0000.0000.0000.000
ppx_compare.v0.9.0OK------------6.491------------
ppx_core.v0.9.0OK------------3.715------------
ppx_custom_printf.v0.11.0--AbortedAborted-----------0.0000.000---------
ppx_custom_printf.v0.12.1-------Aborted-AbortedAbortedAbortedAborted-------0.000-0.0000.0000.0000.000
ppx_custom_printf.v0.9.0OK------------5.261------------
ppx_derivers.1.0OK------------0.270------------
ppx_derivers.1.2.1--AbortedAborted------AbortedAbortedAborted--0.0000.000------0.0000.0000.000
ppx_driver.v0.9.1OK------------2.467------------
ppx_enumerate.v0.11.1--AbortedAborted-----------0.0000.000---------
ppx_enumerate.v0.12.0-------Aborted-AbortedAbortedAbortedAborted-------0.000-0.0000.0000.0000.000
ppx_enumerate.v0.9.0OK------------2.737------------
ppx_expect.v0.11.1--AbortedAborted-----------0.0000.000---------
ppx_expect.v0.12.0-------Aborted-AbortedAbortedAbortedAborted-------0.000-0.0000.0000.0000.000
ppx_expect.v0.9.0OK------------11.348------------
ppx_fail.v0.11.0--AbortedAborted-----------0.0000.000---------
ppx_fail.v0.12.0-------Aborted-AbortedAbortedAbortedAborted-------0.000-0.0000.0000.0000.000
ppx_fail.v0.9.0OK------------5.130------------
ppx_fields_conv.v0.11.0--AbortedAborted-----------0.0000.000---------
ppx_fields_conv.v0.12.0-------Aborted-AbortedAbortedAbortedAborted-------0.000-0.0000.0000.0000.000
ppx_fields_conv.v0.9.0OK------------7.767------------
ppx_hash.v0.11.1--AbortedAborted-----------0.0000.000---------
ppx_hash.v0.12.0-------Aborted-AbortedAbortedAbortedAborted-------0.000-0.0000.0000.0000.000
ppx_hash.v0.9.0OK------------4.321------------
ppx_here.v0.11.0--AbortedAborted-----------0.0000.000---------
ppx_here.v0.12.0-------Aborted-AbortedAbortedAbortedAborted-------0.000-0.0000.0000.0000.000
ppx_here.v0.9.1OK------------3.165------------
ppx_inline_test.v0.11.0--AbortedAborted-----------0.0000.000---------
ppx_inline_test.v0.12.0-------Aborted-AbortedAbortedAbortedAborted-------0.000-0.0000.0000.0000.000
ppx_inline_test.v0.9.2OK------------5.915------------
ppx_jane.v0.11.0--AbortedAborted-----------0.0000.000---------
ppx_jane.v0.12.0----OKOKOKAborted-AbortedAbortedAbortedAborted----2.1042.7983.6210.000-0.0000.0000.0000.000
ppx_jane.v0.9.0OK------------1.692------------
ppx_js_style.v0.11.0--AbortedAborted-----------0.0000.000---------
ppx_js_style.v0.12.0----OKOKOKAborted-AbortedAbortedAbortedAborted----7.8658.7567.7800.000-0.0000.0000.0000.000
ppx_js_style.v0.9.0OK------------9.588------------
ppx_let.v0.11.0--AbortedAborted-----------0.0000.000---------
ppx_let.v0.12.0-------Aborted-AbortedAbortedAbortedAborted-------0.000-0.0000.0000.0000.000
ppx_let.v0.9.0OK------------2.232------------
ppx_metaquot.v0.9.0OK------------4.229------------
ppx_module_timer.v0.12.0----OKOKOKAborted-AbortedAbortedAbortedAborted----7.7688.1327.8610.000-0.0000.0000.0000.000
ppx_optcomp.v0.11.0--AbortedAborted-----------0.0000.000---------
ppx_optcomp.v0.12.0-------Aborted-AbortedAbortedAbortedAborted-------0.000-0.0000.0000.0000.000
ppx_optcomp.v0.9.0OK------------0.922------------
ppx_optional.v0.11.0--AbortedAborted-----------0.0000.000---------
ppx_optional.v0.12.0-------Aborted-AbortedAbortedAbortedAborted-------0.000-0.0000.0000.0000.000
ppx_optional.v0.9.0OK------------2.725------------
ppx_pipebang.v0.11.0--AbortedAborted-----------0.0000.000---------
ppx_pipebang.v0.12.0-------Aborted-AbortedAbortedAbortedAborted-------0.000-0.0000.0000.0000.000
ppx_pipebang.v0.9.0OK------------10.289------------
ppx_sexp_conv.v0.11.2--AbortedAborted-----------0.0000.000---------
ppx_sexp_conv.v0.12.0-------Aborted-AbortedAbortedAbortedAborted-------0.000-0.0000.0000.0000.000
ppx_sexp_conv.v0.9.0OK------------8.416------------
ppx_sexp_message.v0.11.0--AbortedAborted-----------0.0000.000---------
ppx_sexp_message.v0.12.0-------Aborted-AbortedAbortedAbortedAborted-------0.000-0.0000.0000.0000.000
ppx_sexp_message.v0.9.0OK------------5.126------------
ppx_sexp_value.v0.11.0--AbortedAborted-----------0.0000.000---------
ppx_sexp_value.v0.12.0-------Aborted-AbortedAbortedAbortedAborted-------0.000-0.0000.0000.0000.000
ppx_sexp_value.v0.9.0OK------------5.378------------
ppx_stable.v0.12.0-------Aborted-AbortedAbortedAbortedAborted-------0.000-0.0000.0000.0000.000
ppx_traverse.v0.9.0OK------------9.587------------
ppx_traverse_builtins.v0.9.0OK------------0.312------------
ppx_type_conv.v0.9.1OK------------11.121------------
ppx_typerep_conv.v0.11.1--AbortedAborted-----------0.0000.000---------
ppx_typerep_conv.v0.12.0-------Aborted-AbortedAbortedAbortedAborted-------0.000-0.0000.0000.0000.000
ppx_typerep_conv.v0.9.0OK------------2.383------------
ppx_variants_conv.v0.11.1--AbortedAborted-----------0.0000.000---------
ppx_variants_conv.v0.12.0-------Aborted-AbortedAbortedAbortedAborted-------0.000-0.0000.0000.0000.000
ppx_variants_conv.v0.9.0OK------------7.379------------
ppxlib.0.8.1--AbortedAborted---Aborted-AbortedAbortedAbortedAborted--0.0000.000---0.000-0.0000.0000.0000.000
protocol_version_header.v0.11.0--AbortedAborted-----------0.0000.000---------
protocol_version_header.v0.12.0----OKOKOKAborted-AbortedAbortedAbortedAborted----3.8235.0104.7250.000-0.0000.0000.0000.000
psmt2-frontend.0.2--AbortedAborted------AbortedAbortedAborted--0.0000.000------0.0000.0000.000
re.1.7.3OK------------1.285------------
re.1.9.0--AbortedAborted------AbortedAbortedAborted--0.0000.000------0.0000.0000.000
re2.v0.11.0--AbortedAborted-----------0.0000.000---------
re2.v0.12.1----OKOKOKAborted-AbortedAbortedAbortedAborted----68.05872.28970.7840.000-0.0000.0000.0000.000
re2.v0.9.0OK------------66.448------------
result.1.3OK------------1.188------------
result.1.4--AbortedAborted------AbortedAbortedAborted--0.0000.000------0.0000.0000.000
sauvola-bench.1.0--AbortedAbortedOKOKOKOK-AbortedAbortedAbortedAborted--0.0000.0001.5691.6151.4410.536-0.0000.0000.0000.000
seq.0.2--AbortedAborted-----------0.0000.000---------
seq.base----------AbortedAbortedAborted----------0.0000.0000.000
sequence-bench.1.0--AbortedAborted------AbortedAbortedAborted--0.0000.000------0.0000.0000.000
sexp_pretty.v0.11.0--AbortedAborted-----------0.0000.000---------
sexp_pretty.v0.12.0----OKOKOKAborted-AbortedAbortedAbortedAborted----3.8785.4014.6970.000-0.0000.0000.0000.000
sexplib.v0.11.0--AbortedAborted-----------0.0000.000---------
sexplib.v0.12.0----------AbortedAbortedAborted----------0.0000.0000.000
sexplib.v0.9.2OK------------1.524------------
sexplib0.v0.11.0--AbortedAborted-----------0.0000.000---------
sexplib0.v0.12.0----------AbortedAbortedAborted----------0.0000.0000.000
shell.v0.12.0----OKOKOKAborted-AbortedAbortedAbortedAborted----3.4574.0203.4420.000-0.0000.0000.0000.000
spawn.v0.13.0--AbortedAborted------AbortedAbortedAborted--0.0000.000------0.0000.0000.000
spawn.v0.9.0OK------------1.022------------
splittable_random.v0.11.0--AbortedAborted-----------0.0000.000---------
splittable_random.v0.12.0-------Aborted-AbortedAbortedAbortedAborted-------0.000-0.0000.0000.0000.000
stdio.v0.11.0--AbortedAborted-----------0.0000.000---------
stdio.v0.12.0----------AbortedAbortedAborted----------0.0000.0000.000
stdio.v0.9.0OK------------0.938------------
stdlib-shims.0.1.0--AbortedAborted------AbortedAbortedAborted--0.0000.000------0.0000.0000.000
stringext.1.5.0OK------------2.592------------
stringext.1.6.0--AbortedAborted------AbortedAbortedAborted--0.0000.000------0.0000.0000.000
textutils.v0.11.0--AbortedAborted-----------0.0000.000---------
textutils.v0.12.0----OKOKOKAborted-AbortedAbortedAbortedAborted----8.8083.2198.0690.000-0.0000.0000.0000.000
textutils.v0.9.0OK------------3.552------------
textutils_kernel.v0.11.0--AbortedAborted-----------0.0000.000---------
textutils_kernel.v0.12.0----OKOKOK----------4.4135.7484.885------
thread-bench.1.0OK-AbortedAbortedFailure (2)Failure (2)Failure (2)Aborted-AbortedAbortedAbortedAborted2.465-0.0000.0000.7400.7941.4540.000-0.0000.0000.0000.000
time_now.v0.12.0----OKOKOKAborted-AbortedAbortedAbortedAborted----2.0253.2212.9200.000-0.0000.0000.0000.000
topkg.1.0.1--AbortedAborted------AbortedAbortedAborted--0.0000.000------0.0000.0000.000
typerep.v0.11.0--AbortedAborted-----------0.0000.000---------
typerep.v0.12.0----------AbortedAbortedAborted----------0.0000.0000.000
typerep.v0.9.0OK------------0.915------------
uchar.0.0.2--AbortedAborted------AbortedAbortedAborted--0.0000.000------0.0000.0000.000
uri.1.9.7OK------------5.631------------
uri.3.0.0--AbortedAborted------AbortedAbortedAborted--0.0000.000------0.0000.0000.000
uri-sexp.3.0.0--AbortedAborted---Aborted-AbortedAbortedAbortedAborted--0.0000.000---0.000-0.0000.0000.0000.000
uutf.1.0.2--AbortedAborted------AbortedAbortedAborted--0.0000.000------0.0000.0000.000
valet-bench.1.0Failure (2)------------0.580------------
variantslib.v0.11.0--AbortedAborted-----------0.0000.000---------
variantslib.v0.12.0----------AbortedAbortedAborted----------0.0000.0000.000
variantslib.v0.9.0OK------------5.997------------
yojson.1.4.1OK------------13.790------------
yojson.1.7.0--AbortedAborted------AbortedAbortedAborted--0.0000.000------0.0000.0000.000
yojson-bench.1.0Failure (2)-AbortedAbortedFailure (2)Failure (2)Failure (2)Failure (2)-Failure (2)AbortedAbortedAborted0.147-0.0000.0000.6750.2830.2310.704-0.7750.0000.0000.000
zarith.1.9.1--AbortedAborted------AbortedAbortedAborted--0.0000.000------0.0000.0000.000
Close

Error on yojson-bench.1.0 (4.08.0+trunk+bench)

Command:

/usr/bin/make -C yojson

Output

make: Entering directory '/home/louis/.opam/4.08.0+trunk+bench/.opam-switch/build/yojson-bench.1.0/yojson'
ocamlfind ocamlopt -I `ocamlfind query yojson` -o ydump_bench -package easy-format,biniou -linkpkg yojson.cmx yojson_biniou.cmx ydump.ml
gcc: error: /home/louis/.opam/4.08.0+trunk+bench/lib/yojson/yojson_biniou.o: No such file or directory
gcc: error: /home/louis/.opam/4.08.0+trunk+bench/lib/yojson/yojson.o: No such file or directory
File "caml_startup", line 1:
Error: Error during linking
Makefile:6: recipe for target 'all' failed
make: *** [all] Error 2
make: Leaving directory '/home/louis/.opam/4.08.0+trunk+bench/.opam-switch/build/yojson-bench.1.0/yojson'
Close

Error on yojson-bench.1.0 (4.08.0+gpr2165+bench)

Command:

/usr/bin/make -C yojson

Output

make: Entering directory '/home/louis/.opam/4.08.0+gpr2165+bench/.opam-switch/build/yojson-bench.1.0/yojson'
ocamlfind ocamlopt -I `ocamlfind query yojson` -o ydump_bench -package easy-format,biniou -linkpkg yojson.cmx yojson_biniou.cmx ydump.ml
gcc: error: /home/louis/.opam/4.08.0+gpr2165+bench/lib/yojson/yojson_biniou.o: No such file or directory
gcc: error: /home/louis/.opam/4.08.0+gpr2165+bench/lib/yojson/yojson.o: No such file or directory
File "caml_startup", line 1:
Error: Error during linking
Makefile:6: recipe for target 'all' failed
make: *** [all] Error 2
make: Leaving directory '/home/louis/.opam/4.08.0+gpr2165+bench/.opam-switch/build/yojson-bench.1.0/yojson'
Close

Error on yojson-bench.1.0 (4.07.1+oclassic+bench)

Command:

/usr/bin/make -C yojson

Output

make: Entering directory '/home/louis/.opam/4.07.1+oclassic+bench/.opam-switch/build/yojson-bench.1.0/yojson'
ocamlfind ocamlopt -I `ocamlfind query yojson` -o ydump_bench -package easy-format,biniou -linkpkg yojson.cmx yojson_biniou.cmx ydump.ml
gcc: error: /home/louis/.opam/4.07.1+oclassic+bench/lib/yojson/yojson_biniou.o: No such file or directory
gcc: error: /home/louis/.opam/4.07.1+oclassic+bench/lib/yojson/yojson.o: No such file or directory
File "caml_startup", line 1:
Error: Error during linking
Makefile:6: recipe for target 'all' failed
make: *** [all] Error 2
make: Leaving directory '/home/louis/.opam/4.07.1+oclassic+bench/.opam-switch/build/yojson-bench.1.0/yojson'
Close

Error on yojson-bench.1.0 (4.07.1+flambda+bench)

Command:

/usr/bin/make -C yojson

Output

make: Entering directory '/home/louis/.opam/4.07.1+flambda+bench/.opam-switch/build/yojson-bench.1.0/yojson'
ocamlfind ocamlopt -I `ocamlfind query yojson` -o ydump_bench -package easy-format,biniou -linkpkg yojson.cmx yojson_biniou.cmx ydump.ml
gcc: error: /home/louis/.opam/4.07.1+flambda+bench/lib/yojson/yojson_biniou.o: No such file or directory
gcc: error: /home/louis/.opam/4.07.1+flambda+bench/lib/yojson/yojson.o: No such file or directory
File "caml_startup", line 1:
Error: Error during linking
Makefile:6: recipe for target 'all' failed
make: *** [all] Error 2
make: Leaving directory '/home/louis/.opam/4.07.1+flambda+bench/.opam-switch/build/yojson-bench.1.0/yojson'
Close

Error on yojson-bench.1.0 (4.07.1+clambda+bench)

Command:

/usr/bin/make -C yojson

Output

make: Entering directory '/home/louis/.opam/4.07.1+clambda+bench/.opam-switch/build/yojson-bench.1.0/yojson'
ocamlfind ocamlopt -I `ocamlfind query yojson` -o ydump_bench -package easy-format,biniou -linkpkg yojson.cmx yojson_biniou.cmx ydump.ml
gcc: error: /home/louis/.opam/4.07.1+clambda+bench/lib/yojson/yojson_biniou.o: No such file or directory
gcc: error: /home/louis/.opam/4.07.1+clambda+bench/lib/yojson/yojson.o: No such file or directory
File "caml_startup", line 1:
Error: Error during linking
Makefile:6: recipe for target 'all' failed
make: *** [all] Error 2
make: Leaving directory '/home/louis/.opam/4.07.1+clambda+bench/.opam-switch/build/yojson-bench.1.0/yojson'
Close

Error on yojson-bench.1.0 (4.03.1+bench)

Command:

/usr/bin/make -C yojson

Output

make: Entering directory '/home/louis/.opam/4.03.1+bench/.opam-switch/build/yojson-bench.1.0/yojson'
ocamlfind ocamlopt -I `ocamlfind query yojson` -o ydump_bench -package easy-format,biniou -linkpkg yojson.cmx yojson_biniou.cmx ydump.ml
gcc: error: /home/louis/.opam/4.03.1+bench/lib/yojson/yojson_biniou.o: No such file or directory
gcc: error: /home/louis/.opam/4.03.1+bench/lib/yojson/yojson.o: No such file or directory
File "caml_startup", line 1:
Error: Error during linking
Makefile:6: recipe for target 'all' failed
make: *** [all] Error 2
make: Leaving directory '/home/louis/.opam/4.03.1+bench/.opam-switch/build/yojson-bench.1.0/yojson'
Close

Error on valet-bench.1.0 (4.03.1+bench)

Command:

/usr/bin/make -C valet

Output

make: Entering directory '/home/louis/.opam/4.03.1+bench/.opam-switch/build/valet-bench.1.0/valet'
ocamlbuild -use-ocamlfind test_lwt.native test_async.native
ocamlfind ocamldep -package react -package uuidm -package unix -package ocplib-endian -package lwt.unix -modules test_lwt.ml > test_lwt.ml.depends
ocamlfind ocamldep -package react -package uuidm -package ocplib-endian -modules test_lib.ml > test_lib.ml.depends
ocamlfind ocamldep -package uuidm -package unix -package ocplib-endian -modules valet_core.ml > valet_core.ml.depends
ocamlfind ocamldep -package react -package uuidm -package ocplib-endian -modules valet_react.ml > valet_react.ml.depends
ocamlfind ocamlc -c -g -bin-annot -package uuidm -package unix -package ocplib-endian -o valet_core.cmo valet_core.ml
ocamlfind ocamlc -c -g -bin-annot -package react -package uuidm -package ocplib-endian -o valet_react.cmo valet_react.ml
ocamlfind ocamlc -c -g -bin-annot -package react -package uuidm -package ocplib-endian -o test_lib.cmo test_lib.ml
ocamlfind ocamlc -c -g -bin-annot -package react -package uuidm -package unix -package ocplib-endian -package lwt.unix -o test_lwt.cmo test_lwt.ml
+ ocamlfind ocamlc -c -g -bin-annot -package react -package uuidm -package unix -package ocplib-endian -package lwt.unix -o test_lwt.cmo test_lwt.ml
ocamlfind: [WARNING] Package `threads': Linking problems may arise because of the missing -thread or -vmthread switch
ocamlfind ocamlopt -c -g -bin-annot -package uuidm -package unix -package ocplib-endian -o valet_core.cmx valet_core.ml
ocamlfind ocamlopt -c -g -bin-annot -package react -package uuidm -package ocplib-endian -o valet_react.cmx valet_react.ml
ocamlfind ocamlopt -c -g -bin-annot -package react -package uuidm -package ocplib-endian -o test_lib.cmx test_lib.ml
ocamlfind ocamlopt -c -g -bin-annot -package react -package uuidm -package unix -package ocplib-endian -package lwt.unix -o test_lwt.cmx test_lwt.ml
+ ocamlfind ocamlopt -c -g -bin-annot -package react -package uuidm -package unix -package ocplib-endian -package lwt.unix -o test_lwt.cmx test_lwt.ml
ocamlfind: [WARNING] Package `threads': Linking problems may arise because of the missing -thread or -vmthread switch
ocamlfind ocamlopt -linkpkg -g -package react -package uuidm -package unix -package ocplib-endian -package lwt.unix valet_core.cmx valet_react.cmx test_lib.cmx test_lwt.cmx -o test_lwt.native
+ ocamlfind ocamlopt -linkpkg -g -package react -package uuidm -package unix -package ocplib-endian -package lwt.unix valet_core.cmx valet_react.cmx test_lib.cmx test_lwt.cmx -o test_lwt.native
ocamlfind: [WARNING] Package `threads': Linking problems may arise because of the missing -thread or -vmthread switch
ocamlfind ocamldep -package react -package uuidm -package unix -package ocplib-endian -package async -modules test_async.ml > test_async.ml.depends
ocamlfind ocamlc -c -g -bin-annot -thread -package react -package uuidm -package unix -package ocplib-endian -package async -o test_async.cmo test_async.ml
+ ocamlfind ocamlc -c -g -bin-annot -thread -package react -package uuidm -package unix -package ocplib-endian -package async -o test_async.cmo test_async.ml
File "test_async.ml", line 3, characters 5-13:
Warning 3: deprecated: module Core.Std
[since 2017-02] Use Core. The Std sub-module is no longer needed
File "test_async.ml", line 4, characters 5-14:
Warning 3: deprecated: module Async.Std
[since 2017-02] use Async. The Std sub-module is no longer needed
File "test_async.ml", line 23, characters 13-22:
Warning 3: deprecated: module Async.Std
[since 2017-02] use Async. The Std sub-module is no longer needed
File "test_async.ml", line 64, characters 5-19:
Error: This expression has type
         [> `Probably_should_not_use_blocking_Core_Printf_functions_with_Async ]
       This is not a function; it cannot be applied.
Command exited with code 2.
Makefile:6: recipe for target 'all' failed
make: *** [all] Error 10
make: Leaving directory '/home/louis/.opam/4.03.1+bench/.opam-switch/build/valet-bench.1.0/valet'
Close

Error on thread-bench.1.0 (4.07.1+oclassic+bench)

Command:

/usr/bin/make -C thread

Output

make: Entering directory '/home/louis/.opam/4.07.1+oclassic+bench/.opam-switch/build/thread-bench.1.0/thread'
ocamlfind ocamlopt -package lwt.unix -linkpkg -o thread_sleep_lwt thread_sleep_lwt.ml
ocamlfind: [WARNING] Package `threads': Linking problems may arise because of the missing -thread or -vmthread switch
ocamlfind ocamlopt -package lwt.unix -linkpkg -o thread_ring_lwt_mvar thread_ring_lwt_mvar.ml
ocamlfind: [WARNING] Package `threads': Linking problems may arise because of the missing -thread or -vmthread switch
ocamlfind ocamlopt -package lwt.unix -linkpkg -o thread_ring_lwt_stream thread_ring_lwt_stream.ml
ocamlfind: [WARNING] Package `threads': Linking problems may arise because of the missing -thread or -vmthread switch
ocamlfind ocamlopt -thread -package async -linkpkg -o thread_sleep_async thread_sleep_async.ml
File "thread_sleep_async.ml", line 1, characters 5-13:
Error: Unbound module Core.Std
Makefile:10: recipe for target 'thread_sleep_async' failed
make: *** [thread_sleep_async] Error 2
make: Leaving directory '/home/louis/.opam/4.07.1+oclassic+bench/.opam-switch/build/thread-bench.1.0/thread'
Close

Error on thread-bench.1.0 (4.07.1+flambda+bench)

Command:

/usr/bin/make -C thread

Output

make: Entering directory '/home/louis/.opam/4.07.1+flambda+bench/.opam-switch/build/thread-bench.1.0/thread'
ocamlfind ocamlopt -package lwt.unix -linkpkg -o thread_sleep_lwt thread_sleep_lwt.ml
ocamlfind: [WARNING] Package `threads': Linking problems may arise because of the missing -thread or -vmthread switch
ocamlfind ocamlopt -package lwt.unix -linkpkg -o thread_ring_lwt_mvar thread_ring_lwt_mvar.ml
ocamlfind: [WARNING] Package `threads': Linking problems may arise because of the missing -thread or -vmthread switch
ocamlfind ocamlopt -package lwt.unix -linkpkg -o thread_ring_lwt_stream thread_ring_lwt_stream.ml
ocamlfind: [WARNING] Package `threads': Linking problems may arise because of the missing -thread or -vmthread switch
ocamlfind ocamlopt -thread -package async -linkpkg -o thread_sleep_async thread_sleep_async.ml
File "thread_sleep_async.ml", line 1, characters 5-13:
Error: Unbound module Core.Std
Makefile:10: recipe for target 'thread_sleep_async' failed
make: *** [thread_sleep_async] Error 2
make: Leaving directory '/home/louis/.opam/4.07.1+flambda+bench/.opam-switch/build/thread-bench.1.0/thread'
Close

Error on thread-bench.1.0 (4.07.1+clambda+bench)

Command:

/usr/bin/make -C thread

Output

make: Entering directory '/home/louis/.opam/4.07.1+clambda+bench/.opam-switch/build/thread-bench.1.0/thread'
ocamlfind ocamlopt -package lwt.unix -linkpkg -o thread_sleep_lwt thread_sleep_lwt.ml
ocamlfind: [WARNING] Package `threads': Linking problems may arise because of the missing -thread or -vmthread switch
ocamlfind ocamlopt -package lwt.unix -linkpkg -o thread_ring_lwt_mvar thread_ring_lwt_mvar.ml
ocamlfind: [WARNING] Package `threads': Linking problems may arise because of the missing -thread or -vmthread switch
ocamlfind ocamlopt -package lwt.unix -linkpkg -o thread_ring_lwt_stream thread_ring_lwt_stream.ml
ocamlfind: [WARNING] Package `threads': Linking problems may arise because of the missing -thread or -vmthread switch
ocamlfind ocamlopt -thread -package async -linkpkg -o thread_sleep_async thread_sleep_async.ml
File "thread_sleep_async.ml", line 1, characters 5-13:
Error: Unbound module Core.Std
Makefile:10: recipe for target 'thread_sleep_async' failed
make: *** [thread_sleep_async] Error 2
make: Leaving directory '/home/louis/.opam/4.07.1+clambda+bench/.opam-switch/build/thread-bench.1.0/thread'
Close

Error on pcre.7.4.3 (4.08.0+trunk+bench)

Command:

~/.opam/4.08.0+trunk+bench/bin/dune build -p pcre -j 7

Output

    ocamlopt src/config/discover.exe (exit 2)
(cd _build/default && /home/louis/.opam/4.08.0+trunk+bench/bin/ocamlopt.opt -w -40 -g -O3 -o src/config/discover.exe -I /home/louis/.opam/4.08.0+trunk+bench/lib/base -I /home/louis/.opam/4.08.0+trunk+bench/lib/base/caml -I /home/louis/.opam/4.08.0+trunk+bench/lib/base/shadow_stdlib -I /home/louis/.opam/4.08.0+trunk+bench/lib/dune/_caml -I /home/louis/.opam/4.08.0+trunk+bench/lib/dune/_dune_lang -I /home/louis/.opam/4.08.0+trunk+bench/lib/dune/_ocaml_config -I /home/louis/.opam/4.08.0+trunk+bench/lib/dune/_result -I /home/louis/.opam/4.08.0+trunk+bench/lib/dune/_stdune -I /home/louis/.opam/4.08.0+trunk+bench/lib/dune/configurator -I /home/louis/.opam/4.08.0+trunk+bench/lib/sexplib0 /home/louis/.opam/4.08.0+trunk+bench/lib/base/caml/caml.cmxa /home/louis/.opam/4.08.0+trunk+bench/lib/sexplib0/sexplib0.cmxa /home/louis/.opam/4.08.0+trunk+bench/lib/base/shadow_stdlib/shadow_stdlib.cmxa /home/louis/.opam/4.08.0+trunk+bench/lib/base/base.cmxa /home/louis/.opam/4.08.0+trunk+bench/lib/dune/_result/dune_result.cmxa /home/louis/.opam/4.08.0+trunk+bench/lib/dune/_caml/dune_caml.cmxa /home/louis/.opam/4.08.0+trunk+bench/lib/ocaml/unix.cmxa /home/louis/.opam/4.08.0+trunk+bench/lib/dune/_stdune/stdune.cmxa /home/louis/.opam/4.08.0+trunk+bench/lib/dune/_ocaml_config/ocaml_config.cmxa /home/louis/.opam/4.08.0+trunk+bench/lib/dune/_dune_lang/dune_lang.cmxa /home/louis/.opam/4.08.0+trunk+bench/lib/dune/configurator/configurator.cmxa src/config/.discover.eobjs/native/discover.cmx)
/home/louis/.opam/4.08.0+trunk+bench/lib/base/libbase_stubs.a(exn_stubs.o): In function `Base_clear_caml_backtrace_pos':
/home/louis/.opam/4.08.0+trunk+bench/.opam-switch/build/base.v0.12.2/_build/default/src/exn_stubs.c:6: undefined reference to `caml_backtrace_pos'
collect2: error: ld returned 1 exit status
File "caml_startup", line 1:
Error: Error during linking
Close

Error on ocaml-variants.4.08.0+trunk+flambda+opt (4.08.0+trunk+flambda+opt+bench)

Command:

~/.opam/4.08.0+trunk+flambda+opt+bench/.opam-switch/build/ocaml-variants.4.08.0+trunk+flambda+opt/./configure -prefix /home/louis/.opam/4.08.0+trunk+flambda+opt+bench -flambda -with-debug-runtime

Output

configure: error: unrecognized option: `-flambda'
Try `/home/louis/.opam/4.08.0+trunk+flambda+opt+bench/.opam-switch/build/ocaml-variants.4.08.0+trunk+flambda+opt/./configure --help' for more information
Close

Error on ocaml-variants.4.08.0+trunk+flambda+oclassic (4.08.0+trunk+flambda+oclassic+bench)

Command:

~/.opam/4.08.0+trunk+flambda+oclassic+bench/.opam-switch/build/ocaml-variants.4.08.0+trunk+flambda+oclassic/./configure -prefix /home/louis/.opam/4.08.0+trunk+flambda+oclassic+bench -flambda -with-debug-runtime

Output

configure: error: unrecognized option: `-flambda'
Try `/home/louis/.opam/4.08.0+trunk+flambda+oclassic+bench/.opam-switch/build/ocaml-variants.4.08.0+trunk+flambda+oclassic/./configure --help' for more information
Close

Error on ocaml-variants.4.08.0+trunk+flambda (4.08.0+trunk+flambda+bench)

Command:

~/.opam/4.08.0+trunk+flambda+bench/.opam-switch/build/ocaml-variants.4.08.0+trunk+flambda/./configure -prefix /home/louis/.opam/4.08.0+trunk+flambda+bench -flambda -with-debug-runtime

Output

configure: error: unrecognized option: `-flambda'
Try `/home/louis/.opam/4.08.0+trunk+flambda+bench/.opam-switch/build/ocaml-variants.4.08.0+trunk+flambda/./configure --help' for more information
Close

Error on ocaml-migrate-parsetree.1.4.0 (4.08.0+trunk+bench)

Command:

~/.opam/4.08.0+trunk+bench/bin/dune build -p ocaml-migrate-parsetree -j 7

Output

       ocaml src/ast-version,src/compiler-functions-file (exit 1)
(cd _build/default/src && /home/louis/.opam/4.08.0+trunk+bench/bin/ocaml config/gen.ml 4.11.0+dev0-2019-10-18)
Unkown OCaml version 4.11.0+dev0-2019-10-18
Close

Error on ocaml-migrate-parsetree.1.4.0 (4.08.0+gpr2165+bench)

Command:

~/.opam/4.08.0+gpr2165+bench/bin/dune build -p ocaml-migrate-parsetree -j 7

Output

       ocaml src/ast-version,src/compiler-functions-file (exit 1)
(cd _build/default/src && /home/louis/.opam/4.08.0+gpr2165+bench/bin/ocaml config/gen.ml 4.10.0+dev0-2019-04-23)
Unkown OCaml version 4.10.0+dev0-2019-04-23
Close

Error on ocaml.4.06.1 (4.06.1+flambda+opt+bench)

Command:

~/.opam/4.06.1+flambda+opt+bench/bin/ocaml /home/louis/.opam/4.06.1+flambda+opt+bench/share/ocaml-config/gen_ocaml_config.ml 4.06.1 ocaml

Output

OCaml version mismatch: 4.06.2, expected 4.06.1
Close

Error on ocaml.4.06.1 (4.06.1+flambda+bench)

Command:

~/.opam/4.06.1+flambda+bench/bin/ocaml /home/louis/.opam/4.06.1+flambda+bench/share/ocaml-config/gen_ocaml_config.ml 4.06.1 ocaml

Output

OCaml version mismatch: 4.06.2, expected 4.06.1
Close

Error on numerical-analysis-bench.1.0 (4.08.0+trunk+bench)

Command:

/usr/bin/make

Output

ulimit -s 98304; ocamlopt.opt  -I simple_access `ocamldep.opt -sort simple_access/*.ml` main_nogcstats.ml -o simple_access.opt
ulimit -s 98304; ocamlopt.opt  -I lu-decomposition `ocamldep.opt -sort lu-decomposition/*.ml` main_nogcstats.ml -o lu-decomposition.opt
ulimit -s 98304; ocamlopt.opt  -I fft `ocamldep.opt -sort fft/*.ml` main_nogcstats.ml -o fft.opt
ulimit -s 98304; ocamlopt.opt  -I rnd_access `ocamldep.opt -sort rnd_access/*.ml` main_nogcstats.ml -o rnd_access.opt
ulimit -s 98304; ocamlopt.opt  -I k-means `ocamldep.opt -sort k-means/*.ml` main_nogcstats.ml -o k-means.opt
Fatal error: exception Stack overflow
Makefile:20: recipe for target 'k-means.opt' failed
make: *** [k-means.opt] Error 2
Close

Error on numerical-analysis-bench.1.0 (4.08.0+gpr2165+bench)

Command:

/usr/bin/make

Output

ulimit -s 98304; ocamlopt.opt  -I simple_access `ocamldep.opt -sort simple_access/*.ml` main_nogcstats.ml -o simple_access.opt
ulimit -s 98304; ocamlopt.opt  -I lu-decomposition `ocamldep.opt -sort lu-decomposition/*.ml` main_nogcstats.ml -o lu-decomposition.opt
ulimit -s 98304; ocamlopt.opt  -I fft `ocamldep.opt -sort fft/*.ml` main_nogcstats.ml -o fft.opt
ulimit -s 98304; ocamlopt.opt  -I rnd_access `ocamldep.opt -sort rnd_access/*.ml` main_nogcstats.ml -o rnd_access.opt
ulimit -s 98304; ocamlopt.opt  -I k-means `ocamldep.opt -sort k-means/*.ml` main_nogcstats.ml -o k-means.opt
Fatal error: exception Stack overflow
Makefile:20: recipe for target 'k-means.opt' failed
make: *** [k-means.opt] Error 2
Close

Error on core-micro-bench.1.0 (4.07.1+oclassic+bench)

Command:

/usr/bin/make -C core_micro

Output

make: Entering directory '/home/louis/.opam/4.07.1+oclassic+bench/.opam-switch/build/core-micro-bench.1.0/core_micro'
ocamlbuild -use-ocamlfind runner.native
ocamlfind ocamldep -package str -package core -package core_bench.inline_benchmarks -modules runner.ml > runner.ml.depends
ocamlfind ocamlc -c -thread -package str -package core -package core_bench.inline_benchmarks -o runner.cmo runner.ml
+ ocamlfind ocamlc -c -thread -package str -package core -package core_bench.inline_benchmarks -o runner.cmo runner.ml
File "runner.ml", line 1, characters 5-13:
Error: Unbound module Core.Std
Command exited with code 2.
Makefile:4: recipe for target 'all' failed
make: *** [all] Error 10
make: Leaving directory '/home/louis/.opam/4.07.1+oclassic+bench/.opam-switch/build/core-micro-bench.1.0/core_micro'
Close

Error on core-micro-bench.1.0 (4.07.1+flambda+bench)

Command:

/usr/bin/make -C core_micro

Output

make: Entering directory '/home/louis/.opam/4.07.1+flambda+bench/.opam-switch/build/core-micro-bench.1.0/core_micro'
ocamlbuild -use-ocamlfind runner.native
ocamlfind ocamldep -package str -package core -package core_bench.inline_benchmarks -modules runner.ml > runner.ml.depends
ocamlfind ocamlc -c -thread -package str -package core -package core_bench.inline_benchmarks -o runner.cmo runner.ml
+ ocamlfind ocamlc -c -thread -package str -package core -package core_bench.inline_benchmarks -o runner.cmo runner.ml
File "runner.ml", line 1, characters 5-13:
Error: Unbound module Core.Std
Command exited with code 2.
Makefile:4: recipe for target 'all' failed
make: *** [all] Error 10
make: Leaving directory '/home/louis/.opam/4.07.1+flambda+bench/.opam-switch/build/core-micro-bench.1.0/core_micro'
Close

Error on core-micro-bench.1.0 (4.07.1+clambda+bench)

Command:

/usr/bin/make -C core_micro

Output

make: Entering directory '/home/louis/.opam/4.07.1+clambda+bench/.opam-switch/build/core-micro-bench.1.0/core_micro'
ocamlbuild -use-ocamlfind runner.native
ocamlfind ocamldep -package str -package core -package core_bench.inline_benchmarks -modules runner.ml > runner.ml.depends
ocamlfind ocamlc -c -thread -package str -package core -package core_bench.inline_benchmarks -o runner.cmo runner.ml
+ ocamlfind ocamlc -c -thread -package str -package core -package core_bench.inline_benchmarks -o runner.cmo runner.ml
File "runner.ml", line 1, characters 5-13:
Error: Unbound module Core.Std
Command exited with code 2.
Makefile:4: recipe for target 'all' failed
make: *** [all] Error 10
make: Leaving directory '/home/louis/.opam/4.07.1+clambda+bench/.opam-switch/build/core-micro-bench.1.0/core_micro'
Close

Error on core-micro-bench.1.0 (4.03.1+bench)

Command:

/usr/bin/make -C core_micro

Output

make: Entering directory '/home/louis/.opam/4.03.1+bench/.opam-switch/build/core-micro-bench.1.0/core_micro'
ocamlbuild -use-ocamlfind runner.native
ocamlfind ocamldep -package str -package core -package core_bench.inline_benchmarks -modules runner.ml > runner.ml.depends
ocamlfind ocamlc -c -thread -package str -package core -package core_bench.inline_benchmarks -o runner.cmo runner.ml
+ ocamlfind ocamlc -c -thread -package str -package core -package core_bench.inline_benchmarks -o runner.cmo runner.ml
File "runner.ml", line 1, characters 5-13:
Warning 3: deprecated: module Core.Std
[since 2017-02] Use Core. The Std sub-module is no longer needed
File "runner.ml", line 3, characters 15-55:
Error: Unbound module Pa_bench_lib
Command exited with code 2.
Makefile:4: recipe for target 'all' failed
make: *** [all] Error 10
make: Leaving directory '/home/louis/.opam/4.03.1+bench/.opam-switch/build/core-micro-bench.1.0/core_micro'
Close

Error on conf-graphviz.0.1 (4.07.1+oclassic+bench)

Command:

/usr/bin/which dot

Output


Close

Error on conf-graphviz.0.1 (4.07.1+flambda+bench)

Command:

/usr/bin/which dot

Output


Close

Error on conf-graphviz.0.1 (4.07.1+clambda+bench)

Command:

/usr/bin/which dot

Output


Close

Error on conf-graphviz.0.1 (4.06.1+flambda+opt+bench)

Command:

/usr/bin/which dot

Output


Close

Error on conf-graphviz.0.1 (4.06.1+flambda+bench)

Command:

/usr/bin/which dot

Output


Close

Error on conf-graphviz.0.1 (4.03.1+bench)

Command:

/usr/bin/which dot

Output


Close

Error on cohttp-bench.1.0 (4.07.1+oclassic+bench)

Command:

/usr/bin/make -C cohttp

Output

make: Entering directory '/home/louis/.opam/4.07.1+oclassic+bench/.opam-switch/build/cohttp-bench.1.0/cohttp'
ocamlbuild -use-ocamlfind cohttp_lwt_bench.native cohttp_async_bench.native
ocamlfind ocamldep -package lwt.unix -package cohttp.lwt -modules cohttp_lwt_bench.ml > cohttp_lwt_bench.ml.depends
+ ocamlfind ocamldep -package lwt.unix -package cohttp.lwt -modules cohttp_lwt_bench.ml > cohttp_lwt_bench.ml.depends
ocamlfind: Package `cohttp.lwt' not found
Command exited with code 2.
Makefile:6: recipe for target 'all' failed
make: *** [all] Error 10
make: Leaving directory '/home/louis/.opam/4.07.1+oclassic+bench/.opam-switch/build/cohttp-bench.1.0/cohttp'
Close

Error on cohttp-bench.1.0 (4.07.1+flambda+bench)

Command:

/usr/bin/make -C cohttp

Output

make: Entering directory '/home/louis/.opam/4.07.1+flambda+bench/.opam-switch/build/cohttp-bench.1.0/cohttp'
ocamlbuild -use-ocamlfind cohttp_lwt_bench.native cohttp_async_bench.native
ocamlfind ocamldep -package lwt.unix -package cohttp.lwt -modules cohttp_lwt_bench.ml > cohttp_lwt_bench.ml.depends
+ ocamlfind ocamldep -package lwt.unix -package cohttp.lwt -modules cohttp_lwt_bench.ml > cohttp_lwt_bench.ml.depends
ocamlfind: Package `cohttp.lwt' not found
Command exited with code 2.
Makefile:6: recipe for target 'all' failed
make: *** [all] Error 10
make: Leaving directory '/home/louis/.opam/4.07.1+flambda+bench/.opam-switch/build/cohttp-bench.1.0/cohttp'
Close

Error on cohttp-bench.1.0 (4.07.1+clambda+bench)

Command:

/usr/bin/make -C cohttp

Output

make: Entering directory '/home/louis/.opam/4.07.1+clambda+bench/.opam-switch/build/cohttp-bench.1.0/cohttp'
ocamlbuild -use-ocamlfind cohttp_lwt_bench.native cohttp_async_bench.native
ocamlfind ocamldep -package lwt.unix -package cohttp.lwt -modules cohttp_lwt_bench.ml > cohttp_lwt_bench.ml.depends
+ ocamlfind ocamldep -package lwt.unix -package cohttp.lwt -modules cohttp_lwt_bench.ml > cohttp_lwt_bench.ml.depends
ocamlfind: Package `cohttp.lwt' not found
Command exited with code 2.
Makefile:6: recipe for target 'all' failed
make: *** [all] Error 10
make: Leaving directory '/home/louis/.opam/4.07.1+clambda+bench/.opam-switch/build/cohttp-bench.1.0/cohttp'
Close

Error on cohttp-bench.1.0 (4.03.1+bench)

Command:

/usr/bin/make -C cohttp

Output

make: Entering directory '/home/louis/.opam/4.03.1+bench/.opam-switch/build/cohttp-bench.1.0/cohttp'
ocamlbuild -use-ocamlfind cohttp_lwt_bench.native cohttp_async_bench.native
ocamlfind ocamldep -package lwt.unix -package cohttp.lwt -modules cohttp_lwt_bench.ml > cohttp_lwt_bench.ml.depends
+ ocamlfind ocamldep -package lwt.unix -package cohttp.lwt -modules cohttp_lwt_bench.ml > cohttp_lwt_bench.ml.depends
ocamlfind: Package `cohttp-lwt-unix' not found - required by `cohttp.lwt'
Command exited with code 2.
Makefile:6: recipe for target 'all' failed
make: *** [all] Error 10
make: Leaving directory '/home/louis/.opam/4.03.1+bench/.opam-switch/build/cohttp-bench.1.0/cohttp'
Close

Error on chameneos-bench.1.0 (4.07.1+oclassic+bench)

Command:

/usr/bin/make -C chameneos-redux

Output

make: Entering directory '/home/louis/.opam/4.07.1+oclassic+bench/.opam-switch/build/chameneos-bench.1.0/chameneos-redux'
ocamlopt -bin-annot -thread unix.cmxa threads.cmxa chameneos_redux_th.ml -o chameneos_redux_th
ocamlopt -bin-annot -thread unix.cmxa threads.cmxa chameneos_redux_evtchn.ml -o chameneos_redux_evtchn
ocamlfind ocamlopt -bin-annot -package lwt.unix -linkpkg chameneos_redux_lwt.ml -o chameneos_redux_lwt
ocamlfind: [WARNING] Package `threads': Linking problems may arise because of the missing -thread or -vmthread switch
ocamlfind ocamlopt -bin-annot  -thread -package async -linkpkg chameneos_redux_async.ml -o chameneos_redux_async
File "chameneos_redux_async.ml", line 7, characters 5-13:
Error: Unbound module Core.Std
Makefile:9: recipe for target 'chameneos_redux_async' failed
make: *** [chameneos_redux_async] Error 2
make: Leaving directory '/home/louis/.opam/4.07.1+oclassic+bench/.opam-switch/build/chameneos-bench.1.0/chameneos-redux'
Close

Error on chameneos-bench.1.0 (4.07.1+flambda+bench)

Command:

/usr/bin/make -C chameneos-redux

Output

make: Entering directory '/home/louis/.opam/4.07.1+flambda+bench/.opam-switch/build/chameneos-bench.1.0/chameneos-redux'
ocamlopt -bin-annot -thread unix.cmxa threads.cmxa chameneos_redux_th.ml -o chameneos_redux_th
ocamlopt -bin-annot -thread unix.cmxa threads.cmxa chameneos_redux_evtchn.ml -o chameneos_redux_evtchn
ocamlfind ocamlopt -bin-annot -package lwt.unix -linkpkg chameneos_redux_lwt.ml -o chameneos_redux_lwt
ocamlfind: [WARNING] Package `threads': Linking problems may arise because of the missing -thread or -vmthread switch
ocamlfind ocamlopt -bin-annot  -thread -package async -linkpkg chameneos_redux_async.ml -o chameneos_redux_async
File "chameneos_redux_async.ml", line 7, characters 5-13:
Error: Unbound module Core.Std
Makefile:9: recipe for target 'chameneos_redux_async' failed
make: *** [chameneos_redux_async] Error 2
make: Leaving directory '/home/louis/.opam/4.07.1+flambda+bench/.opam-switch/build/chameneos-bench.1.0/chameneos-redux'
Close

Error on chameneos-bench.1.0 (4.07.1+clambda+bench)

Command:

/usr/bin/make -C chameneos-redux

Output

make: Entering directory '/home/louis/.opam/4.07.1+clambda+bench/.opam-switch/build/chameneos-bench.1.0/chameneos-redux'
ocamlopt -bin-annot -thread unix.cmxa threads.cmxa chameneos_redux_th.ml -o chameneos_redux_th
ocamlopt -bin-annot -thread unix.cmxa threads.cmxa chameneos_redux_evtchn.ml -o chameneos_redux_evtchn
ocamlfind ocamlopt -bin-annot -package lwt.unix -linkpkg chameneos_redux_lwt.ml -o chameneos_redux_lwt
ocamlfind: [WARNING] Package `threads': Linking problems may arise because of the missing -thread or -vmthread switch
ocamlfind ocamlopt -bin-annot  -thread -package async -linkpkg chameneos_redux_async.ml -o chameneos_redux_async
File "chameneos_redux_async.ml", line 7, characters 5-13:
Error: Unbound module Core.Std
Makefile:9: recipe for target 'chameneos_redux_async' failed
make: *** [chameneos_redux_async] Error 2
make: Leaving directory '/home/louis/.opam/4.07.1+clambda+bench/.opam-switch/build/chameneos-bench.1.0/chameneos-redux'
Close

Error on chameneos-bench.1.0 (4.03.1+bench)

Command:

/usr/bin/make -C chameneos-redux

Output

make: Entering directory '/home/louis/.opam/4.03.1+bench/.opam-switch/build/chameneos-bench.1.0/chameneos-redux'
ocamlopt -bin-annot -thread unix.cmxa threads.cmxa chameneos_redux_th.ml -o chameneos_redux_th
ocamlopt -bin-annot -thread unix.cmxa threads.cmxa chameneos_redux_evtchn.ml -o chameneos_redux_evtchn
ocamlfind ocamlopt -bin-annot -package lwt.unix -linkpkg chameneos_redux_lwt.ml -o chameneos_redux_lwt
ocamlfind: [WARNING] Package `threads': Linking problems may arise because of the missing -thread or -vmthread switch
ocamlfind ocamlopt -bin-annot  -thread -package async -linkpkg chameneos_redux_async.ml -o chameneos_redux_async
File "chameneos_redux_async.ml", line 7, characters 5-13:
Warning 3: deprecated: module Core.Std
[since 2017-02] Use Core. The Std sub-module is no longer needed
File "chameneos_redux_async.ml", line 8, characters 5-14:
Warning 3: deprecated: module Async.Std
[since 2017-02] use Async. The Std sub-module is no longer needed
File "chameneos_redux_async.ml", line 128, characters 10-16:
Error: This expression has type
         [> `Probably_should_not_use_blocking_Core_Printf_functions_with_Async ]
       This is not a function; it cannot be applied.
Makefile:9: recipe for target 'chameneos_redux_async' failed
make: *** [chameneos_redux_async] Error 2
make: Leaving directory '/home/louis/.opam/4.03.1+bench/.opam-switch/build/chameneos-bench.1.0/chameneos-redux'
Close

Error on camlimages.5.0.1 (4.08.0+trunk+bench)

Command:

~/.opam/4.08.0+trunk+bench/bin/jbuilder build -p camlimages -j 7

Output

The jbuilder binary is deprecated and will cease to be maintained in July 2019.
Please switch to dune instead.
File "jbuild", line 1, characters 0-0:
Warning: jbuild files are deprecated, please convert this file to a dune file
instead.
Note: You can use "dune upgrade" to convert your project to dune.
File "config/jbuild", line 1, characters 0-0:
Warning: jbuild files are deprecated, please convert this file to a dune file
instead.
Note: You can use "dune upgrade" to convert your project to dune.
File "core/jbuild", line 1, characters 0-0:
Warning: jbuild files are deprecated, please convert this file to a dune file
instead.
Note: You can use "dune upgrade" to convert your project to dune.
File "examples/converter/jbuild", line 1, characters 0-0:
Warning: jbuild files are deprecated, please convert this file to a dune file
instead.
Note: You can use "dune upgrade" to convert your project to dune.
File "examples/crop/jbuild", line 1, characters 0-0:
Warning: jbuild files are deprecated, please convert this file to a dune file
instead.
Note: You can use "dune upgrade" to convert your project to dune.
File "examples/edgedetect/jbuild", line 1, characters 0-0:
Warning: jbuild files are deprecated, please convert this file to a dune file
instead.
Note: You can use "dune upgrade" to convert your project to dune.
File "examples/gifanim/jbuild", line 1, characters 0-0:
Warning: jbuild files are deprecated, please convert this file to a dune file
instead.
Note: You can use "dune upgrade" to convert your project to dune.
File "examples/imgstat/jbuild", line 1, characters 0-0:
Warning: jbuild files are deprecated, please convert this file to a dune file
instead.
Note: You can use "dune upgrade" to convert your project to dune.
File "examples/liv/jbuild", line 1, characters 0-0:
Warning: jbuild files are deprecated, please convert this file to a dune file
instead.
Note: You can use "dune upgrade" to convert your project to dune.
File "examples/monochrome/jbuild", line 1, characters 0-0:
Warning: jbuild files are deprecated, please convert this file to a dune file
instead.
Note: You can use "dune upgrade" to convert your project to dune.
File "examples/normalize/jbuild", line 1, characters 0-0:
Warning: jbuild files are deprecated, please convert this file to a dune file
instead.
Note: You can use "dune upgrade" to convert your project to dune.
File "examples/resize/jbuild", line 1, characters 0-0:
Warning: jbuild files are deprecated, please convert this file to a dune file
instead.
Note: You can use "dune upgrade" to convert your project to dune.
File "examples/tiffps/jbuild", line 1, characters 0-0:
Warning: jbuild files are deprecated, please convert this file to a dune file
instead.
Note: You can use "dune upgrade" to convert your project to dune.
File "examples/ttfimg/jbuild", line 1, characters 0-0:
Warning: jbuild files are deprecated, please convert this file to a dune file
instead.
Note: You can use "dune upgrade" to convert your project to dune.
File "exif/jbuild", line 1, characters 0-0:
Warning: jbuild files are deprecated, please convert this file to a dune file
instead.
Note: You can use "dune upgrade" to convert your project to dune.
File "freetype/jbuild", line 1, characters 0-0:
Warning: jbuild files are deprecated, please convert this file to a dune file
instead.
Note: You can use "dune upgrade" to convert your project to dune.
File "gif/jbuild", line 1, characters 0-0:
Warning: jbuild files are deprecated, please convert this file to a dune file
instead.
Note: You can use "dune upgrade" to convert your project to dune.
File "graphics/jbuild", line 1, characters 0-0:
Warning: jbuild files are deprecated, please convert this file to a dune file
instead.
Note: You can use "dune upgrade" to convert your project to dune.
File "include/jbuild", line 1, characters 0-0:
Warning: jbuild files are deprecated, please convert this file to a dune file
instead.
Note: You can use "dune upgrade" to convert your project to dune.
File "jpeg/jbuild", line 1, characters 0-0:
Warning: jbuild files are deprecated, please convert this file to a dune file
instead.
Note: You can use "dune upgrade" to convert your project to dune.
File "lablgtk2/jbuild", line 1, characters 0-0:
Warning: jbuild files are deprecated, please convert this file to a dune file
instead.
Note: You can use "dune upgrade" to convert your project to dune.
File "png/jbuild", line 1, characters 0-0:
Warning: jbuild files are deprecated, please convert this file to a dune file
instead.
Note: You can use "dune upgrade" to convert your project to dune.
File "test/jbuild", line 1, characters 0-0:
Warning: jbuild files are deprecated, please convert this file to a dune file
instead.
Note: You can use "dune upgrade" to convert your project to dune.
File "tiff/jbuild", line 1, characters 0-0:
Warning: jbuild files are deprecated, please convert this file to a dune file
instead.
Note: You can use "dune upgrade" to convert your project to dune.
File "xpm/jbuild", line 1, characters 0-0:
Warning: jbuild files are deprecated, please convert this file to a dune file
instead.
Note: You can use "dune upgrade" to convert your project to dune.
       ocaml (internal)
ocamlfind: Package `graphics' not found
    ocamlopt config/.ciconfig.eobjs/native/xConfigurator.{cmx,o}
File "config/xConfigurator.ml", line 23, characters 16-25:
23 |     | exception Not_found -> []
                     ^^^^^^^^^
Alert deprecated: Not_found
[2016-09] this element comes from the stdlib distributed with OCaml.
Instead of raising [Not_found], consider using [raise_s] with an informative error
message.  If code needs to distinguish [Not_found] from other exceptions, please change
it to handle both [Not_found] and [Not_found_s].  Then, instead of raising [Not_found],
raise [Not_found_s] with an informative error message.
    ocamlopt config/ciconfig.exe (exit 2)
(cd _build/default && /home/louis/.opam/4.08.0+trunk+bench/bin/ocamlopt.opt -w -40 -w -6 -g -o config/ciconfig.exe -I /home/louis/.opam/4.08.0+trunk+bench/lib/base -I /home/louis/.opam/4.08.0+trunk+bench/lib/base/caml -I /home/louis/.opam/4.08.0+trunk+bench/lib/base/shadow_stdlib -I /home/louis/.opam/4.08.0+trunk+bench/lib/configurator -I /home/louis/.opam/4.08.0+trunk+bench/lib/findlib -I /home/louis/.opam/4.08.0+trunk+bench/lib/sexplib0 -I /home/louis/.opam/4.08.0+trunk+bench/lib/stdio /home/louis/.opam/4.08.0+trunk+bench/lib/base/caml/caml.cmxa /home/louis/.opam/4.08.0+trunk+bench/lib/sexplib0/sexplib0.cmxa /home/louis/.opam/4.08.0+trunk+bench/lib/base/shadow_stdlib/shadow_stdlib.cmxa /home/louis/.opam/4.08.0+trunk+bench/lib/base/base.cmxa /home/louis/.opam/4.08.0+trunk+bench/lib/stdio/stdio.cmxa /home/louis/.opam/4.08.0+trunk+bench/lib/ocaml/unix.cmxa /home/louis/.opam/4.08.0+trunk+bench/lib/configurator/configurator.cmxa /home/louis/.opam/4.08.0+trunk+bench/lib/findlib/findlib.cmxa config/.ciconfig.eobjs/native/xConfigurator.cmx config/.ciconfig.eobjs/native/ciconfig.cmx)
/home/louis/.opam/4.08.0+trunk+bench/lib/base/libbase_stubs.a(exn_stubs.o): In function `Base_clear_caml_backtrace_pos':
/home/louis/.opam/4.08.0+trunk+bench/.opam-switch/build/base.v0.12.2/_build/default/src/exn_stubs.c:6: undefined reference to `caml_backtrace_pos'
collect2: error: ld returned 1 exit status
File "caml_startup", line 1:
Error: Error during linking
Close

Error on async-rpc-bench.1.0 (4.07.1+oclassic+bench)

Command:

/usr/bin/make -C async_rpc

Output

make: Entering directory '/home/louis/.opam/4.07.1+oclassic+bench/.opam-switch/build/async-rpc-bench.1.0/async_rpc'
ocamlfind ocamlopt -thread -syntax camlp4o -package async -package bin_prot.syntax -package core -c rpc_common.ml
ocamlfind: Package `bin_prot.syntax' not found
Makefile:12: recipe for target 'rpc_common.cmx' failed
make: *** [rpc_common.cmx] Error 2
make: Leaving directory '/home/louis/.opam/4.07.1+oclassic+bench/.opam-switch/build/async-rpc-bench.1.0/async_rpc'
Close

Error on async-rpc-bench.1.0 (4.07.1+flambda+bench)

Command:

/usr/bin/make -C async_rpc

Output

make: Entering directory '/home/louis/.opam/4.07.1+flambda+bench/.opam-switch/build/async-rpc-bench.1.0/async_rpc'
ocamlfind ocamlopt -thread -syntax camlp4o -package async -package bin_prot.syntax -package core -c rpc_common.ml
ocamlfind: Package `bin_prot.syntax' not found
Makefile:12: recipe for target 'rpc_common.cmx' failed
make: *** [rpc_common.cmx] Error 2
make: Leaving directory '/home/louis/.opam/4.07.1+flambda+bench/.opam-switch/build/async-rpc-bench.1.0/async_rpc'
Close

Error on async-rpc-bench.1.0 (4.07.1+clambda+bench)

Command:

/usr/bin/make -C async_rpc

Output

make: Entering directory '/home/louis/.opam/4.07.1+clambda+bench/.opam-switch/build/async-rpc-bench.1.0/async_rpc'
ocamlfind ocamlopt -thread -syntax camlp4o -package async -package bin_prot.syntax -package core -c rpc_common.ml
ocamlfind: Package `bin_prot.syntax' not found
Makefile:12: recipe for target 'rpc_common.cmx' failed
make: *** [rpc_common.cmx] Error 2
make: Leaving directory '/home/louis/.opam/4.07.1+clambda+bench/.opam-switch/build/async-rpc-bench.1.0/async_rpc'
Close

Error on async-rpc-bench.1.0 (4.03.1+bench)

Command:

/usr/bin/make -C async_rpc

Output

make: Entering directory '/home/louis/.opam/4.03.1+bench/.opam-switch/build/async-rpc-bench.1.0/async_rpc'
ocamlfind ocamlopt -thread -syntax camlp4o -package async -package bin_prot.syntax -package core -c rpc_common.ml
ocamlfind: Package `bin_prot.syntax' not found
Makefile:12: recipe for target 'rpc_common.cmx' failed
make: *** [rpc_common.cmx] Error 2
make: Leaving directory '/home/louis/.opam/4.03.1+bench/.opam-switch/build/async-rpc-bench.1.0/async_rpc'
Close

Error on async-echo-bench.1.0 (4.07.1+oclassic+bench)

Command:

/usr/bin/make -C async_echo

Output

make: Entering directory '/home/louis/.opam/4.07.1+oclassic+bench/.opam-switch/build/async-echo-bench.1.0/async_echo'
ocamlfind ocamlopt -thread -syntax camlp4o -package async -package bin_prot.syntax -package core -c echo_common.ml
ocamlfind: Package `bin_prot.syntax' not found
Makefile:20: recipe for target 'echo_common.cmx' failed
make: *** [echo_common.cmx] Error 2
make: Leaving directory '/home/louis/.opam/4.07.1+oclassic+bench/.opam-switch/build/async-echo-bench.1.0/async_echo'
Close

Error on async-echo-bench.1.0 (4.07.1+flambda+bench)

Command:

/usr/bin/make -C async_echo

Output

make: Entering directory '/home/louis/.opam/4.07.1+flambda+bench/.opam-switch/build/async-echo-bench.1.0/async_echo'
ocamlfind ocamlopt -thread -syntax camlp4o -package async -package bin_prot.syntax -package core -c echo_common.ml
ocamlfind: Package `bin_prot.syntax' not found
Makefile:20: recipe for target 'echo_common.cmx' failed
make: *** [echo_common.cmx] Error 2
make: Leaving directory '/home/louis/.opam/4.07.1+flambda+bench/.opam-switch/build/async-echo-bench.1.0/async_echo'
Close

Error on async-echo-bench.1.0 (4.07.1+clambda+bench)

Command:

/usr/bin/make -C async_echo

Output

make: Entering directory '/home/louis/.opam/4.07.1+clambda+bench/.opam-switch/build/async-echo-bench.1.0/async_echo'
ocamlfind ocamlopt -thread -syntax camlp4o -package async -package bin_prot.syntax -package core -c echo_common.ml
ocamlfind: Package `bin_prot.syntax' not found
Makefile:20: recipe for target 'echo_common.cmx' failed
make: *** [echo_common.cmx] Error 2
make: Leaving directory '/home/louis/.opam/4.07.1+clambda+bench/.opam-switch/build/async-echo-bench.1.0/async_echo'
Close

Error on async-echo-bench.1.0 (4.03.1+bench)

Command:

/usr/bin/make -C async_echo

Output

make: Entering directory '/home/louis/.opam/4.03.1+bench/.opam-switch/build/async-echo-bench.1.0/async_echo'
ocamlfind ocamlopt -thread -syntax camlp4o -package async -package bin_prot.syntax -package core -c echo_common.ml
ocamlfind: Package `bin_prot.syntax' not found
Makefile:20: recipe for target 'echo_common.cmx' failed
make: *** [echo_common.cmx] Error 2
make: Leaving directory '/home/louis/.opam/4.03.1+bench/.opam-switch/build/async-echo-bench.1.0/async_echo'