Package4.03.1+bench4.05.0+flambda+opt+bench4.06.1+flambda+bench4.06.1+flambda+opt+bench4.07.1+clambda+bench4.07.1+flambda+bench4.07.1+oclassic+bench4.08.0+gpr2165+bench4.08.0+mutmatch+bench4.08.0+trunk+bench4.08.0+trunk+flambda+bench4.08.0+trunk+flambda+oclassic+bench4.08.0+trunk+flambda+opt+bench4.03.1+bench time (s)4.05.0+flambda+opt+bench time (s)4.06.1+flambda+bench time (s)4.06.1+flambda+opt+bench time (s)4.07.1+clambda+bench time (s)4.07.1+flambda+bench time (s)4.07.1+oclassic+bench time (s)4.08.0+gpr2165+bench time (s)4.08.0+mutmatch+bench time (s)4.08.0+trunk+bench time (s)4.08.0+trunk+flambda+bench time (s)4.08.0+trunk+flambda+oclassic+bench time (s)4.08.0+trunk+flambda+opt+bench time (s)
almabench-bench.1.0-----------Aborted------------0.000-
alt-ergo.2.3.0----OKOKOK----Aborted-----19.44512.4512.401----0.000-
alt-ergo-lib.2.3.0----OKOKOK----Aborted-----23.35530.54125.664----0.000-
alt-ergo-parsers.2.3.0----OKOKOK----Aborted-----12.72016.18014.515----0.000-
async.v0.12.0----OKOKOK----------1.8203.5042.295------
async.v0.13.0-------Aborted-Aborted-Aborted--------0.000-0.000-0.000-
async.v0.9.0OK------------0.897------------
async-echo-bench.1.0Failure (2)---Failure (2)Failure (2)Failure (2)Aborted-Aborted-Aborted-0.668---0.5900.5531.9210.000-0.000-0.000-
async-rpc-bench.1.0Failure (2)---Failure (2)Failure (2)Failure (2)Aborted-Aborted-Aborted-0.585---0.5140.4721.8370.000-0.000-0.000-
async_extra.v0.12.0----OKOKOK----------5.1604.6294.620------
async_extra.v0.9.0OK------------7.551------------
async_kernel.v0.12.0----OKOKOK----------13.42820.34816.704------
async_kernel.v0.13.0-------Aborted-Aborted-Aborted--------0.000-0.000-0.000-
async_kernel.v0.9.0OK------------11.440------------
async_rpc_kernel.v0.12.0----OKOKOK----------10.75112.25810.229------
async_rpc_kernel.v0.13.0-------Aborted-Aborted-Aborted--------0.000-0.000-0.000-
async_rpc_kernel.v0.9.0OK------------8.671------------
async_unix.v0.12.0----OKOKOK----------13.54218.73617.426------
async_unix.v0.13.0-------Aborted-Aborted-Aborted--------0.000-0.000-0.000-
async_unix.v0.9.0OK------------11.529------------
base.v0.12.2----OKOKOK----------6.8918.7248.243------
base.v0.13.0-------Aborted-Failure (1)-Aborted--------0.000-6.874-0.000-
base-bytes.base-----------Aborted------------0.000-
base64.2.3.0OK------------0.993------------
base64.3.2.0----OKOKOKAborted-OK-Aborted-----0.7980.8730.9160.000-0.868-0.000-
base_bigstring.v0.12.0----OKOKOK----------1.1784.0062.063------
base_bigstring.v0.13.0-------Aborted-Aborted-Aborted--------0.000-0.000-0.000-
base_quickcheck.v0.12.1----OKOKOK----------5.2209.3653.714------
base_quickcheck.v0.13.0-------Aborted-Aborted-Aborted--------0.000-0.000-0.000-
bdd-bench.1.0-----------Aborted------------0.000-
bin_prot.v0.12.0----OKOKOK----------6.6029.20017.866------
bin_prot.v0.13.0-------Aborted-Aborted-Aborted--------0.000-0.000-0.000-
bin_prot.v0.9.1OK------------5.796------------
biniou.1.2.1OK---OKOKOKAborted-OK-Aborted-11.202---25.47731.75527.5680.000-13.782-0.000-
camlimages.5.0.1-------Aborted-Aborted-Aborted--------0.000-0.000-0.000-
camlpdf.2.3-----------Aborted------------0.000-
camlzip.1.09-----------Aborted------------0.000-
chameneos-bench.1.0Failure (2)---Failure (2)Failure (2)Failure (2)Aborted-Aborted-Aborted-0.638---0.4440.4791.7570.000-0.000-0.000-
cohttp.1.1.1OK------------3.030------------
cohttp.2.4.0----OKOKOK----------4.8375.32612.354------
cohttp.2.5.0-------Aborted-Aborted-Aborted--------0.000-0.000-0.000-
cohttp-bench.1.0Failure (2)---Failure (2)Failure (2)Failure (2)Aborted-Aborted-Aborted-0.368---0.3260.3001.6450.000-0.000-0.000-
conf-graphviz.0.1Failure (1)---Failure (1)Failure (1)Failure (1)------0.267---0.1670.1780.175------
configurator.v0.11.0----OKOKOKAborted-Aborted-Aborted-----6.5675.63812.2410.000-0.000-0.000-
configurator.v0.9.1OK------------14.257------------
core.v0.12.4----OKOKOK----------28.05234.63228.852------
core.v0.13.0-------Aborted-Aborted-Aborted--------0.000-0.000-0.000-
core.v0.9.1OK------------26.323------------
core-micro-bench.1.0Failure (2)---Failure (2)Failure (2)Failure (2)Aborted-Aborted-Aborted-1.325---1.7865.2765.1130.000-0.000-0.000-
core-sequence-bench.1.0OK---OKOKOKAborted-Aborted-Aborted-0.068---0.0600.0580.0600.000-0.000-0.000-
core_bench.v0.12.0----OKOKOK----------8.9794.8417.095------
core_bench.v0.13.0-------Aborted-Aborted-Aborted--------0.000-0.000-0.000-
core_bench.v0.9.0OK------------3.567------------
core_extended.v0.12.0----OKOKOK----------6.6256.9826.757------
core_extended.v0.9.0OK------------21.108------------
core_kernel.v0.12.3----OKOKOK----------36.03862.40640.330------
core_kernel.v0.13.0-------Aborted-Aborted-Aborted--------0.000-0.000-0.000-
core_kernel.v0.9.0OK------------30.210------------
cpdf.2.3-----------Aborted------------0.000-
cpdf-bench.1.0-----------Aborted------------0.000-
cppo.1.6.6OK---OKOKOKAborted-OK-Aborted-0.627---1.0022.0801.6120.000-1.191-0.000-
dune.2.0.1OK---OKOKOKFailure (2)-OK-Aborted-9.791---12.18717.79014.5580.451-10.395-0.000-
dune-configurator.1.11.4OK------------4.222------------
dune-configurator.2.0.1----OKOKOKAborted-OK-Aborted-----16.44617.34518.0250.000-4.721-0.000-
dune-private-libs.2.0.1----OKOKOKAborted-OK-Aborted-----11.50815.50913.3400.000-7.318-0.000-
easy-format.1.3.2OK---OKOKOKAborted-OK-Aborted-0.230---0.3700.4880.4150.000-0.333-0.000-
expect_test_helpers.v0.12.0----OKOKOK----------1.8012.2282.932------
expect_test_helpers_kernel.v0.12.0----OKOKOK----------9.06310.19810.942------
fieldslib.v0.12.0----OKOKOK----------0.6171.2360.327------
fieldslib.v0.13.0-------Aborted-Aborted-Aborted--------0.000-0.000-0.000-
fieldslib.v0.9.0OK------------1.252------------
frama-c.19.1OK------------78.272------------
frama-c.20.0----OKOKOK----------85.624166.019112.155------
frama-c-bench.1.0OK---OKOKOK------0.441---0.2720.1960.351------
jane-street-headers.v0.12.0----OKOKOK----------0.2320.2490.254------
jane-street-headers.v0.13.0-------Aborted-OK-Aborted--------0.000-0.177-0.000-
jbuilder.1.0+beta20.2-----------Aborted------------0.000-
json-bench-data.1.0-----------Aborted------------0.000-
jsonm.1.0.1-----------Aborted------------0.000-
jsonm-bench.1.0-----------Aborted------------0.000-
jst-config.v0.12.0----OKOKOK----------6.93710.20118.188------
jst-config.v0.13.0-------Aborted-Aborted-Aborted--------0.000-0.000-0.000-
kb-bench.1.0-----------Aborted------------0.000-
lexifi-g2pp-bench.1.0-----------Aborted------------0.000-
lwt.5.1.0OK---OKOKOKAborted-OK-Aborted-3.886---14.28916.72616.4490.000-4.742-0.000-
menhir.20190924-----------Aborted------------0.000-
menhir-bench.1.0-----------Aborted------------0.000-
minilight.1.6-----------Aborted------------0.000-
minilight-bench.1.0-----------Aborted------------0.000-
mmap.1.1.0OK---OKOKOKAborted-OK-Aborted-0.293---0.3620.4790.3980.000-0.427-0.000-
nbcodec.1.0-----------Aborted------------0.000-
nbcodec-bench.1.0-----------Aborted------------0.000-
num.1.3-----------Aborted------------0.000-
numerical-analysis-bench.1.0-------Failure (2)-Failure (2)-Aborted--------6.759-8.114-0.000-
ocaml.4.08.0-----------Aborted------------0.000-
ocaml-compiler-libs.v0.12.1----OKOKOKAborted-OK-Aborted-----2.1053.8082.9340.000-3.678-0.000-
ocaml-migrate-parsetree.1.5.0OK---OKOKOKAborted-Failure (1)-Aborted-7.726---21.26624.46022.0490.000-12.008-0.000-
ocaml-variants.4.08.0+trunk+flambda+oclassic-----------Failure (1)------------0.252-
ocamlbuild.0.14.0-----------Aborted------------0.000-
ocamlfind.1.8.1-----------Aborted------------0.000-
ocplib-endian.0.8OK------------25.389------------
ocplib-endian.1.0----OKOKOKAborted-OK-Aborted-----36.44743.40039.9030.000-17.905-0.000-
ocplib-simplex.0.4-----------Aborted------------0.000-
octavius.1.2.2OK---OKOKOKAborted-OK-Aborted-2.039---4.5925.6764.9560.000-3.985-0.000-
parsexp.v0.12.0----OKOKOK----------3.4844.4813.987------
parsexp.v0.13.0-------Aborted-Aborted-Aborted--------0.000-0.000-0.000-
patdiff.v0.12.1----OKOKOK----------4.7437.6786.312------
patdiff.v0.13.0-------Aborted-Aborted-Aborted--------0.000-0.000-0.000-
patdiff.v0.9.0OK------------6.390------------
patdiff-bench.1.0OK---OKOKOKAborted-Aborted-Aborted-0.178---0.1650.1860.1860.000-0.000-0.000-
patience_diff.v0.12.0----OKOKOK----------6.1687.6037.724------
patience_diff.v0.13.0-------Aborted-Aborted-Aborted--------0.000-0.000-0.000-
patience_diff.v0.9.0OK------------1.944------------
pcre.7.4.1----OKOKOK----------4.2315.2755.004------
pcre.7.4.3-------Aborted-Aborted-Aborted--------0.000-0.000-0.000-
ppx_assert.v0.12.0----OKOKOK----------7.3447.12911.127------
ppx_assert.v0.13.0-------Aborted-Aborted-Aborted--------0.000-0.000-0.000-
ppx_assert.v0.9.0OK------------4.007------------
ppx_ast.v0.9.1OK------------3.380------------
ppx_base.v0.12.0----OKOKOK----------14.60514.0234.880------
ppx_base.v0.13.0-------Aborted-Aborted-Aborted--------0.000-0.000-0.000-
ppx_base.v0.9.0OK------------4.252------------
ppx_bench.v0.12.0----OKOKOK----------8.0675.1876.845------
ppx_bench.v0.13.0-------Aborted-Aborted-Aborted--------0.000-0.000-0.000-
ppx_bench.v0.9.1OK------------4.508------------
ppx_bin_prot.v0.12.1----OKOKOK----------8.6925.9474.977------
ppx_bin_prot.v0.13.0-------Aborted-Aborted-Aborted--------0.000-0.000-0.000-
ppx_bin_prot.v0.9.0OK------------6.568------------
ppx_cold.v0.13.0-------Aborted-Aborted-Aborted--------0.000-0.000-0.000-
ppx_compare.v0.12.0----OKOKOK----------3.7304.8263.328------
ppx_compare.v0.13.0-------Aborted-Aborted-Aborted--------0.000-0.000-0.000-
ppx_compare.v0.9.0OK------------2.816------------
ppx_core.v0.9.0OK------------4.120------------
ppx_custom_printf.v0.12.1----OKOKOK----------8.3427.86412.087------
ppx_custom_printf.v0.13.0-------Aborted-Aborted-Aborted--------0.000-0.000-0.000-
ppx_custom_printf.v0.9.0OK------------5.741------------
ppx_derivers.1.2.1OK---OKOKOKAborted-OK-Aborted-0.264---0.5170.7540.5830.000-0.465-0.000-
ppx_driver.v0.9.1OK------------1.653------------
ppx_enumerate.v0.12.0----OKOKOK----------3.3375.3452.901------
ppx_enumerate.v0.13.0-------Aborted-Aborted-Aborted--------0.000-0.000-0.000-
ppx_enumerate.v0.9.0OK------------2.867------------
ppx_expect.v0.12.0----OKOKOK----------10.47711.67821.402------
ppx_expect.v0.13.0-------Aborted-Aborted-Aborted--------0.000-0.000-0.000-
ppx_expect.v0.9.0OK------------9.965------------
ppx_fail.v0.12.0----OKOKOK----------11.8657.3849.078------
ppx_fail.v0.13.0-------Aborted-Aborted-Aborted--------0.000-0.000-0.000-
ppx_fail.v0.9.0OK------------4.761------------
ppx_fields_conv.v0.12.0----OKOKOK----------3.4245.3783.089------
ppx_fields_conv.v0.13.0-------Aborted-Aborted-Aborted--------0.000-0.000-0.000-
ppx_fields_conv.v0.9.0OK------------7.340------------
ppx_hash.v0.12.0----OKOKOK----------9.2119.29313.024------
ppx_hash.v0.13.0-------Aborted-Aborted-Aborted--------0.000-0.000-0.000-
ppx_hash.v0.9.0OK------------2.161------------
ppx_here.v0.12.0----OKOKOK----------2.6324.3832.672------
ppx_here.v0.13.0-------Aborted-Aborted-Aborted--------0.000-0.000-0.000-
ppx_here.v0.9.1OK------------2.113------------
ppx_inline_test.v0.12.0----OKOKOK----------5.0347.2804.786------
ppx_inline_test.v0.13.0-------Aborted-Aborted-Aborted--------0.000-0.000-0.000-
ppx_inline_test.v0.9.2OK------------5.601------------
ppx_jane.v0.12.0----OKOKOK----------2.0752.4281.586------
ppx_jane.v0.13.0-------Aborted-Aborted-Aborted--------0.000-0.000-0.000-
ppx_jane.v0.9.0OK------------2.304------------
ppx_js_style.v0.12.0----OKOKOK----------4.5537.6954.870------
ppx_js_style.v0.13.0-------Aborted-Aborted-Aborted--------0.000-0.000-0.000-
ppx_js_style.v0.9.0OK------------9.087------------
ppx_let.v0.12.0----OKOKOK----------2.8824.7773.016------
ppx_let.v0.13.0-------Aborted-Aborted-Aborted--------0.000-0.000-0.000-
ppx_let.v0.9.0OK------------3.243------------
ppx_metaquot.v0.9.0OK------------4.018------------
ppx_module_timer.v0.12.0----OKOKOK----------5.7769.7122.433------
ppx_module_timer.v0.13.0-------Aborted-Aborted-Aborted--------0.000-0.000-0.000-
ppx_optcomp.v0.12.0----OKOKOK----------2.9163.6942.117------
ppx_optcomp.v0.13.0-------Aborted-Aborted-Aborted--------0.000-0.000-0.000-
ppx_optcomp.v0.9.0OK------------0.946------------
ppx_optional.v0.12.0----OKOKOK----------2.8524.1752.447------
ppx_optional.v0.13.0-------Aborted-Aborted-Aborted--------0.000-0.000-0.000-
ppx_optional.v0.9.0OK------------2.706------------
ppx_pipebang.v0.12.0----OKOKOK----------9.18511.2316.419------
ppx_pipebang.v0.13.0-------Aborted-Aborted-Aborted--------0.000-0.000-0.000-
ppx_pipebang.v0.9.0OK------------9.748------------
ppx_sexp_conv.v0.12.0----OKOKOK----------11.84111.4747.016------
ppx_sexp_conv.v0.13.0-------Aborted-Aborted-Aborted--------0.000-0.000-0.000-
ppx_sexp_conv.v0.9.0OK------------8.096------------
ppx_sexp_message.v0.12.0----OKOKOK----------9.1719.31513.322------
ppx_sexp_message.v0.13.0-------Aborted-Aborted-Aborted--------0.000-0.000-0.000-
ppx_sexp_message.v0.9.0OK------------5.472------------
ppx_sexp_value.v0.12.0----OKOKOK----------11.30810.82515.954------
ppx_sexp_value.v0.13.0-------Aborted-Aborted-Aborted--------0.000-0.000-0.000-
ppx_sexp_value.v0.9.0OK------------5.789------------
ppx_stable.v0.12.0----OKOKOK----------19.03815.74013.591------
ppx_stable.v0.13.0-------Aborted-Aborted-Aborted--------0.000-0.000-0.000-
ppx_traverse.v0.9.0OK------------9.044------------
ppx_type_conv.v0.9.1OK------------10.638------------
ppx_typerep_conv.v0.12.0----OKOKOK----------18.74415.41713.526------
ppx_typerep_conv.v0.13.0-------Aborted-Aborted-Aborted--------0.000-0.000-0.000-
ppx_typerep_conv.v0.9.0OK------------8.945------------
ppx_variants_conv.v0.12.0----OKOKOK----------18.29214.61713.088------
ppx_variants_conv.v0.13.0-------Aborted-Aborted-Aborted--------0.000-0.000-0.000-
ppx_variants_conv.v0.9.0OK------------6.830------------
ppxlib.0.10.0-------Aborted-Aborted-Aborted--------0.000-0.000-0.000-
ppxlib.0.8.1----OKOKOK----------10.10016.58022.767------
protocol_version_header.v0.12.0----OKOKOK----------11.70111.8785.057------
protocol_version_header.v0.13.0-------Aborted-Aborted-Aborted--------0.000-0.000-0.000-
psmt2-frontend.0.2-----------Aborted------------0.000-
re.1.9.0OK---OKOKOKAborted-OK-Aborted-4.321---5.1876.0285.6170.000-14.048-0.000-
re2.v0.12.1----OKOKOK----------64.92565.88368.910------
re2.v0.9.0OK------------63.070------------
result.1.4OK---OKOKOKAborted-OK-Aborted-11.000---0.7931.7370.7830.000-0.744-0.000-
sauvola-bench.1.0-------Aborted-Aborted-Aborted--------0.000-0.000-0.000-
seq.0.2.2OK------------11.248------------
seq.base-----------Aborted------------0.000-
sequence-bench.1.0-----------Aborted------------0.000-
sexp_pretty.v0.12.0----OKOKOK----------4.7086.88817.570------
sexplib.v0.12.0----OKOKOK----------4.0263.6336.051------
sexplib.v0.13.0-------Aborted-Aborted-Aborted--------0.000-0.000-0.000-
sexplib0.v0.12.0----OKOKOK----------1.1492.3301.612------
sexplib0.v0.13.0-------Aborted-OK-Aborted--------0.000-0.963-0.000-
shell.v0.12.0----OKOKOK----------2.6584.2994.094------
spawn.v0.13.0----OKOKOKAborted-OK-Aborted-----0.9491.3381.0330.000-16.352-0.000-
splittable_random.v0.12.0----OKOKOK----------15.13013.55119.961------
splittable_random.v0.13.0-------Aborted-Aborted-Aborted--------0.000-0.000-0.000-
stdio.v0.12.0----OKOKOK----------4.7145.7375.533------
stdio.v0.13.0-------Aborted-Aborted-Aborted--------0.000-0.000-0.000-
stdlib-shims.0.1.0----OKOKOKAborted-OK-Aborted-----27.54232.79529.2830.000-0.683-0.000-
stringext.1.6.0OK---OKOKOKAborted-OK-Aborted-11.736---28.45233.84330.3890.000-15.911-0.000-
textutils.v0.12.0----OKOKOK----------9.0149.6084.698------
textutils.v0.13.0-------Aborted-Aborted-Aborted--------0.000-0.000-0.000-
textutils.v0.9.0OK------------5.396------------
textutils_kernel.v0.12.0----OKOKOK----------3.6515.15212.791------
thread-bench.1.0Failure (2)---Failure (2)Failure (2)Failure (2)Aborted-Aborted-Aborted-0.267---0.2060.2031.5150.000-0.000-0.000-
time_now.v0.12.0----OKOKOK----------2.8774.9268.623------
time_now.v0.13.0-------Aborted-Aborted-Aborted--------0.000-0.000-0.000-
topkg.1.0.1-----------Aborted------------0.000-
typerep.v0.12.0----OKOKOK----------5.3446.4696.670------
typerep.v0.13.0-------Aborted-Aborted-Aborted--------0.000-0.000-0.000-
uchar.0.0.2-----------Aborted------------0.000-
uri.1.9.7OK------------6.184------------
uri.3.1.0----OKOKOKAborted-OK-Aborted-----8.8469.71710.1100.000-2.695-0.000-
uri-sexp.3.1.0----OKOKOKAborted-Aborted-Aborted-----2.9893.3023.8310.000-0.000-0.000-
uutf.1.0.2-----------Aborted------------0.000-
valet-bench.1.0Failure (2)------------0.331------------
variantslib.v0.12.0----OKOKOK----------7.7708.39110.137------
variantslib.v0.13.0-------Aborted-Aborted-Aborted--------0.000-0.000-0.000-
variantslib.v0.9.0OK------------5.580------------
yojson.1.7.0OK---OKOKOKAborted-OK-Aborted-9.847---8.7559.82310.1060.000-2.621-0.000-
yojson-bench.1.0Failure (2)---Failure (2)Failure (2)Failure (2)Aborted-Failure (2)-Aborted-0.171---10.6942.8660.4930.000-0.394-0.000-
zarith.1.9.1-----------Aborted------------0.000-
Close

Error on yojson-bench.1.0 (4.08.0+trunk+bench)

Command:

/usr/bin/make -C yojson

Output

make: Entering directory '/home/louis/.opam/4.08.0+trunk+bench/.opam-switch/build/yojson-bench.1.0/yojson'
ocamlfind ocamlopt -I `ocamlfind query yojson` -o ydump_bench -package easy-format,biniou -linkpkg yojson.cmx yojson_biniou.cmx ydump.ml
gcc: error: /home/louis/.opam/4.08.0+trunk+bench/lib/yojson/yojson_biniou.o: No such file or directory
gcc: error: /home/louis/.opam/4.08.0+trunk+bench/lib/yojson/yojson.o: No such file or directory
File "caml_startup", line 1:
Error: Error during linking
Makefile:6: recipe for target 'all' failed
make: *** [all] Error 2
make: Leaving directory '/home/louis/.opam/4.08.0+trunk+bench/.opam-switch/build/yojson-bench.1.0/yojson'
Close

Error on yojson-bench.1.0 (4.07.1+oclassic+bench)

Command:

/usr/bin/make -C yojson

Output

make: Entering directory '/home/louis/.opam/4.07.1+oclassic+bench/.opam-switch/build/yojson-bench.1.0/yojson'
ocamlfind ocamlopt -I `ocamlfind query yojson` -o ydump_bench -package easy-format,biniou -linkpkg yojson.cmx yojson_biniou.cmx ydump.ml
gcc: error: /home/louis/.opam/4.07.1+oclassic+bench/lib/yojson/yojson_biniou.o: No such file or directory
gcc: error: /home/louis/.opam/4.07.1+oclassic+bench/lib/yojson/yojson.o: No such file or directory
File "caml_startup", line 1:
Error: Error during linking
Makefile:6: recipe for target 'all' failed
make: *** [all] Error 2
make: Leaving directory '/home/louis/.opam/4.07.1+oclassic+bench/.opam-switch/build/yojson-bench.1.0/yojson'
Close

Error on yojson-bench.1.0 (4.07.1+flambda+bench)

Command:

/usr/bin/make -C yojson

Output

make: Entering directory '/home/louis/.opam/4.07.1+flambda+bench/.opam-switch/build/yojson-bench.1.0/yojson'
ocamlfind ocamlopt -I `ocamlfind query yojson` -o ydump_bench -package easy-format,biniou -linkpkg yojson.cmx yojson_biniou.cmx ydump.ml
gcc: error: /home/louis/.opam/4.07.1+flambda+bench/lib/yojson/yojson_biniou.o: No such file or directory
gcc: error: /home/louis/.opam/4.07.1+flambda+bench/lib/yojson/yojson.o: No such file or directory
File "caml_startup", line 1:
Error: Error during linking
Makefile:6: recipe for target 'all' failed
make: *** [all] Error 2
make: Leaving directory '/home/louis/.opam/4.07.1+flambda+bench/.opam-switch/build/yojson-bench.1.0/yojson'
Close

Error on yojson-bench.1.0 (4.07.1+clambda+bench)

Command:

/usr/bin/make -C yojson

Output

make: Entering directory '/home/louis/.opam/4.07.1+clambda+bench/.opam-switch/build/yojson-bench.1.0/yojson'
ocamlfind ocamlopt -I `ocamlfind query yojson` -o ydump_bench -package easy-format,biniou -linkpkg yojson.cmx yojson_biniou.cmx ydump.ml
gcc: error: /home/louis/.opam/4.07.1+clambda+bench/lib/yojson/yojson_biniou.o: No such file or directory
gcc: error: /home/louis/.opam/4.07.1+clambda+bench/lib/yojson/yojson.o: No such file or directory
File "caml_startup", line 1:
Error: Error during linking
Makefile:6: recipe for target 'all' failed
make: *** [all] Error 2
make: Leaving directory '/home/louis/.opam/4.07.1+clambda+bench/.opam-switch/build/yojson-bench.1.0/yojson'
Close

Error on yojson-bench.1.0 (4.03.1+bench)

Command:

/usr/bin/make -C yojson

Output

make: Entering directory '/home/louis/.opam/4.03.1+bench/.opam-switch/build/yojson-bench.1.0/yojson'
ocamlfind ocamlopt -I `ocamlfind query yojson` -o ydump_bench -package easy-format,biniou -linkpkg yojson.cmx yojson_biniou.cmx ydump.ml
gcc: error: /home/louis/.opam/4.03.1+bench/lib/yojson/yojson_biniou.o: No such file or directory
gcc: error: /home/louis/.opam/4.03.1+bench/lib/yojson/yojson.o: No such file or directory
File "caml_startup", line 1:
Error: Error during linking
Makefile:6: recipe for target 'all' failed
make: *** [all] Error 2
make: Leaving directory '/home/louis/.opam/4.03.1+bench/.opam-switch/build/yojson-bench.1.0/yojson'
Close

Error on valet-bench.1.0 (4.03.1+bench)

Command:

/usr/bin/make -C valet

Output

make: Entering directory '/home/louis/.opam/4.03.1+bench/.opam-switch/build/valet-bench.1.0/valet'
ocamlbuild -use-ocamlfind test_lwt.native test_async.native
ocamlfind ocamldep -package react -package uuidm -package unix -package ocplib-endian -package lwt.unix -modules test_lwt.ml > test_lwt.ml.depends
ocamlfind ocamldep -package react -package uuidm -package ocplib-endian -modules test_lib.ml > test_lib.ml.depends
ocamlfind ocamldep -package uuidm -package unix -package ocplib-endian -modules valet_core.ml > valet_core.ml.depends
ocamlfind ocamldep -package react -package uuidm -package ocplib-endian -modules valet_react.ml > valet_react.ml.depends
ocamlfind ocamlc -c -g -bin-annot -package uuidm -package unix -package ocplib-endian -o valet_core.cmo valet_core.ml
ocamlfind ocamlc -c -g -bin-annot -package react -package uuidm -package ocplib-endian -o valet_react.cmo valet_react.ml
ocamlfind ocamlc -c -g -bin-annot -package react -package uuidm -package ocplib-endian -o test_lib.cmo test_lib.ml
ocamlfind ocamlc -c -g -bin-annot -package react -package uuidm -package unix -package ocplib-endian -package lwt.unix -o test_lwt.cmo test_lwt.ml
+ ocamlfind ocamlc -c -g -bin-annot -package react -package uuidm -package unix -package ocplib-endian -package lwt.unix -o test_lwt.cmo test_lwt.ml
ocamlfind: [WARNING] Package `threads': Linking problems may arise because of the missing -thread or -vmthread switch
ocamlfind ocamlopt -c -g -bin-annot -package uuidm -package unix -package ocplib-endian -o valet_core.cmx valet_core.ml
ocamlfind ocamlopt -c -g -bin-annot -package react -package uuidm -package ocplib-endian -o valet_react.cmx valet_react.ml
ocamlfind ocamlopt -c -g -bin-annot -package react -package uuidm -package ocplib-endian -o test_lib.cmx test_lib.ml
ocamlfind ocamlopt -c -g -bin-annot -package react -package uuidm -package unix -package ocplib-endian -package lwt.unix -o test_lwt.cmx test_lwt.ml
+ ocamlfind ocamlopt -c -g -bin-annot -package react -package uuidm -package unix -package ocplib-endian -package lwt.unix -o test_lwt.cmx test_lwt.ml
ocamlfind: [WARNING] Package `threads': Linking problems may arise because of the missing -thread or -vmthread switch
ocamlfind ocamlopt -linkpkg -g -package react -package uuidm -package unix -package ocplib-endian -package lwt.unix valet_core.cmx valet_react.cmx test_lib.cmx test_lwt.cmx -o test_lwt.native
+ ocamlfind ocamlopt -linkpkg -g -package react -package uuidm -package unix -package ocplib-endian -package lwt.unix valet_core.cmx valet_react.cmx test_lib.cmx test_lwt.cmx -o test_lwt.native
ocamlfind: [WARNING] Package `threads': Linking problems may arise because of the missing -thread or -vmthread switch
File "_none_", line 1:
Error: No implementations provided for the following modules:
         Mutex referenced from /home/louis/.opam/4.03.1+bench/lib/lwt/unix/lwt_unix.cmxa(Lwt_main)
Command exited with code 2.
Makefile:6: recipe for target 'all' failed
make: *** [all] Error 10
make: Leaving directory '/home/louis/.opam/4.03.1+bench/.opam-switch/build/valet-bench.1.0/valet'
Close

Error on thread-bench.1.0 (4.07.1+oclassic+bench)

Command:

/usr/bin/make -C thread

Output

make: Entering directory '/home/louis/.opam/4.07.1+oclassic+bench/.opam-switch/build/thread-bench.1.0/thread'
ocamlfind ocamlopt -package lwt.unix -linkpkg -o thread_sleep_lwt thread_sleep_lwt.ml
ocamlfind: [WARNING] Package `threads': Linking problems may arise because of the missing -thread or -vmthread switch
File "thread_sleep_lwt.ml", line 1:
Error: No implementations provided for the following modules:
         Mutex referenced from /home/louis/.opam/4.07.1+oclassic+bench/lib/lwt/unix/lwt_unix.cmxa(Lwt_main)
Makefile:7: recipe for target 'thread_sleep_lwt' failed
make: *** [thread_sleep_lwt] Error 2
make: Leaving directory '/home/louis/.opam/4.07.1+oclassic+bench/.opam-switch/build/thread-bench.1.0/thread'
Close

Error on thread-bench.1.0 (4.07.1+flambda+bench)

Command:

/usr/bin/make -C thread

Output

make: Entering directory '/home/louis/.opam/4.07.1+flambda+bench/.opam-switch/build/thread-bench.1.0/thread'
ocamlfind ocamlopt -package lwt.unix -linkpkg -o thread_sleep_lwt thread_sleep_lwt.ml
ocamlfind: [WARNING] Package `threads': Linking problems may arise because of the missing -thread or -vmthread switch
File "thread_sleep_lwt.ml", line 1:
Error: No implementations provided for the following modules:
         Mutex referenced from /home/louis/.opam/4.07.1+flambda+bench/lib/lwt/unix/lwt_unix.cmxa(Lwt_main)
Makefile:7: recipe for target 'thread_sleep_lwt' failed
make: *** [thread_sleep_lwt] Error 2
make: Leaving directory '/home/louis/.opam/4.07.1+flambda+bench/.opam-switch/build/thread-bench.1.0/thread'
Close

Error on thread-bench.1.0 (4.07.1+clambda+bench)

Command:

/usr/bin/make -C thread

Output

make: Entering directory '/home/louis/.opam/4.07.1+clambda+bench/.opam-switch/build/thread-bench.1.0/thread'
ocamlfind ocamlopt -package lwt.unix -linkpkg -o thread_sleep_lwt thread_sleep_lwt.ml
ocamlfind: [WARNING] Package `threads': Linking problems may arise because of the missing -thread or -vmthread switch
File "thread_sleep_lwt.ml", line 1:
Error: No implementations provided for the following modules:
         Mutex referenced from /home/louis/.opam/4.07.1+clambda+bench/lib/lwt/unix/lwt_unix.cmxa(Lwt_main)
Makefile:7: recipe for target 'thread_sleep_lwt' failed
make: *** [thread_sleep_lwt] Error 2
make: Leaving directory '/home/louis/.opam/4.07.1+clambda+bench/.opam-switch/build/thread-bench.1.0/thread'
Close

Error on thread-bench.1.0 (4.03.1+bench)

Command:

/usr/bin/make -C thread

Output

make: Entering directory '/home/louis/.opam/4.03.1+bench/.opam-switch/build/thread-bench.1.0/thread'
ocamlfind ocamlopt -package lwt.unix -linkpkg -o thread_sleep_lwt thread_sleep_lwt.ml
ocamlfind: [WARNING] Package `threads': Linking problems may arise because of the missing -thread or -vmthread switch
File "thread_sleep_lwt.ml", line 1:
Error: No implementations provided for the following modules:
         Mutex referenced from /home/louis/.opam/4.03.1+bench/lib/lwt/unix/lwt_unix.cmxa(Lwt_main)
Makefile:7: recipe for target 'thread_sleep_lwt' failed
make: *** [thread_sleep_lwt] Error 2
make: Leaving directory '/home/louis/.opam/4.03.1+bench/.opam-switch/build/thread-bench.1.0/thread'
Close

Error on ocaml-variants.4.08.0+trunk+flambda+oclassic (4.08.0+trunk+flambda+oclassic+bench)

Command:

~/.opam/4.08.0+trunk+flambda+oclassic+bench/.opam-switch/build/ocaml-variants.4.08.0+trunk+flambda+oclassic/./configure -prefix /home/louis/.opam/4.08.0+trunk+flambda+oclassic+bench -flambda -with-debug-runtime

Output

configure: error: unrecognized option: `-flambda'
Try `/home/louis/.opam/4.08.0+trunk+flambda+oclassic+bench/.opam-switch/build/ocaml-variants.4.08.0+trunk+flambda+oclassic/./configure --help' for more information
Close

Error on ocaml-migrate-parsetree.1.5.0 (4.08.0+trunk+bench)

Command:

~/.opam/4.08.0+trunk+bench/bin/dune build -p ocaml-migrate-parsetree -j 7

Output

       ocaml src/ast-version,src/compiler-functions-file (exit 1)
(cd _build/default/src && /home/louis/.opam/4.08.0+trunk+bench/bin/ocaml config/gen.ml 4.11.0+dev0-2019-10-18)
Unkown OCaml version 4.11.0+dev0-2019-10-18
Close

Error on numerical-analysis-bench.1.0 (4.08.0+trunk+bench)

Command:

/usr/bin/make

Output

ulimit -s 98304; ocamlopt.opt  -I simple_access `ocamldep.opt -sort simple_access/*.ml` main_nogcstats.ml -o simple_access.opt
ulimit -s 98304; ocamlopt.opt  -I lu-decomposition `ocamldep.opt -sort lu-decomposition/*.ml` main_nogcstats.ml -o lu-decomposition.opt
ulimit -s 98304; ocamlopt.opt  -I fft `ocamldep.opt -sort fft/*.ml` main_nogcstats.ml -o fft.opt
ulimit -s 98304; ocamlopt.opt  -I rnd_access `ocamldep.opt -sort rnd_access/*.ml` main_nogcstats.ml -o rnd_access.opt
ulimit -s 98304; ocamlopt.opt  -I k-means `ocamldep.opt -sort k-means/*.ml` main_nogcstats.ml -o k-means.opt
Fatal error: exception Stack overflow
Makefile:20: recipe for target 'k-means.opt' failed
make: *** [k-means.opt] Error 2
Close

Error on numerical-analysis-bench.1.0 (4.08.0+gpr2165+bench)

Command:

/usr/bin/make

Output

ulimit -s 98304; ocamlopt.opt  -I simple_access `ocamldep.opt -sort simple_access/*.ml` main_nogcstats.ml -o simple_access.opt
ulimit -s 98304; ocamlopt.opt  -I lu-decomposition `ocamldep.opt -sort lu-decomposition/*.ml` main_nogcstats.ml -o lu-decomposition.opt
ulimit -s 98304; ocamlopt.opt  -I fft `ocamldep.opt -sort fft/*.ml` main_nogcstats.ml -o fft.opt
ulimit -s 98304; ocamlopt.opt  -I rnd_access `ocamldep.opt -sort rnd_access/*.ml` main_nogcstats.ml -o rnd_access.opt
ulimit -s 98304; ocamlopt.opt  -I k-means `ocamldep.opt -sort k-means/*.ml` main_nogcstats.ml -o k-means.opt
Fatal error: exception Stack overflow
Makefile:20: recipe for target 'k-means.opt' failed
make: *** [k-means.opt] Error 2
Close

Error on dune.2.0.1 (4.08.0+gpr2165+bench)

Command:

~/.opam/4.08.0+gpr2165+bench/bin/ocaml bootstrap.ml -j 7

Output

ocamlc -output-complete-exe -w -24 -g -o .duneboot.exe -I boot unix.cma boot/libs.ml boot/duneboot.ml
ocamlc: unknown option '-output-complete-exe'.
Usage: ocamlc <options> <files>
Options are:
  -a  Build a library
  -alert <list>  Enable or disable alerts according to <list>:
        +<alertname>  enable alert <alertname>
        -<alertname>  disable alert <alertname>
        ++<alertname> treat <alertname> as fatal error
        --<alertname> treat <alertname> as non-fatal
        @<alertname>  enable <alertname> and treat it as fatal error
    <alertname> can be 'all' to refer to all alert names
  -absname  Show absolute filenames in error messages
  -annot  Save information in <filename>.annot
  -bin-annot  Save typedtree in <filename>.cmt
  -c  Compile only (do not link)
  -cc <command>  Use <command> as the C compiler and linker
  -cclib <opt>  Pass option <opt> to the C linker
  -ccopt <opt>  Pass option <opt> to the C compiler and linker
  -color {auto|always|never}  Enable or disable colors in compiler messages
    The following settings are supported:
      auto    use heuristics to enable colors only if supported
      always  enable colors
      never   disable colors
    The default setting is 'auto', and the current heuristic
    checks that the TERM environment variable exists and is
    not empty or "dumb", and that isatty(stderr) holds.
  If the option is not specified, these setting can alternatively
  be set through the OCAML_COLOR environment variable.
  -error-style {contextual|short}  Control the way error messages and warnings are printed
    The following settings are supported:
      short       only print the error and its location
      contextual  like "short", but also display the source code
                  snippet corresponding to the location of the error
    The default setting is 'contextual'.
  If the option is not specified, these setting can alternatively
  be set through the OCAML_ERROR_STYLE environment variable.
  -compat-32  Check that generated bytecode can run on 32-bit platforms
  -config  Print configuration values and exit
  -config-var  Print the value of a configuration variable, a newline, and exit
    (print nothing and exit with error value if the variable does not exist)
  -custom  Link in custom mode
  -dllib <lib>  Use the dynamically-loaded library <lib>
  -dllpath <dir>  Add <dir> to the run-time search path for shared libraries
  -dtypes  (deprecated) same as -annot
  -for-pack <ident>  Generate code that can later be `packed' with
     ocamlc -pack -o <ident>.cmo
  -g  Save debugging information
  -stop-after {parsing|typing} Stop after the given compilation pass.
  -i  Print inferred interface
  -I <dir>  Add <dir> to the list of include directories
  -impl <file>  Compile <file> as a .ml file
  -intf <file>  Compile <file> as a .mli file
  -intf-suffix <string>  Suffix for interface files (default: .mli)
  -intf_suffix <string>  (deprecated) same as -intf-suffix
  -keep-docs  Keep documentation strings in .cmi files
  -no-keep-docs  Do not keep documentation strings in .cmi files (default)
  -keep-locs  Keep locations in .cmi files (default)
  -no-keep-locs  Do not keep locations in .cmi files
  -labels  Use commuting label mode
  -linkall  Link all modules, even unused ones
  -make-runtime  Build a runtime system with given C objects and libraries
  -make_runtime  (deprecated) same as -make-runtime
  -modern  (deprecated) same as -labels
  -alias-deps  Do record dependencies for module aliases
  -no-alias-deps  Do not record dependencies for module aliases
  -app-funct  Activate applicative functors
  -no-app-funct  Deactivate applicative functors
  -no-check-prims  Do not check runtime for primitives
  -noassert  Do not compile assertion checks
  -noautolink  Do not automatically link C libraries specified in .cma files
  -nolabels  Ignore non-optional labels in types
  -nostdlib  Do not add default directory to the list of include directories
  -nopervasives  (undocumented)
  -o <file>  Set output file name to <file>
  -opaque  Does not generate cross-module optimization information
     (reduces necessary recompilation on module change)
  -open <module>  Opens the module <module> before typing
  -output-obj  Output an object file instead of an executable
  -output-complete-obj  Output an object file, including runtime, instead of an executable
  -pack  Package the given .cmo files into one .cmo
  -pp <command>  Pipe sources through preprocessor <command>
  -ppx <command>  Pipe abstract syntax trees through preprocessor <command>
  -plugin <plugin>  (no longer supported)
  -principal  Check principality of type inference
  -no-principal  Do not check principality of type inference (default)
  -rectypes  Allow arbitrary recursive types
  -no-rectypes  Do not allow arbitrary recursive types (default)
  -runtime-variant <str>  Use the <str> variant of the run-time system
  -with-runtime Include the runtime system in the generated program (default)
  -without-runtime Do not include the runtime system in the generated program.
  -safe-string  Make strings immutable (default)
  -short-paths  Shorten paths in types
  -strict-sequence  Left-hand part of a sequence must have type unit
  -no-strict-sequence  Left-hand part of a sequence need not have type unit (default)
  -strict-formats  Reject invalid formats accepted by legacy implementations
     (Warning: Invalid formats may behave differently from
      previous OCaml versions, and will become always-rejected
      in future OCaml versions. You should always use this flag
      to detect invalid formats so you can fix them.)
  -no-strict-formats  Accept invalid formats accepted by legacy implementations (default)
     (Warning: Invalid formats may behave differently from
      previous OCaml versions, and will become always-rejected
      in future OCaml versions. You should never use this flag
      and instead fix invalid formats.)
  -thread  (deprecated) same as -I +threads
  -unboxed-types  unannotated unboxable types will be unboxed
  -no-unboxed-types  unannotated unboxable types will not be unboxed (default)
  -unsafe  Do not compile bounds checking on array and string access
  -unsafe-string  Make strings mutable
  -use-runtime <file>  Generate bytecode for the given runtime system
  -use_runtime <file>  (deprecated) same as -use-runtime
  -v  Print compiler version and location of standard library and exit
  -verbose  Print calls to external commands
  -version  Print version and exit
  --version  Print version and exit
  -vmthread   (no longer supported)
  -vnum  Print version number and exit
  -w <list>  Enable or disable warnings according to <list>:
        +<spec>   enable warnings in <spec>
        -<spec>   disable warnings in <spec>
        @<spec>   enable warnings in <spec> and treat them as errors
     <spec> can be:
        <num>             a single warning number
        <num1>..<num2>    a range of consecutive warning numbers
        <letter>          a predefined set
     default setting is "+a-4-6-7-9-27-29-32..42-44-45-48-50-60-66"
  -warn-error <list>  Enable or disable error status for warnings according
     to <list>.  See option -w for the syntax of <list>.
     Default setting is "-a+31"
  -warn-help  Show description of warning numbers
  -where  Print location of standard library and exit
  - <file>  Treat <file> as a file name (even if it starts with `-')
  -match-context-rows <n>  (advanced, see manual section 9.2.)
  -use-prims <file>  (undocumented)
  -dno-unique-ids  (undocumented)
  -dunique-ids  (undocumented)
  -dsource  (undocumented)
  -dparsetree  (undocumented)
  -dtypedtree  (undocumented)
  -drawlambda  (undocumented)
  -dlambda  (undocumented)
  -dinstr  (undocumented)
  -dcamlprimc  (undocumented)
  -dtimings  Print timings information for each pass
  -dprofile  Print performance information for each pass
    The columns are: time alloc top-heap absolute-top-heap.
  -dump-into-file  dump output like -dlambda into <target>.dump
  -args <file> Read additional newline-terminated command line arguments
      from <file>
  -args0 <file> Read additional null character terminated command line arguments
from <file>
  -depend <options> Compute dependencies (use 'ocamlc -depend -help' for details)
  -help  Display this list of options
  --help  Display this list of options
Close

Error on core-micro-bench.1.0 (4.07.1+oclassic+bench)

Command:

/usr/bin/make -C core_micro

Output

make: Entering directory '/home/louis/.opam/4.07.1+oclassic+bench/.opam-switch/build/core-micro-bench.1.0/core_micro'
ocamlbuild -use-ocamlfind runner.native
ocamlfind ocamldep -package str -package core -package core_bench.inline_benchmarks -modules runner.ml > runner.ml.depends
ocamlfind ocamlc -c -thread -package str -package core -package core_bench.inline_benchmarks -o runner.cmo runner.ml
+ ocamlfind ocamlc -c -thread -package str -package core -package core_bench.inline_benchmarks -o runner.cmo runner.ml
File "runner.ml", line 1, characters 5-13:
Error: Unbound module Core.Std
Command exited with code 2.
Makefile:4: recipe for target 'all' failed
make: *** [all] Error 10
make: Leaving directory '/home/louis/.opam/4.07.1+oclassic+bench/.opam-switch/build/core-micro-bench.1.0/core_micro'
Close

Error on core-micro-bench.1.0 (4.07.1+flambda+bench)

Command:

/usr/bin/make -C core_micro

Output

make: Entering directory '/home/louis/.opam/4.07.1+flambda+bench/.opam-switch/build/core-micro-bench.1.0/core_micro'
ocamlbuild -use-ocamlfind runner.native
ocamlfind ocamldep -package str -package core -package core_bench.inline_benchmarks -modules runner.ml > runner.ml.depends
ocamlfind ocamlc -c -thread -package str -package core -package core_bench.inline_benchmarks -o runner.cmo runner.ml
+ ocamlfind ocamlc -c -thread -package str -package core -package core_bench.inline_benchmarks -o runner.cmo runner.ml
File "runner.ml", line 1, characters 5-13:
Error: Unbound module Core.Std
Command exited with code 2.
Makefile:4: recipe for target 'all' failed
make: *** [all] Error 10
make: Leaving directory '/home/louis/.opam/4.07.1+flambda+bench/.opam-switch/build/core-micro-bench.1.0/core_micro'
Close

Error on core-micro-bench.1.0 (4.07.1+clambda+bench)

Command:

/usr/bin/make -C core_micro

Output

make: Entering directory '/home/louis/.opam/4.07.1+clambda+bench/.opam-switch/build/core-micro-bench.1.0/core_micro'
ocamlbuild -use-ocamlfind runner.native
ocamlfind ocamldep -package str -package core -package core_bench.inline_benchmarks -modules runner.ml > runner.ml.depends
ocamlfind ocamlc -c -thread -package str -package core -package core_bench.inline_benchmarks -o runner.cmo runner.ml
+ ocamlfind ocamlc -c -thread -package str -package core -package core_bench.inline_benchmarks -o runner.cmo runner.ml
File "runner.ml", line 1, characters 5-13:
Error: Unbound module Core.Std
Command exited with code 2.
Makefile:4: recipe for target 'all' failed
make: *** [all] Error 10
make: Leaving directory '/home/louis/.opam/4.07.1+clambda+bench/.opam-switch/build/core-micro-bench.1.0/core_micro'
Close

Error on core-micro-bench.1.0 (4.03.1+bench)

Command:

/usr/bin/make -C core_micro

Output

make: Entering directory '/home/louis/.opam/4.03.1+bench/.opam-switch/build/core-micro-bench.1.0/core_micro'
ocamlbuild -use-ocamlfind runner.native
ocamlfind ocamldep -package str -package core -package core_bench.inline_benchmarks -modules runner.ml > runner.ml.depends
ocamlfind ocamlc -c -thread -package str -package core -package core_bench.inline_benchmarks -o runner.cmo runner.ml
+ ocamlfind ocamlc -c -thread -package str -package core -package core_bench.inline_benchmarks -o runner.cmo runner.ml
File "runner.ml", line 1, characters 5-13:
Warning 3: deprecated: module Core.Std
[since 2017-02] Use Core. The Std sub-module is no longer needed
File "runner.ml", line 3, characters 15-55:
Error: Unbound module Pa_bench_lib
Command exited with code 2.
Makefile:4: recipe for target 'all' failed
make: *** [all] Error 10
make: Leaving directory '/home/louis/.opam/4.03.1+bench/.opam-switch/build/core-micro-bench.1.0/core_micro'
Close

Error on conf-graphviz.0.1 (4.07.1+oclassic+bench)

Command:

/usr/bin/which dot

Output


Close

Error on conf-graphviz.0.1 (4.07.1+flambda+bench)

Command:

/usr/bin/which dot

Output


Close

Error on conf-graphviz.0.1 (4.07.1+clambda+bench)

Command:

/usr/bin/which dot

Output


Close

Error on conf-graphviz.0.1 (4.03.1+bench)

Command:

/usr/bin/which dot

Output


Close

Error on cohttp-bench.1.0 (4.07.1+oclassic+bench)

Command:

/usr/bin/make -C cohttp

Output

make: Entering directory '/home/louis/.opam/4.07.1+oclassic+bench/.opam-switch/build/cohttp-bench.1.0/cohttp'
ocamlbuild -use-ocamlfind cohttp_lwt_bench.native cohttp_async_bench.native
ocamlfind ocamldep -package lwt.unix -package cohttp.lwt -modules cohttp_lwt_bench.ml > cohttp_lwt_bench.ml.depends
+ ocamlfind ocamldep -package lwt.unix -package cohttp.lwt -modules cohttp_lwt_bench.ml > cohttp_lwt_bench.ml.depends
ocamlfind: Package `cohttp.lwt' not found
Command exited with code 2.
Makefile:6: recipe for target 'all' failed
make: *** [all] Error 10
make: Leaving directory '/home/louis/.opam/4.07.1+oclassic+bench/.opam-switch/build/cohttp-bench.1.0/cohttp'
Close

Error on cohttp-bench.1.0 (4.07.1+flambda+bench)

Command:

/usr/bin/make -C cohttp

Output

make: Entering directory '/home/louis/.opam/4.07.1+flambda+bench/.opam-switch/build/cohttp-bench.1.0/cohttp'
ocamlbuild -use-ocamlfind cohttp_lwt_bench.native cohttp_async_bench.native
ocamlfind ocamldep -package lwt.unix -package cohttp.lwt -modules cohttp_lwt_bench.ml > cohttp_lwt_bench.ml.depends
+ ocamlfind ocamldep -package lwt.unix -package cohttp.lwt -modules cohttp_lwt_bench.ml > cohttp_lwt_bench.ml.depends
ocamlfind: Package `cohttp.lwt' not found
Command exited with code 2.
Makefile:6: recipe for target 'all' failed
make: *** [all] Error 10
make: Leaving directory '/home/louis/.opam/4.07.1+flambda+bench/.opam-switch/build/cohttp-bench.1.0/cohttp'
Close

Error on cohttp-bench.1.0 (4.07.1+clambda+bench)

Command:

/usr/bin/make -C cohttp

Output

make: Entering directory '/home/louis/.opam/4.07.1+clambda+bench/.opam-switch/build/cohttp-bench.1.0/cohttp'
ocamlbuild -use-ocamlfind cohttp_lwt_bench.native cohttp_async_bench.native
ocamlfind ocamldep -package lwt.unix -package cohttp.lwt -modules cohttp_lwt_bench.ml > cohttp_lwt_bench.ml.depends
+ ocamlfind ocamldep -package lwt.unix -package cohttp.lwt -modules cohttp_lwt_bench.ml > cohttp_lwt_bench.ml.depends
ocamlfind: Package `cohttp.lwt' not found
Command exited with code 2.
Makefile:6: recipe for target 'all' failed
make: *** [all] Error 10
make: Leaving directory '/home/louis/.opam/4.07.1+clambda+bench/.opam-switch/build/cohttp-bench.1.0/cohttp'
Close

Error on cohttp-bench.1.0 (4.03.1+bench)

Command:

/usr/bin/make -C cohttp

Output

make: Entering directory '/home/louis/.opam/4.03.1+bench/.opam-switch/build/cohttp-bench.1.0/cohttp'
ocamlbuild -use-ocamlfind cohttp_lwt_bench.native cohttp_async_bench.native
ocamlfind ocamldep -package lwt.unix -package cohttp.lwt -modules cohttp_lwt_bench.ml > cohttp_lwt_bench.ml.depends
+ ocamlfind ocamldep -package lwt.unix -package cohttp.lwt -modules cohttp_lwt_bench.ml > cohttp_lwt_bench.ml.depends
ocamlfind: Package `cohttp-lwt-unix' not found - required by `cohttp.lwt'
Command exited with code 2.
Makefile:6: recipe for target 'all' failed
make: *** [all] Error 10
make: Leaving directory '/home/louis/.opam/4.03.1+bench/.opam-switch/build/cohttp-bench.1.0/cohttp'
Close

Error on chameneos-bench.1.0 (4.07.1+oclassic+bench)

Command:

/usr/bin/make -C chameneos-redux

Output

make: Entering directory '/home/louis/.opam/4.07.1+oclassic+bench/.opam-switch/build/chameneos-bench.1.0/chameneos-redux'
ocamlopt -bin-annot -thread unix.cmxa threads.cmxa chameneos_redux_th.ml -o chameneos_redux_th
ocamlopt -bin-annot -thread unix.cmxa threads.cmxa chameneos_redux_evtchn.ml -o chameneos_redux_evtchn
ocamlfind ocamlopt -bin-annot -package lwt.unix -linkpkg chameneos_redux_lwt.ml -o chameneos_redux_lwt
ocamlfind: [WARNING] Package `threads': Linking problems may arise because of the missing -thread or -vmthread switch
File "chameneos_redux_lwt.ml", line 1:
Error: No implementations provided for the following modules:
         Mutex referenced from /home/louis/.opam/4.07.1+oclassic+bench/lib/lwt/unix/lwt_unix.cmxa(Lwt_main)
Makefile:6: recipe for target 'chameneos_redux_lwt' failed
make: *** [chameneos_redux_lwt] Error 2
make: Leaving directory '/home/louis/.opam/4.07.1+oclassic+bench/.opam-switch/build/chameneos-bench.1.0/chameneos-redux'
Close

Error on chameneos-bench.1.0 (4.07.1+flambda+bench)

Command:

/usr/bin/make -C chameneos-redux

Output

make: Entering directory '/home/louis/.opam/4.07.1+flambda+bench/.opam-switch/build/chameneos-bench.1.0/chameneos-redux'
ocamlopt -bin-annot -thread unix.cmxa threads.cmxa chameneos_redux_th.ml -o chameneos_redux_th
ocamlopt -bin-annot -thread unix.cmxa threads.cmxa chameneos_redux_evtchn.ml -o chameneos_redux_evtchn
ocamlfind ocamlopt -bin-annot -package lwt.unix -linkpkg chameneos_redux_lwt.ml -o chameneos_redux_lwt
ocamlfind: [WARNING] Package `threads': Linking problems may arise because of the missing -thread or -vmthread switch
File "chameneos_redux_lwt.ml", line 1:
Error: No implementations provided for the following modules:
         Mutex referenced from /home/louis/.opam/4.07.1+flambda+bench/lib/lwt/unix/lwt_unix.cmxa(Lwt_main)
Makefile:6: recipe for target 'chameneos_redux_lwt' failed
make: *** [chameneos_redux_lwt] Error 2
make: Leaving directory '/home/louis/.opam/4.07.1+flambda+bench/.opam-switch/build/chameneos-bench.1.0/chameneos-redux'
Close

Error on chameneos-bench.1.0 (4.07.1+clambda+bench)

Command:

/usr/bin/make -C chameneos-redux

Output

make: Entering directory '/home/louis/.opam/4.07.1+clambda+bench/.opam-switch/build/chameneos-bench.1.0/chameneos-redux'
ocamlopt -bin-annot -thread unix.cmxa threads.cmxa chameneos_redux_th.ml -o chameneos_redux_th
ocamlopt -bin-annot -thread unix.cmxa threads.cmxa chameneos_redux_evtchn.ml -o chameneos_redux_evtchn
ocamlfind ocamlopt -bin-annot -package lwt.unix -linkpkg chameneos_redux_lwt.ml -o chameneos_redux_lwt
ocamlfind: [WARNING] Package `threads': Linking problems may arise because of the missing -thread or -vmthread switch
File "chameneos_redux_lwt.ml", line 1:
Error: No implementations provided for the following modules:
         Mutex referenced from /home/louis/.opam/4.07.1+clambda+bench/lib/lwt/unix/lwt_unix.cmxa(Lwt_main)
Makefile:6: recipe for target 'chameneos_redux_lwt' failed
make: *** [chameneos_redux_lwt] Error 2
make: Leaving directory '/home/louis/.opam/4.07.1+clambda+bench/.opam-switch/build/chameneos-bench.1.0/chameneos-redux'
Close

Error on chameneos-bench.1.0 (4.03.1+bench)

Command:

/usr/bin/make -C chameneos-redux

Output

make: Entering directory '/home/louis/.opam/4.03.1+bench/.opam-switch/build/chameneos-bench.1.0/chameneos-redux'
ocamlopt -bin-annot -thread unix.cmxa threads.cmxa chameneos_redux_th.ml -o chameneos_redux_th
ocamlopt -bin-annot -thread unix.cmxa threads.cmxa chameneos_redux_evtchn.ml -o chameneos_redux_evtchn
ocamlfind ocamlopt -bin-annot -package lwt.unix -linkpkg chameneos_redux_lwt.ml -o chameneos_redux_lwt
ocamlfind: [WARNING] Package `threads': Linking problems may arise because of the missing -thread or -vmthread switch
File "chameneos_redux_lwt.ml", line 1:
Error: No implementations provided for the following modules:
         Mutex referenced from /home/louis/.opam/4.03.1+bench/lib/lwt/unix/lwt_unix.cmxa(Lwt_main)
Makefile:6: recipe for target 'chameneos_redux_lwt' failed
make: *** [chameneos_redux_lwt] Error 2
make: Leaving directory '/home/louis/.opam/4.03.1+bench/.opam-switch/build/chameneos-bench.1.0/chameneos-redux'
Close

Error on base.v0.13.0 (4.08.0+trunk+bench)

Command:

~/.opam/4.08.0+trunk+bench/bin/dune build -p base -j 7

Output

      ocamlc src/exn_stubs.o (exit 2)
(cd _build/default/src && /home/louis/.opam/4.08.0+trunk+bench/bin/ocamlc.opt -g -I /home/louis/.opam/4.08.0+trunk+bench/lib/sexplib0 -I ../compiler-stdlib/src -I ../hash_types/src -I ../shadow-stdlib/src -ccopt -std=gnu99 -ccopt -O2 -ccopt -fno-strict-aliasing -ccopt -fwrapv -ccopt -fno-builtin-memcmp -ccopt -fPIC -ccopt -D_LARGEFILE64_SOURCE -ccopt -mpopcnt -ccopt -g -o exn_stubs.o exn_stubs.c)
In file included from /home/louis/.opam/4.08.0+trunk+bench/lib/ocaml/caml/mlvalues.h:67:0,
                 from exn_stubs.c:1:
/home/louis/.opam/4.08.0+trunk+bench/lib/ocaml/caml/domain_state.h:55:43: error: expected ‘)’ before ‘->’ token
 #define Caml_state_field(field) Caml_state->_##field
                                           ^
/home/louis/.opam/4.08.0+trunk+bench/lib/ocaml/caml/compatibility.h:41:29: note: in expansion of macro ‘Caml_state_field’
 #define caml_backtrace_pos (Caml_state_field(backtrace_pos))
                             ^
exn_stubs.c:3:12: note: in expansion of macro ‘caml_backtrace_pos’
 extern int caml_backtrace_pos;
            ^
Close

Error on async-rpc-bench.1.0 (4.07.1+oclassic+bench)

Command:

/usr/bin/make -C async_rpc

Output

make: Entering directory '/home/louis/.opam/4.07.1+oclassic+bench/.opam-switch/build/async-rpc-bench.1.0/async_rpc'
ocamlfind ocamlopt -thread -syntax camlp4o -package async -package bin_prot.syntax -package core -c rpc_common.ml
ocamlfind: Package `bin_prot.syntax' not found
Makefile:12: recipe for target 'rpc_common.cmx' failed
make: *** [rpc_common.cmx] Error 2
make: Leaving directory '/home/louis/.opam/4.07.1+oclassic+bench/.opam-switch/build/async-rpc-bench.1.0/async_rpc'
Close

Error on async-rpc-bench.1.0 (4.07.1+flambda+bench)

Command:

/usr/bin/make -C async_rpc

Output

make: Entering directory '/home/louis/.opam/4.07.1+flambda+bench/.opam-switch/build/async-rpc-bench.1.0/async_rpc'
ocamlfind ocamlopt -thread -syntax camlp4o -package async -package bin_prot.syntax -package core -c rpc_common.ml
ocamlfind: Package `bin_prot.syntax' not found
Makefile:12: recipe for target 'rpc_common.cmx' failed
make: *** [rpc_common.cmx] Error 2
make: Leaving directory '/home/louis/.opam/4.07.1+flambda+bench/.opam-switch/build/async-rpc-bench.1.0/async_rpc'
Close

Error on async-rpc-bench.1.0 (4.07.1+clambda+bench)

Command:

/usr/bin/make -C async_rpc

Output

make: Entering directory '/home/louis/.opam/4.07.1+clambda+bench/.opam-switch/build/async-rpc-bench.1.0/async_rpc'
ocamlfind ocamlopt -thread -syntax camlp4o -package async -package bin_prot.syntax -package core -c rpc_common.ml
ocamlfind: Package `bin_prot.syntax' not found
Makefile:12: recipe for target 'rpc_common.cmx' failed
make: *** [rpc_common.cmx] Error 2
make: Leaving directory '/home/louis/.opam/4.07.1+clambda+bench/.opam-switch/build/async-rpc-bench.1.0/async_rpc'
Close

Error on async-rpc-bench.1.0 (4.03.1+bench)

Command:

/usr/bin/make -C async_rpc

Output

make: Entering directory '/home/louis/.opam/4.03.1+bench/.opam-switch/build/async-rpc-bench.1.0/async_rpc'
ocamlfind ocamlopt -thread -syntax camlp4o -package async -package bin_prot.syntax -package core -c rpc_common.ml
ocamlfind: Package `bin_prot.syntax' not found
Makefile:12: recipe for target 'rpc_common.cmx' failed
make: *** [rpc_common.cmx] Error 2
make: Leaving directory '/home/louis/.opam/4.03.1+bench/.opam-switch/build/async-rpc-bench.1.0/async_rpc'
Close

Error on async-echo-bench.1.0 (4.07.1+oclassic+bench)

Command:

/usr/bin/make -C async_echo

Output

make: Entering directory '/home/louis/.opam/4.07.1+oclassic+bench/.opam-switch/build/async-echo-bench.1.0/async_echo'
ocamlfind ocamlopt -thread -syntax camlp4o -package async -package bin_prot.syntax -package core -c echo_common.ml
ocamlfind: Package `bin_prot.syntax' not found
Makefile:20: recipe for target 'echo_common.cmx' failed
make: *** [echo_common.cmx] Error 2
make: Leaving directory '/home/louis/.opam/4.07.1+oclassic+bench/.opam-switch/build/async-echo-bench.1.0/async_echo'
Close

Error on async-echo-bench.1.0 (4.07.1+flambda+bench)

Command:

/usr/bin/make -C async_echo

Output

make: Entering directory '/home/louis/.opam/4.07.1+flambda+bench/.opam-switch/build/async-echo-bench.1.0/async_echo'
ocamlfind ocamlopt -thread -syntax camlp4o -package async -package bin_prot.syntax -package core -c echo_common.ml
ocamlfind: Package `bin_prot.syntax' not found
Makefile:20: recipe for target 'echo_common.cmx' failed
make: *** [echo_common.cmx] Error 2
make: Leaving directory '/home/louis/.opam/4.07.1+flambda+bench/.opam-switch/build/async-echo-bench.1.0/async_echo'
Close

Error on async-echo-bench.1.0 (4.07.1+clambda+bench)

Command:

/usr/bin/make -C async_echo

Output

make: Entering directory '/home/louis/.opam/4.07.1+clambda+bench/.opam-switch/build/async-echo-bench.1.0/async_echo'
ocamlfind ocamlopt -thread -syntax camlp4o -package async -package bin_prot.syntax -package core -c echo_common.ml
ocamlfind: Package `bin_prot.syntax' not found
Makefile:20: recipe for target 'echo_common.cmx' failed
make: *** [echo_common.cmx] Error 2
make: Leaving directory '/home/louis/.opam/4.07.1+clambda+bench/.opam-switch/build/async-echo-bench.1.0/async_echo'
Close

Error on async-echo-bench.1.0 (4.03.1+bench)

Command:

/usr/bin/make -C async_echo

Output

make: Entering directory '/home/louis/.opam/4.03.1+bench/.opam-switch/build/async-echo-bench.1.0/async_echo'
ocamlfind ocamlopt -thread -syntax camlp4o -package async -package bin_prot.syntax -package core -c echo_common.ml
ocamlfind: Package `bin_prot.syntax' not found
Makefile:20: recipe for target 'echo_common.cmx' failed
make: *** [echo_common.cmx] Error 2
make: Leaving directory '/home/louis/.opam/4.03.1+bench/.opam-switch/build/async-echo-bench.1.0/async_echo'