Package4.03.1+bench4.05.0+flambda+opt+bench4.06.1+flambda+bench4.06.1+flambda+opt+bench4.07.1+clambda+bench4.07.1+flambda+bench4.07.1+oclassic+bench4.08.0+gpr2165+bench4.08.0+mutmatch+bench4.08.0+trunk+bench4.08.0+trunk+flambda+bench4.08.0+trunk+flambda+oclassic+bench4.08.0+trunk+flambda+opt+bench4.03.1+bench time (s)4.05.0+flambda+opt+bench time (s)4.06.1+flambda+bench time (s)4.06.1+flambda+opt+bench time (s)4.07.1+clambda+bench time (s)4.07.1+flambda+bench time (s)4.07.1+oclassic+bench time (s)4.08.0+gpr2165+bench time (s)4.08.0+mutmatch+bench time (s)4.08.0+trunk+bench time (s)4.08.0+trunk+flambda+bench time (s)4.08.0+trunk+flambda+oclassic+bench time (s)4.08.0+trunk+flambda+opt+bench time (s)
almabench-bench.1.0----------AbortedAbortedAborted----------0.0000.0000.000
alt-ergo.2.3.0----------AbortedAbortedAborted----------0.0000.0000.000
alt-ergo-lib.2.3.0----------AbortedAbortedAborted----------0.0000.0000.000
alt-ergo-parsers.2.3.0----------AbortedAbortedAborted----------0.0000.0000.000
async.v0.13.0-------AbortedAbortedAbortedAbortedAbortedAborted-------0.0000.0000.0000.0000.0000.000
async-echo-bench.1.0----Failure (2)Failure (2)Failure (2)AbortedAbortedAbortedAbortedAbortedAborted----0.8280.6510.6680.0000.0000.0000.0000.0000.000
async-rpc-bench.1.0----Failure (2)Failure (2)Failure (2)AbortedAbortedAbortedAbortedAbortedAborted----0.8900.7340.7370.0000.0000.0000.0000.0000.000
async_kernel.v0.13.0-------AbortedAbortedAbortedAbortedAbortedAborted-------0.0000.0000.0000.0000.0000.000
async_rpc_kernel.v0.13.0-------AbortedAbortedAbortedAbortedAbortedAborted-------0.0000.0000.0000.0000.0000.000
async_unix.v0.13.0-------AbortedAbortedAbortedAbortedAbortedAborted-------0.0000.0000.0000.0000.0000.000
base.v0.13.0-------AbortedAborted-AbortedAbortedAborted-------0.0000.000-0.0000.0000.000
base-bytes.base----------AbortedAbortedAborted----------0.0000.0000.000
base64.3.2.0-------AbortedAborted-AbortedAbortedAborted-------0.0000.000-0.0000.0000.000
base_bigstring.v0.13.0-------AbortedAbortedAbortedAbortedAbortedAborted-------0.0000.0000.0000.0000.0000.000
base_quickcheck.v0.13.0-------AbortedAbortedAbortedAbortedAbortedAborted-------0.0000.0000.0000.0000.0000.000
bdd-bench.1.0----------AbortedAbortedAborted----------0.0000.0000.000
bin_prot.v0.13.0-------AbortedAbortedAbortedAbortedAbortedAborted-------0.0000.0000.0000.0000.0000.000
biniou.1.2.1-------AbortedAborted-AbortedAbortedAborted-------0.0000.000-0.0000.0000.000
camlimages.5.0.1-------AbortedAbortedFailure (1)AbortedAbortedAborted-------0.0000.0001.0850.0000.0000.000
camlpdf.2.3----------AbortedAbortedAborted----------0.0000.0000.000
camlzip.1.10----------AbortedAbortedAborted----------0.0000.0000.000
chameneos-bench.1.0----Failure (2)Failure (2)Failure (2)AbortedAbortedAbortedAbortedAbortedAborted----0.8910.7570.7670.0000.0000.0000.0000.0000.000
cohttp.2.5.0-------AbortedAbortedAbortedAbortedAbortedAborted-------0.0000.0000.0000.0000.0000.000
cohttp-bench.1.0----Failure (2)Failure (2)Failure (2)AbortedAbortedAbortedAbortedAbortedAborted----0.7910.6770.6870.0000.0000.0000.0000.0000.000
conf-graphviz.0.1----Failure (1)Failure (1)Failure (1)----------0.7060.5930.603------
configurator.v0.11.0-------AbortedAborted-AbortedAbortedAborted-------0.0000.000-0.0000.0000.000
core.v0.13.0-------AbortedAbortedAbortedAbortedAbortedAborted-------0.0000.0000.0000.0000.0000.000
core-micro-bench.1.0----Failure (2)Failure (2)Failure (2)AbortedAbortedAbortedAbortedAbortedAborted----0.6880.5700.5790.0000.0000.0000.0000.0000.000
core-sequence-bench.1.0-------AbortedAbortedAbortedAbortedAbortedAborted-------0.0000.0000.0000.0000.0000.000
core_bench.v0.13.0-------AbortedAbortedAbortedAbortedAbortedAborted-------0.0000.0000.0000.0000.0000.000
core_kernel.v0.13.0-------AbortedAbortedAbortedAbortedAbortedAborted-------0.0000.0000.0000.0000.0000.000
cpdf.2.3----------AbortedAbortedAborted----------0.0000.0000.000
cpdf-bench.1.0----------AbortedAbortedAborted----------0.0000.0000.000
cppo.1.6.6-------AbortedAborted-AbortedAbortedAborted-------0.0000.000-0.0000.0000.000
dune.2.1.3-------Failure (2)Failure (2)-AbortedAbortedAborted-------0.3851.180-0.0000.0000.000
dune-configurator.2.1.3-------AbortedAborted-AbortedAbortedAborted-------0.0000.000-0.0000.0000.000
dune-private-libs.2.1.3-------AbortedAborted-AbortedAbortedAborted-------0.0000.000-0.0000.0000.000
easy-format.1.3.2-------AbortedAborted-AbortedAbortedAborted-------0.0000.000-0.0000.0000.000
fieldslib.v0.13.0-------AbortedAborted-AbortedAbortedAborted-------0.0000.000-0.0000.0000.000
frama-c.20.0----OKOKOK----------62.283112.41275.168------
frama-c-bench.1.0----OKOKOK----------0.1320.1160.123------
jane-street-headers.v0.13.0-------AbortedAborted-AbortedAbortedAborted-------0.0000.000-0.0000.0000.000
jbuilder.1.0+beta20.2----------AbortedAbortedAborted----------0.0000.0000.000
json-bench-data.1.0----------AbortedAbortedAborted----------0.0000.0000.000
jsonm.1.0.1----------AbortedAbortedAborted----------0.0000.0000.000
jsonm-bench.1.0----------AbortedAbortedAborted----------0.0000.0000.000
jst-config.v0.13.0-------AbortedAbortedAbortedAbortedAbortedAborted-------0.0000.0000.0000.0000.0000.000
kb-bench.1.0----------AbortedAbortedAborted----------0.0000.0000.000
lexifi-g2pp-bench.1.0----------AbortedAbortedAborted----------0.0000.0000.000
lwt.5.1.1-------AbortedAborted-AbortedAbortedAborted-------0.0000.000-0.0000.0000.000
menhir.20200123-------AbortedAborted-AbortedAbortedAborted-------0.0000.000-0.0000.0000.000
menhir-bench.1.0-------AbortedAborted-AbortedAbortedAborted-------0.0000.000-0.0000.0000.000
menhirLib.20200123-------AbortedAborted-AbortedAbortedAborted-------0.0000.000-0.0000.0000.000
menhirSdk.20200123-------AbortedAborted-AbortedAbortedAborted-------0.0000.000-0.0000.0000.000
minilight.1.6----------AbortedAbortedAborted----------0.0000.0000.000
minilight-bench.1.0----------AbortedAbortedAborted----------0.0000.0000.000
mmap.1.1.0-------AbortedAborted-AbortedAbortedAborted-------0.0000.000-0.0000.0000.000
nbcodec.1.0----------AbortedAbortedAborted----------0.0000.0000.000
nbcodec-bench.1.0----------AbortedAbortedAborted----------0.0000.0000.000
num.1.3----------AbortedAbortedAborted----------0.0000.0000.000
numerical-analysis-bench.1.0-------Failure (2)-Failure (2)AbortedAbortedAborted-------6.354-7.0760.0000.0000.000
ocaml.4.08.0----------AbortedAbortedAborted----------0.0000.0000.000
ocaml-compiler-libs.v0.12.1-------AbortedAborted-AbortedAbortedAborted-------0.0000.000-0.0000.0000.000
ocaml-migrate-parsetree.1.5.0-------AbortedAbortedFailure (1)AbortedAbortedAborted-------0.0000.0001.1740.0000.0000.000
ocaml-variants.4.08.0+trunk+flambda----------Failure (1)------------0.255--
ocaml-variants.4.08.0+trunk+flambda+oclassic-----------Failure (1)------------0.339-
ocaml-variants.4.08.0+trunk+flambda+opt------------Failure (1)------------0.257
ocamlbuild.0.14.0----------AbortedAbortedAborted----------0.0000.0000.000
ocamlfind.1.8.1----------AbortedAbortedAborted----------0.0000.0000.000
ocplib-endian.1.0-------AbortedAborted-AbortedAbortedAborted-------0.0000.000-0.0000.0000.000
ocplib-simplex.0.4----------AbortedAbortedAborted----------0.0000.0000.000
octavius.1.2.2-------AbortedAborted-AbortedAbortedAborted-------0.0000.000-0.0000.0000.000
parsexp.v0.13.0-------AbortedAborted-AbortedAbortedAborted-------0.0000.000-0.0000.0000.000
patdiff.v0.13.0-------AbortedAbortedAbortedAbortedAbortedAborted-------0.0000.0000.0000.0000.0000.000
patdiff-bench.1.0-------AbortedAbortedAbortedAbortedAbortedAborted-------0.0000.0000.0000.0000.0000.000
patience_diff.v0.13.0-------AbortedAbortedAbortedAbortedAbortedAborted-------0.0000.0000.0000.0000.0000.000
pcre.7.4.3-------AbortedAbortedFailure (1)AbortedAbortedAborted-------0.0000.0000.8160.0000.0000.000
ppx_assert.v0.13.0-------AbortedAbortedAbortedAbortedAbortedAborted-------0.0000.0000.0000.0000.0000.000
ppx_base.v0.13.0-------AbortedAbortedAbortedAbortedAbortedAborted-------0.0000.0000.0000.0000.0000.000
ppx_bench.v0.13.0-------AbortedAbortedAbortedAbortedAbortedAborted-------0.0000.0000.0000.0000.0000.000
ppx_bin_prot.v0.13.0-------AbortedAbortedAbortedAbortedAbortedAborted-------0.0000.0000.0000.0000.0000.000
ppx_cold.v0.13.0-------AbortedAbortedAbortedAbortedAbortedAborted-------0.0000.0000.0000.0000.0000.000
ppx_compare.v0.13.0-------AbortedAbortedAbortedAbortedAbortedAborted-------0.0000.0000.0000.0000.0000.000
ppx_custom_printf.v0.13.0-------AbortedAbortedAbortedAbortedAbortedAborted-------0.0000.0000.0000.0000.0000.000
ppx_derivers.1.2.1-------AbortedAborted-AbortedAbortedAborted-------0.0000.000-0.0000.0000.000
ppx_enumerate.v0.13.0-------AbortedAbortedAbortedAbortedAbortedAborted-------0.0000.0000.0000.0000.0000.000
ppx_expect.v0.13.0-------AbortedAbortedAbortedAbortedAbortedAborted-------0.0000.0000.0000.0000.0000.000
ppx_fail.v0.13.0-------AbortedAbortedAbortedAbortedAbortedAborted-------0.0000.0000.0000.0000.0000.000
ppx_fields_conv.v0.13.0-------AbortedAbortedAbortedAbortedAbortedAborted-------0.0000.0000.0000.0000.0000.000
ppx_hash.v0.13.0-------AbortedAbortedAbortedAbortedAbortedAborted-------0.0000.0000.0000.0000.0000.000
ppx_here.v0.13.0-------AbortedAbortedAbortedAbortedAbortedAborted-------0.0000.0000.0000.0000.0000.000
ppx_inline_test.v0.13.0-------AbortedAbortedAbortedAbortedAbortedAborted-------0.0000.0000.0000.0000.0000.000
ppx_jane.v0.13.0-------AbortedAbortedAbortedAbortedAbortedAborted-------0.0000.0000.0000.0000.0000.000
ppx_js_style.v0.13.0-------AbortedAbortedAbortedAbortedAbortedAborted-------0.0000.0000.0000.0000.0000.000
ppx_let.v0.13.0-------AbortedAbortedAbortedAbortedAbortedAborted-------0.0000.0000.0000.0000.0000.000
ppx_module_timer.v0.13.0-------AbortedAbortedAbortedAbortedAbortedAborted-------0.0000.0000.0000.0000.0000.000
ppx_optcomp.v0.13.0-------AbortedAbortedAbortedAbortedAbortedAborted-------0.0000.0000.0000.0000.0000.000
ppx_optional.v0.13.0-------AbortedAbortedAbortedAbortedAbortedAborted-------0.0000.0000.0000.0000.0000.000
ppx_pipebang.v0.13.0-------AbortedAbortedAbortedAbortedAbortedAborted-------0.0000.0000.0000.0000.0000.000
ppx_sexp_conv.v0.13.0-------AbortedAbortedAbortedAbortedAbortedAborted-------0.0000.0000.0000.0000.0000.000
ppx_sexp_message.v0.13.0-------AbortedAbortedAbortedAbortedAbortedAborted-------0.0000.0000.0000.0000.0000.000
ppx_sexp_value.v0.13.0-------AbortedAbortedAbortedAbortedAbortedAborted-------0.0000.0000.0000.0000.0000.000
ppx_stable.v0.13.0-------AbortedAbortedAbortedAbortedAbortedAborted-------0.0000.0000.0000.0000.0000.000
ppx_typerep_conv.v0.13.0-------AbortedAbortedAbortedAbortedAbortedAborted-------0.0000.0000.0000.0000.0000.000
ppx_variants_conv.v0.13.0-------AbortedAbortedAbortedAbortedAbortedAborted-------0.0000.0000.0000.0000.0000.000
ppxlib.0.12.0-------AbortedAbortedAbortedAbortedAbortedAborted-------0.0000.0000.0000.0000.0000.000
protocol_version_header.v0.13.0-------AbortedAbortedAbortedAbortedAbortedAborted-------0.0000.0000.0000.0000.0000.000
psmt2-frontend.0.2--------Aborted-AbortedAbortedAborted--------0.000-0.0000.0000.000
re.1.9.0-------AbortedAborted-AbortedAbortedAborted-------0.0000.000-0.0000.0000.000
result.1.4-------AbortedAborted-AbortedAbortedAborted-------0.0000.000-0.0000.0000.000
sauvola-bench.1.0-------AbortedAbortedAbortedAbortedAbortedAborted-------0.0000.0000.0000.0000.0000.000
seq.base----------AbortedAbortedAborted----------0.0000.0000.000
sequence-bench.1.0----------AbortedAbortedAborted----------0.0000.0000.000
sexplib.v0.13.0-------AbortedAborted-AbortedAbortedAborted-------0.0000.000-0.0000.0000.000
sexplib0.v0.13.0-------AbortedAborted-AbortedAbortedAborted-------0.0000.000-0.0000.0000.000
spawn.v0.13.0-------AbortedAborted-AbortedAbortedAborted-------0.0000.000-0.0000.0000.000
splittable_random.v0.13.0-------AbortedAbortedAbortedAbortedAbortedAborted-------0.0000.0000.0000.0000.0000.000
stdio.v0.13.0-------AbortedAborted-AbortedAbortedAborted-------0.0000.000-0.0000.0000.000
stdlib-shims.0.1.0-------AbortedAborted-AbortedAbortedAborted-------0.0000.000-0.0000.0000.000
stringext.1.6.0-------AbortedAborted-AbortedAbortedAborted-------0.0000.000-0.0000.0000.000
textutils.v0.13.0-------AbortedAbortedAbortedAbortedAbortedAborted-------0.0000.0000.0000.0000.0000.000
thread-bench.1.0----Failure (2)Failure (2)Failure (2)AbortedAbortedAbortedAbortedAbortedAborted----0.2060.2190.2220.0000.0000.0000.0000.0000.000
time_now.v0.13.0-------AbortedAbortedAbortedAbortedAbortedAborted-------0.0000.0000.0000.0000.0000.000
topkg.1.0.1----------AbortedAbortedAborted----------0.0000.0000.000
typerep.v0.13.0-------AbortedAborted-AbortedAbortedAborted-------0.0000.000-0.0000.0000.000
uchar.0.0.2----------AbortedAbortedAborted----------0.0000.0000.000
uri.3.1.0-------AbortedAborted-AbortedAbortedAborted-------0.0000.000-0.0000.0000.000
uri-sexp.3.1.0-------AbortedAbortedAbortedAbortedAbortedAborted-------0.0000.0000.0000.0000.0000.000
uutf.1.0.2----------AbortedAbortedAborted----------0.0000.0000.000
variantslib.v0.13.0-------AbortedAborted-AbortedAbortedAborted-------0.0000.000-0.0000.0000.000
yojson.1.7.0-------AbortedAborted-AbortedAbortedAborted-------0.0000.000-0.0000.0000.000
yojson-bench.1.0----Failure (2)Failure (2)Failure (2)AbortedAbortedFailure (2)AbortedAbortedAborted----0.1450.1950.1740.0000.0000.4250.0000.0000.000
zarith.1.9.1----------AbortedAbortedAborted----------0.0000.0000.000
Close

Error on yojson-bench.1.0 (4.08.0+trunk+bench)

Command:

/usr/bin/make -C yojson

Output

make: Entering directory '/home/louis/.opam/4.08.0+trunk+bench/.opam-switch/build/yojson-bench.1.0/yojson'
ocamlfind ocamlopt -I `ocamlfind query yojson` -o ydump_bench -package easy-format,biniou -linkpkg yojson.cmx yojson_biniou.cmx ydump.ml
gcc: error: /home/louis/.opam/4.08.0+trunk+bench/lib/yojson/yojson_biniou.o: No such file or directory
gcc: error: /home/louis/.opam/4.08.0+trunk+bench/lib/yojson/yojson.o: No such file or directory
File "caml_startup", line 1:
Error: Error during linking
Makefile:6: recipe for target 'all' failed
make: *** [all] Error 2
make: Leaving directory '/home/louis/.opam/4.08.0+trunk+bench/.opam-switch/build/yojson-bench.1.0/yojson'
Close

Error on yojson-bench.1.0 (4.07.1+oclassic+bench)

Command:

/usr/bin/make -C yojson

Output

make: Entering directory '/home/louis/.opam/4.07.1+clambda+bench/.opam-switch/build/yojson-bench.1.0/yojson'
ocamlfind ocamlopt -I `ocamlfind query yojson` -o ydump_bench -package easy-format,biniou -linkpkg yojson.cmx yojson_biniou.cmx ydump.ml
gcc: error: /home/louis/.opam/4.07.1+clambda+bench/lib/yojson/yojson_biniou.o: No such file or directory
gcc: error: /home/louis/.opam/4.07.1+clambda+bench/lib/yojson/yojson.o: No such file or directory
File "caml_startup", line 1:
Error: Error during linking
Makefile:6: recipe for target 'all' failed
make: *** [all] Error 2
make: Leaving directory '/home/louis/.opam/4.07.1+clambda+bench/.opam-switch/build/yojson-bench.1.0/yojson'
make: Entering directory '/home/louis/.opam/4.07.1+oclassic+bench/.opam-switch/build/yojson-bench.1.0/yojson'
ocamlfind ocamlopt -I `ocamlfind query yojson` -o ydump_bench -package easy-format,biniou -linkpkg yojson.cmx yojson_biniou.cmx ydump.ml
gcc: error: /home/louis/.opam/4.07.1+oclassic+bench/lib/yojson/yojson_biniou.o: No such file or directory
gcc: error: /home/louis/.opam/4.07.1+oclassic+bench/lib/yojson/yojson.o: No such file or directory
File "caml_startup", line 1:
Error: Error during linking
Makefile:6: recipe for target 'all' failed
make: *** [all] Error 2
make: Leaving directory '/home/louis/.opam/4.07.1+oclassic+bench/.opam-switch/build/yojson-bench.1.0/yojson'
Close

Error on yojson-bench.1.0 (4.07.1+flambda+bench)

Command:

/usr/bin/make -C yojson

Output

make: Entering directory '/home/louis/.opam/4.07.1+flambda+bench/.opam-switch/build/yojson-bench.1.0/yojson'
ocamlfind ocamlopt -I `ocamlfind query yojson` -o ydump_bench -package easy-format,biniou -linkpkg yojson.cmx yojson_biniou.cmx ydump.ml
gcc: error: /home/louis/.opam/4.07.1+flambda+bench/lib/yojson/yojson_biniou.o: No such file or directory
gcc: error: /home/louis/.opam/4.07.1+flambda+bench/lib/yojson/yojson.o: No such file or directory
File "caml_startup", line 1:
Error: Error during linking
Makefile:6: recipe for target 'all' failed
make: *** [all] Error 2
make: Leaving directory '/home/louis/.opam/4.07.1+flambda+bench/.opam-switch/build/yojson-bench.1.0/yojson'
Close

Error on yojson-bench.1.0 (4.07.1+clambda+bench)

Command:

/usr/bin/make -C yojson

Output

make: Entering directory '/home/louis/.opam/4.07.1+oclassic+bench/.opam-switch/build/yojson-bench.1.0/yojson'
ocamlfind ocamlopt -I `ocamlfind query yojson` -o ydump_bench -package easy-format,biniou -linkpkg yojson.cmx yojson_biniou.cmx ydump.ml
gcc: error: /home/louis/.opam/4.07.1+oclassic+bench/lib/yojson/yojson_biniou.o: No such file or directory
gcc: error: /home/louis/.opam/4.07.1+oclassic+bench/lib/yojson/yojson.o: No such file or directory
File "caml_startup", line 1:
Error: Error during linking
Makefile:6: recipe for target 'all' failed
make: *** [all] Error 2
make: Leaving directory '/home/louis/.opam/4.07.1+oclassic+bench/.opam-switch/build/yojson-bench.1.0/yojson'
make: Entering directory '/home/louis/.opam/4.07.1+clambda+bench/.opam-switch/build/yojson-bench.1.0/yojson'
ocamlfind ocamlopt -I `ocamlfind query yojson` -o ydump_bench -package easy-format,biniou -linkpkg yojson.cmx yojson_biniou.cmx ydump.ml
gcc: error: /home/louis/.opam/4.07.1+clambda+bench/lib/yojson/yojson_biniou.o: No such file or directory
gcc: error: /home/louis/.opam/4.07.1+clambda+bench/lib/yojson/yojson.o: No such file or directory
File "caml_startup", line 1:
Error: Error during linking
Makefile:6: recipe for target 'all' failed
make: *** [all] Error 2
make: Leaving directory '/home/louis/.opam/4.07.1+clambda+bench/.opam-switch/build/yojson-bench.1.0/yojson'
Close

Error on thread-bench.1.0 (4.07.1+oclassic+bench)

Command:

/usr/bin/make -C thread

Output

make: Entering directory '/home/louis/.opam/4.07.1+clambda+bench/.opam-switch/build/thread-bench.1.0/thread'
ocamlfind ocamlopt -package lwt.unix -linkpkg -o thread_sleep_lwt thread_sleep_lwt.ml
ocamlfind: [WARNING] Package `threads': Linking problems may arise because of the missing -thread or -vmthread switch
ocamlfind ocamlopt -package lwt.unix -linkpkg -o thread_ring_lwt_mvar thread_ring_lwt_mvar.ml
ocamlfind: [WARNING] Package `threads': Linking problems may arise because of the missing -thread or -vmthread switch
ocamlfind ocamlopt -package lwt.unix -linkpkg -o thread_ring_lwt_stream thread_ring_lwt_stream.ml
ocamlfind: [WARNING] Package `threads': Linking problems may arise because of the missing -thread or -vmthread switch
ocamlfind ocamlopt -thread -package async -linkpkg -o thread_sleep_async thread_sleep_async.ml
File "thread_sleep_async.ml", line 1, characters 5-13:
Error: Unbound module Core.Std
Makefile:10: recipe for target 'thread_sleep_async' failed
make: *** [thread_sleep_async] Error 2
make: Leaving directory '/home/louis/.opam/4.07.1+clambda+bench/.opam-switch/build/thread-bench.1.0/thread'
make: Entering directory '/home/louis/.opam/4.07.1+oclassic+bench/.opam-switch/build/thread-bench.1.0/thread'
ocamlfind ocamlopt -package lwt.unix -linkpkg -o thread_sleep_lwt thread_sleep_lwt.ml
ocamlfind: [WARNING] Package `threads': Linking problems may arise because of the missing -thread or -vmthread switch
File "thread_sleep_lwt.ml", line 1:
Error: No implementations provided for the following modules:
         Mutex referenced from /home/louis/.opam/4.07.1+oclassic+bench/lib/lwt/unix/lwt_unix.cmxa(Lwt_main)
Makefile:7: recipe for target 'thread_sleep_lwt' failed
make: *** [thread_sleep_lwt] Error 2
make: Leaving directory '/home/louis/.opam/4.07.1+oclassic+bench/.opam-switch/build/thread-bench.1.0/thread'
Close

Error on thread-bench.1.0 (4.07.1+flambda+bench)

Command:

/usr/bin/make -C thread

Output

make: Entering directory '/home/louis/.opam/4.07.1+flambda+bench/.opam-switch/build/thread-bench.1.0/thread'
ocamlfind ocamlopt -package lwt.unix -linkpkg -o thread_sleep_lwt thread_sleep_lwt.ml
ocamlfind: [WARNING] Package `threads': Linking problems may arise because of the missing -thread or -vmthread switch
File "thread_sleep_lwt.ml", line 1:
Error: No implementations provided for the following modules:
         Mutex referenced from /home/louis/.opam/4.07.1+flambda+bench/lib/lwt/unix/lwt_unix.cmxa(Lwt_main)
Makefile:7: recipe for target 'thread_sleep_lwt' failed
make: *** [thread_sleep_lwt] Error 2
make: Leaving directory '/home/louis/.opam/4.07.1+flambda+bench/.opam-switch/build/thread-bench.1.0/thread'
Close

Error on thread-bench.1.0 (4.07.1+clambda+bench)

Command:

/usr/bin/make -C thread

Output

make: Entering directory '/home/louis/.opam/4.07.1+oclassic+bench/.opam-switch/build/thread-bench.1.0/thread'
ocamlfind ocamlopt -package lwt.unix -linkpkg -o thread_sleep_lwt thread_sleep_lwt.ml
ocamlfind: [WARNING] Package `threads': Linking problems may arise because of the missing -thread or -vmthread switch
ocamlfind ocamlopt -package lwt.unix -linkpkg -o thread_ring_lwt_mvar thread_ring_lwt_mvar.ml
ocamlfind: [WARNING] Package `threads': Linking problems may arise because of the missing -thread or -vmthread switch
ocamlfind ocamlopt -package lwt.unix -linkpkg -o thread_ring_lwt_stream thread_ring_lwt_stream.ml
ocamlfind: [WARNING] Package `threads': Linking problems may arise because of the missing -thread or -vmthread switch
ocamlfind ocamlopt -thread -package async -linkpkg -o thread_sleep_async thread_sleep_async.ml
File "thread_sleep_async.ml", line 1, characters 5-13:
Error: Unbound module Core.Std
Makefile:10: recipe for target 'thread_sleep_async' failed
make: *** [thread_sleep_async] Error 2
make: Leaving directory '/home/louis/.opam/4.07.1+oclassic+bench/.opam-switch/build/thread-bench.1.0/thread'
make: Entering directory '/home/louis/.opam/4.07.1+clambda+bench/.opam-switch/build/thread-bench.1.0/thread'
ocamlfind ocamlopt -package lwt.unix -linkpkg -o thread_sleep_lwt thread_sleep_lwt.ml
ocamlfind: [WARNING] Package `threads': Linking problems may arise because of the missing -thread or -vmthread switch
File "thread_sleep_lwt.ml", line 1:
Error: No implementations provided for the following modules:
         Mutex referenced from /home/louis/.opam/4.07.1+clambda+bench/lib/lwt/unix/lwt_unix.cmxa(Lwt_main)
Makefile:7: recipe for target 'thread_sleep_lwt' failed
make: *** [thread_sleep_lwt] Error 2
make: Leaving directory '/home/louis/.opam/4.07.1+clambda+bench/.opam-switch/build/thread-bench.1.0/thread'
Close

Error on pcre.7.4.3 (4.08.0+trunk+bench)

Command:

~/.opam/4.08.0+trunk+bench/bin/dune build -p pcre -j 7

Output

    ocamlopt src/config/discover.exe (exit 2)
(cd _build/default && /home/louis/.opam/4.08.0+trunk+bench/bin/ocamlopt.opt -w -40 -g -O3 -o src/config/discover.exe /home/louis/.opam/4.08.0+trunk+bench/lib/base/base_internalhash_types/base_internalhash_types.cmxa -I /home/louis/.opam/4.08.0+trunk+bench/lib/base/base_internalhash_types /home/louis/.opam/4.08.0+trunk+bench/lib/base/caml/caml.cmxa /home/louis/.opam/4.08.0+trunk+bench/lib/sexplib0/sexplib0.cmxa /home/louis/.opam/4.08.0+trunk+bench/lib/base/shadow_stdlib/shadow_stdlib.cmxa /home/louis/.opam/4.08.0+trunk+bench/lib/base/base.cmxa -I /home/louis/.opam/4.08.0+trunk+bench/lib/base /home/louis/.opam/4.08.0+trunk+bench/lib/ocaml/unix.cmxa -I /home/louis/.opam/4.08.0+trunk+bench/lib/ocaml /home/louis/.opam/4.08.0+trunk+bench/lib/dune-private-libs/stdune/stdune.cmxa -I /home/louis/.opam/4.08.0+trunk+bench/lib/dune-private-libs/stdune /home/louis/.opam/4.08.0+trunk+bench/lib/dune-private-libs/ocaml-config/ocaml_config.cmxa /home/louis/.opam/4.08.0+trunk+bench/lib/dune-private-libs/dune-lang/dune_lang.cmxa /home/louis/.opam/4.08.0+trunk+bench/lib/dune-configurator/configurator.cmxa src/config/.discover.eobjs/native/discover.cmx)
/home/louis/.opam/4.08.0+trunk+bench/lib/base/libbase_stubs.a(exn_stubs.o): In function `Base_clear_caml_backtrace_pos':
/home/louis/.opam/4.08.0+trunk+bench/.opam-switch/build/base.v0.13.0/_build/default/src/exn_stubs.c:6: undefined reference to `caml_backtrace_pos'
collect2: error: ld returned 1 exit status
File "caml_startup", line 1:
Error: Error during linking
Close

Error on ocaml-variants.4.08.0+trunk+flambda+opt (4.08.0+trunk+flambda+opt+bench)

Command:

~/.opam/4.08.0+trunk+flambda+opt+bench/.opam-switch/build/ocaml-variants.4.08.0+trunk+flambda+opt/./configure -prefix /home/louis/.opam/4.08.0+trunk+flambda+opt+bench -flambda -with-debug-runtime

Output

configure: error: unrecognized option: `-flambda'
Try `/home/louis/.opam/4.08.0+trunk+flambda+opt+bench/.opam-switch/build/ocaml-variants.4.08.0+trunk+flambda+opt/./configure --help' for more information
Close

Error on ocaml-variants.4.08.0+trunk+flambda+oclassic (4.08.0+trunk+flambda+oclassic+bench)

Command:

~/.opam/4.08.0+trunk+flambda+oclassic+bench/.opam-switch/build/ocaml-variants.4.08.0+trunk+flambda+oclassic/./configure -prefix /home/louis/.opam/4.08.0+trunk+flambda+oclassic+bench -flambda -with-debug-runtime

Output

configure: error: unrecognized option: `-flambda'
Try `/home/louis/.opam/4.08.0+trunk+flambda+oclassic+bench/.opam-switch/build/ocaml-variants.4.08.0+trunk+flambda+oclassic/./configure --help' for more information
Close

Error on ocaml-variants.4.08.0+trunk+flambda (4.08.0+trunk+flambda+bench)

Command:

~/.opam/4.08.0+trunk+flambda+bench/.opam-switch/build/ocaml-variants.4.08.0+trunk+flambda/./configure -prefix /home/louis/.opam/4.08.0+trunk+flambda+bench -flambda -with-debug-runtime

Output

configure: error: unrecognized option: `-flambda'
Try `/home/louis/.opam/4.08.0+trunk+flambda+bench/.opam-switch/build/ocaml-variants.4.08.0+trunk+flambda/./configure --help' for more information
Close

Error on ocaml-migrate-parsetree.1.5.0 (4.08.0+trunk+bench)

Command:

~/.opam/4.08.0+trunk+bench/bin/dune build -p ocaml-migrate-parsetree -j 7

Output

       ocaml src/ast-version,src/compiler-functions-file (exit 1)
(cd _build/default/src && /home/louis/.opam/4.08.0+trunk+bench/bin/ocaml config/gen.ml 4.11.0+dev0-2019-10-18)
Unkown OCaml version 4.11.0+dev0-2019-10-18
Close

Error on numerical-analysis-bench.1.0 (4.08.0+trunk+bench)

Command:

/usr/bin/make

Output

ulimit -s 98304; ocamlopt.opt  -I simple_access `ocamldep.opt -sort simple_access/*.ml` main_nogcstats.ml -o simple_access.opt
ulimit -s 98304; ocamlopt.opt  -I lu-decomposition `ocamldep.opt -sort lu-decomposition/*.ml` main_nogcstats.ml -o lu-decomposition.opt
ulimit -s 98304; ocamlopt.opt  -I fft `ocamldep.opt -sort fft/*.ml` main_nogcstats.ml -o fft.opt
ulimit -s 98304; ocamlopt.opt  -I rnd_access `ocamldep.opt -sort rnd_access/*.ml` main_nogcstats.ml -o rnd_access.opt
ulimit -s 98304; ocamlopt.opt  -I k-means `ocamldep.opt -sort k-means/*.ml` main_nogcstats.ml -o k-means.opt
Fatal error: exception Stack overflow
Makefile:20: recipe for target 'k-means.opt' failed
make: *** [k-means.opt] Error 2
Close

Error on numerical-analysis-bench.1.0 (4.08.0+gpr2165+bench)

Command:

/usr/bin/make

Output

ulimit -s 98304; ocamlopt.opt  -I simple_access `ocamldep.opt -sort simple_access/*.ml` main_nogcstats.ml -o simple_access.opt
ulimit -s 98304; ocamlopt.opt  -I lu-decomposition `ocamldep.opt -sort lu-decomposition/*.ml` main_nogcstats.ml -o lu-decomposition.opt
ulimit -s 98304; ocamlopt.opt  -I fft `ocamldep.opt -sort fft/*.ml` main_nogcstats.ml -o fft.opt
ulimit -s 98304; ocamlopt.opt  -I rnd_access `ocamldep.opt -sort rnd_access/*.ml` main_nogcstats.ml -o rnd_access.opt
ulimit -s 98304; ocamlopt.opt  -I k-means `ocamldep.opt -sort k-means/*.ml` main_nogcstats.ml -o k-means.opt
Fatal error: exception Stack overflow
Makefile:20: recipe for target 'k-means.opt' failed
make: *** [k-means.opt] Error 2
Close

Error on dune.2.1.3 (4.08.0+mutmatch+bench)

Command:

~/.opam/4.08.0+mutmatch+bench/bin/ocaml bootstrap.ml -j 7

Output

ocamlc -custom -w -24 -g -o .duneboot.exe -I boot unix.cma boot/libs.ml boot/duneboot.ml
./.duneboot.exe -j 7
cd _boot && /home/louis/.opam/4.08.0+mutmatch+bench/bin/ocamldep.opt -modules -map main__.ml -map build_info__.ml -map dune.ml -map dune_action_plugin__.ml -map jbuild_support.ml -map dune_glob__.ml -map dune_re__.ml -map dune_cache_daemon__.ml -map dune_cache__.ml -map memo__.ml -map dag__.ml -map incremental_cycles__.ml -map dune_lang__.ml -map stdune__.ml -args source_files
File "src/stdune/result.ml", line 58, characters 8-11:
Error: Syntax error: operator expected.
File "src/stdune/daemonize.ml", line 83, characters 11-13:
Error: Syntax error: operator expected.
File "src/stdune/loc.ml", line 51, characters 7-8:
Error: Syntax error
File "src/stdune/csexp.ml", line 80, characters 5-6:
Error: Syntax error
File "src/stdune/option.mli", line 12, characters 8-11:
Error: Syntax error: operator expected.
File "src/stdune/result.mli", line 27, characters 8-11:
Error: Syntax error: operator expected.
File "src/stdune/option.ml", line 16, characters 8-11:
Error: Syntax error: operator expected.
File "src/dune_lang/syntax.ml", line 156, characters 9-16:
Error: Syntax error
File "src/dune_lang/decoder.mli", line 234, characters 6-9:
Error: Syntax error: operator expected.
File "src/dune_lang/versioned_file.ml", line 105, characters 7-8:
Error: Syntax error
File "src/dune_lang/decoder.ml", line 98, characters 6-9:
Error: Syntax error: operator expected.
File "src/fiber/fiber.ml", line 198, characters 8-11:
Error: Syntax error: operator expected.
File "src/fiber/fiber.mli", line 37, characters 8-11:
Error: Syntax error: operator expected.
File "src/memo/memo.ml", line 117, characters 13-16:
Error: Syntax error: operator expected.
File "src/dune_cache/dune_cache.ml", line 127, characters 11-16:
Error: Syntax error
File "src/dune_cache_daemon/dune_cache_daemon.ml", line 165, characters 8-9:
Error: Syntax error: operator expected.
File "src/dune_cache_daemon/messages.ml", line 85, characters 13-18:
Error: Syntax error
File "src/ocaml-config/ocaml_config.ml", line 270, characters 7-8:
Error: Syntax error
File "otherlibs/action-plugin/src/dune_action_plugin.ml", line 189, characters 10-13:
Error: Syntax error: operator expected.
File "otherlibs/action-plugin/src/protocol.ml", line 106, characters 11-12:
Error: Syntax error
File "otherlibs/action-plugin/src/dune_action_plugin.mli", line 52, characters 10-13:
Error: Syntax error: operator expected.
File "otherlibs/action-plugin/src/serializable_intf.ml", line 40, characters 7-8:
Error: Syntax error
File "src/dune/dep_conf.ml", line 28, characters 7-8:
Error: Syntax error
File "src/dune/profile.ml", line 41, characters 7-11:
Error: Syntax error
File "src/dune/dune_init.ml", line 86, characters 9-10:
Error: Syntax error: operator expected.
File "src/dune/obj_dir.ml", line 64, characters 12-23:
Error: Syntax error: operator expected.
File "src/dune/ocamldep.ml", line 106, characters 12-17:
Error: Syntax error: operator expected.
File "src/dune/ordered_set_lang.ml", line 88, characters 13-22:
Error: Syntax error
File "src/dune/super_context.ml", line 133, characters 7-8:
Error: Syntax error
File "src/dune/module.ml", line 281, characters 10-14:
Error: Syntax error: operator expected.
File "src/dune/lib_info.ml", line 45, characters 14-25:
Error: Syntax error: operator expected.
File "src/dune/vcs.ml", line 47, characters 12-16:
Error: Syntax error: operator expected.
File "src/dune/dialect.ml", line 42, characters 9-12:
Error: Syntax error
File "src/dune/sub_system.ml", line 40, characters 7-8:
Error: Syntax error
File "src/dune/findlib/findlib.ml", line 430, characters 9-10:
Error: Syntax error
File "src/dune/format_config.ml", line 54, characters 9-17:
Error: Syntax error
File "src/dune/dune_load.ml", line 182, characters 11-12:
Error: Syntax error: operator expected.
File "src/dune/predicate_lang.ml", line 38, characters 9-10:
Error: Syntax error
File "src/dune/ocaml_stdlib.ml", line 21, characters 10-31:
Error: Syntax error: operator expected.
File "src/dune/stats.ml", line 62, characters 9-15:
Error: Syntax error
File "src/dune/lib.ml", line 367, characters 9-13:
Error: Syntax error: operator expected.
File "src/dune/context.ml", line 194, characters 7-8:
Error: Syntax error
File "src/dune/file_tree.ml", line 440, characters 9-10:
Error: Syntax error
File "src/dune/dep_graph.ml", line 25, characters 7-17:
Error: Syntax error
File "src/dune/expander.ml", line 138, characters 9-22:
Error: Syntax error: operator expected.
File "src/dune/case_lang.ml", line 12, characters 10-11:
Error: Syntax error: operator expected.
File "src/dune/module_compilation.ml", line 27, characters 7-11:
Error: Syntax error
File "src/dune/mode.ml", line 127, characters 14-18:
Error: Syntax error: operator expected.
File "src/dune/install_rules.ml", line 227, characters 13-14:
Error: Syntax error: operator expected.
File "src/dune/artifact_substitution.ml", line 333, characters 11-12:
Error: Syntax error: operator expected.
File "src/dune/dune_file.ml", line 33, characters 8-9:
Error: Syntax error: operator expected.
File "src/dune/lib_kind.ml", line 17, characters 9-10:
Error: Syntax error
File "src/dune/pform.ml", line 280, characters 7-8:
Error: Syntax error
File "src/dune/action_exec.ml", line 139, characters 7-8:
Error: Syntax error
File "src/dune/workspace.ml", line 88, characters 11-14:
Error: Syntax error
File "src/dune/string_with_vars.ml", line 40, characters 7-21:
Error: Syntax error
File "src/dune/wrapped.ml", line 14, characters 17-18:
Error: Syntax error: operator expected.
File "src/dune/foreign.ml", line 94, characters 5-6:
Error: Syntax error
File "src/dune/build.mli", line 19, characters 8-11:
Error: Syntax error: operator expected.
File "src/dune/preprocessing.ml", line 147, characters 16-19:
Error: Syntax error: operator expected.
File "src/dune/process.ml", line 452, characters 5-6:
Error: Syntax error
File "src/dune/config.ml", line 226, characters 7-14:
Error: Syntax error
File "src/dune/gen_rules.ml", line 398, characters 11-18:
Error: Syntax error
File "src/dune/file_binding.ml", line 65, characters 13-20:
Error: Syntax error
File "src/dune/odoc.ml", line 151, characters 10-14:
Error: Syntax error: operator expected.
File "src/dune/dir_contents.ml", line 376, characters 15-16:
Error: Syntax error: operator expected.
File "src/dune/dpath.ml", line 153, characters 9-18:
Error: Syntax error
File "src/dune/dune_env.ml", line 13, characters 9-10:
Error: Syntax error
File "src/dune/dune_package.ml", line 111, characters 10-11:
Error: Syntax error: operator expected.
File "src/dune/modules.ml", line 48, characters 12-28:
Error: Syntax error: operator expected.
File "src/dune/foreign_rules.ml", line 166, characters 16-17:
Error: Syntax error: operator expected.
File "src/dune/sub_dirs.ml", line 115, characters 11-12:
Error: Syntax error
File "src/dune/cinaps.ml", line 24, characters 10-13:
Error: Syntax error: operator expected.
File "src/dune/diff.ml", line 22, characters 7-12:
Error: Syntax error
File "src/dune/alias.ml", line 66, characters 7-8:
Error: Syntax error
File "src/dune/opam_create.ml", line 160, characters 10-18:
Error: Syntax error: operator expected.
File "src/dune/dune_project.ml", line 364, characters 11-12:
Error: Syntax error
File "src/dune/print_diff.ml", line 45, characters 7-8:
Error: Syntax error
File "src/dune/merlin.ml", line 139, characters 9-10:
Error: Syntax error: operator expected.
File "src/dune/utop.ml", line 26, characters 5-6:
Error: Syntax error: operator expected.
File "src/dune/link_time_code_gen.ml", line 181, characters 7-15:
Error: Syntax error
File "src/dune/dep_rules.ml", line 29, characters 12-13:
Error: Syntax error: operator expected.
File "src/dune/bindings.ml", line 40, characters 7-8:
Error: Syntax error
File "src/dune/build.ml", line 58, characters 8-11:
Error: Syntax error: operator expected.
File "src/dune/format_rules.ml", line 49, characters 11-12:
Error: Syntax error
File "src/dune/scheduler.ml", line 600, characters 7-8:
Error: Syntax error
File "src/dune/lib_dep.ml", line 14, characters 12-13:
Error: Syntax error: operator expected.
File "src/dune/action_ast.ml", line 57, characters 19-23:
Error: Syntax error: operator expected.
File "src/dune/package.ml", line 50, characters 7-8:
Error: Syntax error
File "src/dune/main.ml", line 62, characters 7-15:
Error: Syntax error
File "src/dune/foreign_sources.ml", line 85, characters 13-14:
Error: Syntax error: operator expected.
File "src/dune/artifacts.ml", line 63, characters 9-12:
Error: Syntax error
File "src/dune/watermarks.ml", line 198, characters 13-16:
Error: Syntax error
File "src/dune/ocaml_flags.ml", line 81, characters 9-15:
Error: Syntax error
File "src/dune/exe_rules.ml", line 94, characters 9-14:
Error: Syntax error
File "src/dune/rules.ml", line 32, characters 15-16:
Error: Syntax error: operator expected.
File "src/dune/blang.ml", line 77, characters 15-16:
Error: Syntax error: operator expected.
File "src/dune/build_system.ml", line 146, characters 9-10:
Error: Syntax error
File "src/dune/inline_tests.ml", line 35, characters 16-19:
Error: Syntax error: operator expected.
File "bin/external_lib_deps.ml", line 117, characters 7-13:
Error: Syntax error
File "bin/install_uninstall.ml", line 18, characters 7-8:
Error: Syntax error
File "bin/format_dune_file.ml", line 19, characters 7-15:
Error: Syntax error
File "bin/init.ml", line 57, characters 7-18:
Error: Syntax error
File "bin/help.ml", line 103, characters 10-20:
Error: Syntax error
File "bin/installed_libraries.ml", line 9, characters 7-13:
Error: Syntax error
File "bin/printenv.ml", line 16, characters 7-10:
Error: Syntax error
File "bin/cache_daemon.ml", line 62, characters 7-8:
Error: Syntax error
File "bin/common.ml", line 11, characters 8-11:
Error: Syntax error: operator expected.
File "bin/exec.ml", line 31, characters 7-13:
Error: Syntax error
File "bin/subst.ml", line 61, characters 7-8:
Error: Syntax error
File "bin/compute.ml", line 19, characters 10-16:
Error: Syntax error
File "bin/utop.ml", line 17, characters 7-13:
Error: Syntax error
File "bin/print_rules.ml", line 77, characters 9-17:
Error: Syntax error
File "bin/import.ml", line 85, characters 7-8:
Error: Syntax error
File "bin/upgrade.ml", line 17, characters 7-13:
Error: Syntax error
File "bin/main.ml", line 7, characters 7-8:
Error: Syntax error
File "bin/common.mli", line 60, characters 8-11:
Error: Syntax error: operator expected.
Close

Error on dune.2.1.3 (4.08.0+gpr2165+bench)

Command:

~/.opam/4.08.0+gpr2165+bench/bin/ocaml bootstrap.ml -j 7

Output

ocamlc -output-complete-exe -w -24 -g -o .duneboot.exe -I boot unix.cma boot/libs.ml boot/duneboot.ml
ocamlc: unknown option '-output-complete-exe'.
Usage: ocamlc <options> <files>
Options are:
  -a  Build a library
  -alert <list>  Enable or disable alerts according to <list>:
        +<alertname>  enable alert <alertname>
        -<alertname>  disable alert <alertname>
        ++<alertname> treat <alertname> as fatal error
        --<alertname> treat <alertname> as non-fatal
        @<alertname>  enable <alertname> and treat it as fatal error
    <alertname> can be 'all' to refer to all alert names
  -absname  Show absolute filenames in error messages
  -annot  Save information in <filename>.annot
  -bin-annot  Save typedtree in <filename>.cmt
  -c  Compile only (do not link)
  -cc <command>  Use <command> as the C compiler and linker
  -cclib <opt>  Pass option <opt> to the C linker
  -ccopt <opt>  Pass option <opt> to the C compiler and linker
  -color {auto|always|never}  Enable or disable colors in compiler messages
    The following settings are supported:
      auto    use heuristics to enable colors only if supported
      always  enable colors
      never   disable colors
    The default setting is 'auto', and the current heuristic
    checks that the TERM environment variable exists and is
    not empty or "dumb", and that isatty(stderr) holds.
  If the option is not specified, these setting can alternatively
  be set through the OCAML_COLOR environment variable.
  -error-style {contextual|short}  Control the way error messages and warnings are printed
    The following settings are supported:
      short       only print the error and its location
      contextual  like "short", but also display the source code
                  snippet corresponding to the location of the error
    The default setting is 'contextual'.
  If the option is not specified, these setting can alternatively
  be set through the OCAML_ERROR_STYLE environment variable.
  -compat-32  Check that generated bytecode can run on 32-bit platforms
  -config  Print configuration values and exit
  -config-var  Print the value of a configuration variable, a newline, and exit
    (print nothing and exit with error value if the variable does not exist)
  -custom  Link in custom mode
  -dllib <lib>  Use the dynamically-loaded library <lib>
  -dllpath <dir>  Add <dir> to the run-time search path for shared libraries
  -dtypes  (deprecated) same as -annot
  -for-pack <ident>  Generate code that can later be `packed' with
     ocamlc -pack -o <ident>.cmo
  -g  Save debugging information
  -stop-after {parsing|typing} Stop after the given compilation pass.
  -i  Print inferred interface
  -I <dir>  Add <dir> to the list of include directories
  -impl <file>  Compile <file> as a .ml file
  -intf <file>  Compile <file> as a .mli file
  -intf-suffix <string>  Suffix for interface files (default: .mli)
  -intf_suffix <string>  (deprecated) same as -intf-suffix
  -keep-docs  Keep documentation strings in .cmi files
  -no-keep-docs  Do not keep documentation strings in .cmi files (default)
  -keep-locs  Keep locations in .cmi files (default)
  -no-keep-locs  Do not keep locations in .cmi files
  -labels  Use commuting label mode
  -linkall  Link all modules, even unused ones
  -make-runtime  Build a runtime system with given C objects and libraries
  -make_runtime  (deprecated) same as -make-runtime
  -modern  (deprecated) same as -labels
  -alias-deps  Do record dependencies for module aliases
  -no-alias-deps  Do not record dependencies for module aliases
  -app-funct  Activate applicative functors
  -no-app-funct  Deactivate applicative functors
  -no-check-prims  Do not check runtime for primitives
  -noassert  Do not compile assertion checks
  -noautolink  Do not automatically link C libraries specified in .cma files
  -nolabels  Ignore non-optional labels in types
  -nostdlib  Do not add default directory to the list of include directories
  -nopervasives  (undocumented)
  -o <file>  Set output file name to <file>
  -opaque  Does not generate cross-module optimization information
     (reduces necessary recompilation on module change)
  -open <module>  Opens the module <module> before typing
  -output-obj  Output an object file instead of an executable
  -output-complete-obj  Output an object file, including runtime, instead of an executable
  -pack  Package the given .cmo files into one .cmo
  -pp <command>  Pipe sources through preprocessor <command>
  -ppx <command>  Pipe abstract syntax trees through preprocessor <command>
  -plugin <plugin>  (no longer supported)
  -principal  Check principality of type inference
  -no-principal  Do not check principality of type inference (default)
  -rectypes  Allow arbitrary recursive types
  -no-rectypes  Do not allow arbitrary recursive types (default)
  -runtime-variant <str>  Use the <str> variant of the run-time system
  -with-runtime Include the runtime system in the generated program (default)
  -without-runtime Do not include the runtime system in the generated program.
  -safe-string  Make strings immutable (default)
  -short-paths  Shorten paths in types
  -strict-sequence  Left-hand part of a sequence must have type unit
  -no-strict-sequence  Left-hand part of a sequence need not have type unit (default)
  -strict-formats  Reject invalid formats accepted by legacy implementations
     (Warning: Invalid formats may behave differently from
      previous OCaml versions, and will become always-rejected
      in future OCaml versions. You should always use this flag
      to detect invalid formats so you can fix them.)
  -no-strict-formats  Accept invalid formats accepted by legacy implementations (default)
     (Warning: Invalid formats may behave differently from
      previous OCaml versions, and will become always-rejected
      in future OCaml versions. You should never use this flag
      and instead fix invalid formats.)
  -thread  (deprecated) same as -I +threads
  -unboxed-types  unannotated unboxable types will be unboxed
  -no-unboxed-types  unannotated unboxable types will not be unboxed (default)
  -unsafe  Do not compile bounds checking on array and string access
  -unsafe-string  Make strings mutable
  -use-runtime <file>  Generate bytecode for the given runtime system
  -use_runtime <file>  (deprecated) same as -use-runtime
  -v  Print compiler version and location of standard library and exit
  -verbose  Print calls to external commands
  -version  Print version and exit
  --version  Print version and exit
  -vmthread   (no longer supported)
  -vnum  Print version number and exit
  -w <list>  Enable or disable warnings according to <list>:
        +<spec>   enable warnings in <spec>
        -<spec>   disable warnings in <spec>
        @<spec>   enable warnings in <spec> and treat them as errors
     <spec> can be:
        <num>             a single warning number
        <num1>..<num2>    a range of consecutive warning numbers
        <letter>          a predefined set
     default setting is "+a-4-6-7-9-27-29-32..42-44-45-48-50-60-66"
  -warn-error <list>  Enable or disable error status for warnings according
     to <list>.  See option -w for the syntax of <list>.
     Default setting is "-a+31"
  -warn-help  Show description of warning numbers
  -where  Print location of standard library and exit
  - <file>  Treat <file> as a file name (even if it starts with `-')
  -match-context-rows <n>  (advanced, see manual section 9.2.)
  -use-prims <file>  (undocumented)
  -dno-unique-ids  (undocumented)
  -dunique-ids  (undocumented)
  -dsource  (undocumented)
  -dparsetree  (undocumented)
  -dtypedtree  (undocumented)
  -drawlambda  (undocumented)
  -dlambda  (undocumented)
  -dinstr  (undocumented)
  -dcamlprimc  (undocumented)
  -dtimings  Print timings information for each pass
  -dprofile  Print performance information for each pass
    The columns are: time alloc top-heap absolute-top-heap.
  -dump-into-file  dump output like -dlambda into <target>.dump
  -args <file> Read additional newline-terminated command line arguments
      from <file>
  -args0 <file> Read additional null character terminated command line arguments
from <file>
  -depend <options> Compute dependencies (use 'ocamlc -depend -help' for details)
  -help  Display this list of options
  --help  Display this list of options
Close

Error on core-micro-bench.1.0 (4.07.1+oclassic+bench)

Command:

/usr/bin/make -C core_micro

Output

make: Entering directory '/home/louis/.opam/4.07.1+clambda+bench/.opam-switch/build/core-micro-bench.1.0/core_micro'
ocamlbuild -use-ocamlfind runner.native
ocamlfind ocamldep -package str -package core -package core_bench.inline_benchmarks -modules runner.ml > runner.ml.depends
ocamlfind ocamlc -c -thread -package str -package core -package core_bench.inline_benchmarks -o runner.cmo runner.ml
+ ocamlfind ocamlc -c -thread -package str -package core -package core_bench.inline_benchmarks -o runner.cmo runner.ml
File "runner.ml", line 1, characters 5-13:
Error: Unbound module Core.Std
Command exited with code 2.
Makefile:4: recipe for target 'all' failed
make: *** [all] Error 10
make: Leaving directory '/home/louis/.opam/4.07.1+clambda+bench/.opam-switch/build/core-micro-bench.1.0/core_micro'
make: Entering directory '/home/louis/.opam/4.07.1+oclassic+bench/.opam-switch/build/core-micro-bench.1.0/core_micro'
ocamlbuild -use-ocamlfind runner.native
ocamlfind ocamldep -package str -package core -package core_bench.inline_benchmarks -modules runner.ml > runner.ml.depends
ocamlfind ocamlc -c -thread -package str -package core -package core_bench.inline_benchmarks -o runner.cmo runner.ml
+ ocamlfind ocamlc -c -thread -package str -package core -package core_bench.inline_benchmarks -o runner.cmo runner.ml
File "runner.ml", line 1, characters 5-13:
Error: Unbound module Core.Std
Command exited with code 2.
Makefile:4: recipe for target 'all' failed
make: *** [all] Error 10
make: Leaving directory '/home/louis/.opam/4.07.1+oclassic+bench/.opam-switch/build/core-micro-bench.1.0/core_micro'
Close

Error on core-micro-bench.1.0 (4.07.1+flambda+bench)

Command:

/usr/bin/make -C core_micro

Output

make: Entering directory '/home/louis/.opam/4.07.1+flambda+bench/.opam-switch/build/core-micro-bench.1.0/core_micro'
ocamlbuild -use-ocamlfind runner.native
ocamlfind ocamldep -package str -package core -package core_bench.inline_benchmarks -modules runner.ml > runner.ml.depends
ocamlfind ocamlc -c -thread -package str -package core -package core_bench.inline_benchmarks -o runner.cmo runner.ml
+ ocamlfind ocamlc -c -thread -package str -package core -package core_bench.inline_benchmarks -o runner.cmo runner.ml
File "runner.ml", line 1, characters 5-13:
Error: Unbound module Core.Std
Command exited with code 2.
Makefile:4: recipe for target 'all' failed
make: *** [all] Error 10
make: Leaving directory '/home/louis/.opam/4.07.1+flambda+bench/.opam-switch/build/core-micro-bench.1.0/core_micro'
Close

Error on core-micro-bench.1.0 (4.07.1+clambda+bench)

Command:

/usr/bin/make -C core_micro

Output

make: Entering directory '/home/louis/.opam/4.07.1+oclassic+bench/.opam-switch/build/core-micro-bench.1.0/core_micro'
ocamlbuild -use-ocamlfind runner.native
ocamlfind ocamldep -package str -package core -package core_bench.inline_benchmarks -modules runner.ml > runner.ml.depends
ocamlfind ocamlc -c -thread -package str -package core -package core_bench.inline_benchmarks -o runner.cmo runner.ml
+ ocamlfind ocamlc -c -thread -package str -package core -package core_bench.inline_benchmarks -o runner.cmo runner.ml
File "runner.ml", line 1, characters 5-13:
Error: Unbound module Core.Std
Command exited with code 2.
Makefile:4: recipe for target 'all' failed
make: *** [all] Error 10
make: Leaving directory '/home/louis/.opam/4.07.1+oclassic+bench/.opam-switch/build/core-micro-bench.1.0/core_micro'
make: Entering directory '/home/louis/.opam/4.07.1+clambda+bench/.opam-switch/build/core-micro-bench.1.0/core_micro'
ocamlbuild -use-ocamlfind runner.native
ocamlfind ocamldep -package str -package core -package core_bench.inline_benchmarks -modules runner.ml > runner.ml.depends
ocamlfind ocamlc -c -thread -package str -package core -package core_bench.inline_benchmarks -o runner.cmo runner.ml
+ ocamlfind ocamlc -c -thread -package str -package core -package core_bench.inline_benchmarks -o runner.cmo runner.ml
File "runner.ml", line 1, characters 5-13:
Error: Unbound module Core.Std
Command exited with code 2.
Makefile:4: recipe for target 'all' failed
make: *** [all] Error 10
make: Leaving directory '/home/louis/.opam/4.07.1+clambda+bench/.opam-switch/build/core-micro-bench.1.0/core_micro'
Close

Error on conf-graphviz.0.1 (4.07.1+oclassic+bench)

Command:

/usr/bin/which dot

Output


Close

Error on conf-graphviz.0.1 (4.07.1+flambda+bench)

Command:

/usr/bin/which dot

Output


Close

Error on conf-graphviz.0.1 (4.07.1+clambda+bench)

Command:

/usr/bin/which dot

Output


Close

Error on cohttp-bench.1.0 (4.07.1+oclassic+bench)

Command:

/usr/bin/make -C cohttp

Output

make: Entering directory '/home/louis/.opam/4.07.1+clambda+bench/.opam-switch/build/cohttp-bench.1.0/cohttp'
ocamlbuild -use-ocamlfind cohttp_lwt_bench.native cohttp_async_bench.native
ocamlfind ocamldep -package lwt.unix -package cohttp.lwt -modules cohttp_lwt_bench.ml > cohttp_lwt_bench.ml.depends
+ ocamlfind ocamldep -package lwt.unix -package cohttp.lwt -modules cohttp_lwt_bench.ml > cohttp_lwt_bench.ml.depends
ocamlfind: Package `cohttp.lwt' not found
Command exited with code 2.
Makefile:6: recipe for target 'all' failed
make: *** [all] Error 10
make: Leaving directory '/home/louis/.opam/4.07.1+clambda+bench/.opam-switch/build/cohttp-bench.1.0/cohttp'
make: Entering directory '/home/louis/.opam/4.07.1+oclassic+bench/.opam-switch/build/cohttp-bench.1.0/cohttp'
ocamlbuild -use-ocamlfind cohttp_lwt_bench.native cohttp_async_bench.native
ocamlfind ocamldep -package lwt.unix -package cohttp.lwt -modules cohttp_lwt_bench.ml > cohttp_lwt_bench.ml.depends
+ ocamlfind ocamldep -package lwt.unix -package cohttp.lwt -modules cohttp_lwt_bench.ml > cohttp_lwt_bench.ml.depends
ocamlfind: Package `cohttp.lwt' not found
Command exited with code 2.
Makefile:6: recipe for target 'all' failed
make: *** [all] Error 10
make: Leaving directory '/home/louis/.opam/4.07.1+oclassic+bench/.opam-switch/build/cohttp-bench.1.0/cohttp'
Close

Error on cohttp-bench.1.0 (4.07.1+flambda+bench)

Command:

/usr/bin/make -C cohttp

Output

make: Entering directory '/home/louis/.opam/4.07.1+flambda+bench/.opam-switch/build/cohttp-bench.1.0/cohttp'
ocamlbuild -use-ocamlfind cohttp_lwt_bench.native cohttp_async_bench.native
ocamlfind ocamldep -package lwt.unix -package cohttp.lwt -modules cohttp_lwt_bench.ml > cohttp_lwt_bench.ml.depends
+ ocamlfind ocamldep -package lwt.unix -package cohttp.lwt -modules cohttp_lwt_bench.ml > cohttp_lwt_bench.ml.depends
ocamlfind: Package `cohttp.lwt' not found
Command exited with code 2.
Makefile:6: recipe for target 'all' failed
make: *** [all] Error 10
make: Leaving directory '/home/louis/.opam/4.07.1+flambda+bench/.opam-switch/build/cohttp-bench.1.0/cohttp'
Close

Error on cohttp-bench.1.0 (4.07.1+clambda+bench)

Command:

/usr/bin/make -C cohttp

Output

make: Entering directory '/home/louis/.opam/4.07.1+oclassic+bench/.opam-switch/build/cohttp-bench.1.0/cohttp'
ocamlbuild -use-ocamlfind cohttp_lwt_bench.native cohttp_async_bench.native
ocamlfind ocamldep -package lwt.unix -package cohttp.lwt -modules cohttp_lwt_bench.ml > cohttp_lwt_bench.ml.depends
+ ocamlfind ocamldep -package lwt.unix -package cohttp.lwt -modules cohttp_lwt_bench.ml > cohttp_lwt_bench.ml.depends
ocamlfind: Package `cohttp.lwt' not found
Command exited with code 2.
Makefile:6: recipe for target 'all' failed
make: *** [all] Error 10
make: Leaving directory '/home/louis/.opam/4.07.1+oclassic+bench/.opam-switch/build/cohttp-bench.1.0/cohttp'
make: Entering directory '/home/louis/.opam/4.07.1+clambda+bench/.opam-switch/build/cohttp-bench.1.0/cohttp'
ocamlbuild -use-ocamlfind cohttp_lwt_bench.native cohttp_async_bench.native
ocamlfind ocamldep -package lwt.unix -package cohttp.lwt -modules cohttp_lwt_bench.ml > cohttp_lwt_bench.ml.depends
+ ocamlfind ocamldep -package lwt.unix -package cohttp.lwt -modules cohttp_lwt_bench.ml > cohttp_lwt_bench.ml.depends
ocamlfind: Package `cohttp.lwt' not found
Command exited with code 2.
Makefile:6: recipe for target 'all' failed
make: *** [all] Error 10
make: Leaving directory '/home/louis/.opam/4.07.1+clambda+bench/.opam-switch/build/cohttp-bench.1.0/cohttp'
Close

Error on chameneos-bench.1.0 (4.07.1+oclassic+bench)

Command:

/usr/bin/make -C chameneos-redux

Output

make: Entering directory '/home/louis/.opam/4.07.1+clambda+bench/.opam-switch/build/chameneos-bench.1.0/chameneos-redux'
ocamlopt -bin-annot -thread unix.cmxa threads.cmxa chameneos_redux_th.ml -o chameneos_redux_th
ocamlopt -bin-annot -thread unix.cmxa threads.cmxa chameneos_redux_evtchn.ml -o chameneos_redux_evtchn
ocamlfind ocamlopt -bin-annot -package lwt.unix -linkpkg chameneos_redux_lwt.ml -o chameneos_redux_lwt
ocamlfind: [WARNING] Package `threads': Linking problems may arise because of the missing -thread or -vmthread switch
ocamlfind ocamlopt -bin-annot  -thread -package async -linkpkg chameneos_redux_async.ml -o chameneos_redux_async
File "chameneos_redux_async.ml", line 7, characters 5-13:
Error: Unbound module Core.Std
Makefile:9: recipe for target 'chameneos_redux_async' failed
make: *** [chameneos_redux_async] Error 2
make: Leaving directory '/home/louis/.opam/4.07.1+clambda+bench/.opam-switch/build/chameneos-bench.1.0/chameneos-redux'
make: Entering directory '/home/louis/.opam/4.07.1+oclassic+bench/.opam-switch/build/chameneos-bench.1.0/chameneos-redux'
ocamlopt -bin-annot -thread unix.cmxa threads.cmxa chameneos_redux_th.ml -o chameneos_redux_th
ocamlopt -bin-annot -thread unix.cmxa threads.cmxa chameneos_redux_evtchn.ml -o chameneos_redux_evtchn
ocamlfind ocamlopt -bin-annot -package lwt.unix -linkpkg chameneos_redux_lwt.ml -o chameneos_redux_lwt
ocamlfind: [WARNING] Package `threads': Linking problems may arise because of the missing -thread or -vmthread switch
File "chameneos_redux_lwt.ml", line 1:
Error: No implementations provided for the following modules:
         Mutex referenced from /home/louis/.opam/4.07.1+oclassic+bench/lib/lwt/unix/lwt_unix.cmxa(Lwt_main)
Makefile:6: recipe for target 'chameneos_redux_lwt' failed
make: *** [chameneos_redux_lwt] Error 2
make: Leaving directory '/home/louis/.opam/4.07.1+oclassic+bench/.opam-switch/build/chameneos-bench.1.0/chameneos-redux'
Close

Error on chameneos-bench.1.0 (4.07.1+flambda+bench)

Command:

/usr/bin/make -C chameneos-redux

Output

make: Entering directory '/home/louis/.opam/4.07.1+flambda+bench/.opam-switch/build/chameneos-bench.1.0/chameneos-redux'
ocamlopt -bin-annot -thread unix.cmxa threads.cmxa chameneos_redux_th.ml -o chameneos_redux_th
ocamlopt -bin-annot -thread unix.cmxa threads.cmxa chameneos_redux_evtchn.ml -o chameneos_redux_evtchn
ocamlfind ocamlopt -bin-annot -package lwt.unix -linkpkg chameneos_redux_lwt.ml -o chameneos_redux_lwt
ocamlfind: [WARNING] Package `threads': Linking problems may arise because of the missing -thread or -vmthread switch
File "chameneos_redux_lwt.ml", line 1:
Error: No implementations provided for the following modules:
         Mutex referenced from /home/louis/.opam/4.07.1+flambda+bench/lib/lwt/unix/lwt_unix.cmxa(Lwt_main)
Makefile:6: recipe for target 'chameneos_redux_lwt' failed
make: *** [chameneos_redux_lwt] Error 2
make: Leaving directory '/home/louis/.opam/4.07.1+flambda+bench/.opam-switch/build/chameneos-bench.1.0/chameneos-redux'
Close

Error on chameneos-bench.1.0 (4.07.1+clambda+bench)

Command:

/usr/bin/make -C chameneos-redux

Output

make: Entering directory '/home/louis/.opam/4.07.1+oclassic+bench/.opam-switch/build/chameneos-bench.1.0/chameneos-redux'
ocamlopt -bin-annot -thread unix.cmxa threads.cmxa chameneos_redux_th.ml -o chameneos_redux_th
ocamlopt -bin-annot -thread unix.cmxa threads.cmxa chameneos_redux_evtchn.ml -o chameneos_redux_evtchn
ocamlfind ocamlopt -bin-annot -package lwt.unix -linkpkg chameneos_redux_lwt.ml -o chameneos_redux_lwt
ocamlfind: [WARNING] Package `threads': Linking problems may arise because of the missing -thread or -vmthread switch
ocamlfind ocamlopt -bin-annot  -thread -package async -linkpkg chameneos_redux_async.ml -o chameneos_redux_async
File "chameneos_redux_async.ml", line 7, characters 5-13:
Error: Unbound module Core.Std
Makefile:9: recipe for target 'chameneos_redux_async' failed
make: *** [chameneos_redux_async] Error 2
make: Leaving directory '/home/louis/.opam/4.07.1+oclassic+bench/.opam-switch/build/chameneos-bench.1.0/chameneos-redux'
make: Entering directory '/home/louis/.opam/4.07.1+clambda+bench/.opam-switch/build/chameneos-bench.1.0/chameneos-redux'
ocamlopt -bin-annot -thread unix.cmxa threads.cmxa chameneos_redux_th.ml -o chameneos_redux_th
ocamlopt -bin-annot -thread unix.cmxa threads.cmxa chameneos_redux_evtchn.ml -o chameneos_redux_evtchn
ocamlfind ocamlopt -bin-annot -package lwt.unix -linkpkg chameneos_redux_lwt.ml -o chameneos_redux_lwt
ocamlfind: [WARNING] Package `threads': Linking problems may arise because of the missing -thread or -vmthread switch
File "chameneos_redux_lwt.ml", line 1:
Error: No implementations provided for the following modules:
         Mutex referenced from /home/louis/.opam/4.07.1+clambda+bench/lib/lwt/unix/lwt_unix.cmxa(Lwt_main)
Makefile:6: recipe for target 'chameneos_redux_lwt' failed
make: *** [chameneos_redux_lwt] Error 2
make: Leaving directory '/home/louis/.opam/4.07.1+clambda+bench/.opam-switch/build/chameneos-bench.1.0/chameneos-redux'
Close

Error on camlimages.5.0.1 (4.08.0+trunk+bench)

Command:

~/.opam/4.08.0+trunk+bench/bin/jbuilder build -p camlimages -j 7

Output

       ocaml (internal)
ocamlfind: Package `graphics' not found
    ocamlopt config/.ciconfig.eobjs/xConfigurator.{cmx,o}
File "config/xConfigurator.ml", line 23, characters 16-25:
23 |     | exception Not_found -> []
                     ^^^^^^^^^
Alert deprecated: Not_found
[2016-09] this element comes from the stdlib distributed with OCaml.
Instead of raising [Not_found], consider using [raise_s] with an informative error
message.  If code needs to distinguish [Not_found] from other exceptions, please change
it to handle both [Not_found] and [Not_found_s].  Then, instead of raising [Not_found],
raise [Not_found_s] with an informative error message.
    ocamlopt config/ciconfig.exe (exit 2)
(cd _build/default && /home/louis/.opam/4.08.0+trunk+bench/bin/ocamlopt.opt -w -40 -w -6 -g -o config/ciconfig.exe -I /home/louis/.opam/4.08.0+trunk+bench/lib/base -I /home/louis/.opam/4.08.0+trunk+bench/lib/base/base_internalhash_types -I /home/louis/.opam/4.08.0+trunk+bench/lib/base/caml -I /home/louis/.opam/4.08.0+trunk+bench/lib/base/shadow_stdlib -I /home/louis/.opam/4.08.0+trunk+bench/lib/configurator -I /home/louis/.opam/4.08.0+trunk+bench/lib/findlib -I /home/louis/.opam/4.08.0+trunk+bench/lib/sexplib0 -I /home/louis/.opam/4.08.0+trunk+bench/lib/stdio /home/louis/.opam/4.08.0+trunk+bench/lib/base/base_internalhash_types/base_internalhash_types.cmxa /home/louis/.opam/4.08.0+trunk+bench/lib/base/caml/caml.cmxa /home/louis/.opam/4.08.0+trunk+bench/lib/base/shadow_stdlib/shadow_stdlib.cmxa /home/louis/.opam/4.08.0+trunk+bench/lib/sexplib0/sexplib0.cmxa /home/louis/.opam/4.08.0+trunk+bench/lib/base/base.cmxa /home/louis/.opam/4.08.0+trunk+bench/lib/stdio/stdio.cmxa /home/louis/.opam/4.08.0+trunk+bench/lib/ocaml/unix.cmxa /home/louis/.opam/4.08.0+trunk+bench/lib/configurator/configurator.cmxa /home/louis/.opam/4.08.0+trunk+bench/lib/findlib/findlib.cmxa config/.ciconfig.eobjs/xConfigurator.cmx config/.ciconfig.eobjs/ciconfig.cmx)
/home/louis/.opam/4.08.0+trunk+bench/lib/base/libbase_stubs.a(exn_stubs.o): In function `Base_clear_caml_backtrace_pos':
/home/louis/.opam/4.08.0+trunk+bench/.opam-switch/build/base.v0.13.0/_build/default/src/exn_stubs.c:6: undefined reference to `caml_backtrace_pos'
collect2: error: ld returned 1 exit status
File "caml_startup", line 1:
Error: Error during linking
Close

Error on async-rpc-bench.1.0 (4.07.1+oclassic+bench)

Command:

/usr/bin/make -C async_rpc

Output

make: Entering directory '/home/louis/.opam/4.07.1+clambda+bench/.opam-switch/build/async-rpc-bench.1.0/async_rpc'
ocamlfind ocamlopt -thread -syntax camlp4o -package async -package bin_prot.syntax -package core -c rpc_common.ml
ocamlfind: Package `bin_prot.syntax' not found
Makefile:12: recipe for target 'rpc_common.cmx' failed
make: *** [rpc_common.cmx] Error 2
make: Leaving directory '/home/louis/.opam/4.07.1+clambda+bench/.opam-switch/build/async-rpc-bench.1.0/async_rpc'
make: Entering directory '/home/louis/.opam/4.07.1+oclassic+bench/.opam-switch/build/async-rpc-bench.1.0/async_rpc'
ocamlfind ocamlopt -thread -syntax camlp4o -package async -package bin_prot.syntax -package core -c rpc_common.ml
ocamlfind: Package `bin_prot.syntax' not found
Makefile:12: recipe for target 'rpc_common.cmx' failed
make: *** [rpc_common.cmx] Error 2
make: Leaving directory '/home/louis/.opam/4.07.1+oclassic+bench/.opam-switch/build/async-rpc-bench.1.0/async_rpc'
Close

Error on async-rpc-bench.1.0 (4.07.1+flambda+bench)

Command:

/usr/bin/make -C async_rpc

Output

make: Entering directory '/home/louis/.opam/4.07.1+flambda+bench/.opam-switch/build/async-rpc-bench.1.0/async_rpc'
ocamlfind ocamlopt -thread -syntax camlp4o -package async -package bin_prot.syntax -package core -c rpc_common.ml
ocamlfind: Package `bin_prot.syntax' not found
Makefile:12: recipe for target 'rpc_common.cmx' failed
make: *** [rpc_common.cmx] Error 2
make: Leaving directory '/home/louis/.opam/4.07.1+flambda+bench/.opam-switch/build/async-rpc-bench.1.0/async_rpc'
Close

Error on async-rpc-bench.1.0 (4.07.1+clambda+bench)

Command:

/usr/bin/make -C async_rpc

Output

make: Entering directory '/home/louis/.opam/4.07.1+oclassic+bench/.opam-switch/build/async-rpc-bench.1.0/async_rpc'
ocamlfind ocamlopt -thread -syntax camlp4o -package async -package bin_prot.syntax -package core -c rpc_common.ml
ocamlfind: Package `bin_prot.syntax' not found
Makefile:12: recipe for target 'rpc_common.cmx' failed
make: *** [rpc_common.cmx] Error 2
make: Leaving directory '/home/louis/.opam/4.07.1+oclassic+bench/.opam-switch/build/async-rpc-bench.1.0/async_rpc'
make: Entering directory '/home/louis/.opam/4.07.1+clambda+bench/.opam-switch/build/async-rpc-bench.1.0/async_rpc'
ocamlfind ocamlopt -thread -syntax camlp4o -package async -package bin_prot.syntax -package core -c rpc_common.ml
ocamlfind: Package `bin_prot.syntax' not found
Makefile:12: recipe for target 'rpc_common.cmx' failed
make: *** [rpc_common.cmx] Error 2
make: Leaving directory '/home/louis/.opam/4.07.1+clambda+bench/.opam-switch/build/async-rpc-bench.1.0/async_rpc'
Close

Error on async-echo-bench.1.0 (4.07.1+oclassic+bench)

Command:

/usr/bin/make -C async_echo

Output

make: Entering directory '/home/louis/.opam/4.07.1+clambda+bench/.opam-switch/build/async-echo-bench.1.0/async_echo'
ocamlfind ocamlopt -thread -syntax camlp4o -package async -package bin_prot.syntax -package core -c echo_common.ml
ocamlfind: Package `bin_prot.syntax' not found
Makefile:20: recipe for target 'echo_common.cmx' failed
make: *** [echo_common.cmx] Error 2
make: Leaving directory '/home/louis/.opam/4.07.1+clambda+bench/.opam-switch/build/async-echo-bench.1.0/async_echo'
make: Entering directory '/home/louis/.opam/4.07.1+oclassic+bench/.opam-switch/build/async-echo-bench.1.0/async_echo'
ocamlfind ocamlopt -thread -syntax camlp4o -package async -package bin_prot.syntax -package core -c echo_common.ml
ocamlfind: Package `bin_prot.syntax' not found
Makefile:20: recipe for target 'echo_common.cmx' failed
make: *** [echo_common.cmx] Error 2
make: Leaving directory '/home/louis/.opam/4.07.1+oclassic+bench/.opam-switch/build/async-echo-bench.1.0/async_echo'
Close

Error on async-echo-bench.1.0 (4.07.1+flambda+bench)

Command:

/usr/bin/make -C async_echo

Output

make: Entering directory '/home/louis/.opam/4.07.1+flambda+bench/.opam-switch/build/async-echo-bench.1.0/async_echo'
ocamlfind ocamlopt -thread -syntax camlp4o -package async -package bin_prot.syntax -package core -c echo_common.ml
ocamlfind: Package `bin_prot.syntax' not found
Makefile:20: recipe for target 'echo_common.cmx' failed
make: *** [echo_common.cmx] Error 2
make: Leaving directory '/home/louis/.opam/4.07.1+flambda+bench/.opam-switch/build/async-echo-bench.1.0/async_echo'
Close

Error on async-echo-bench.1.0 (4.07.1+clambda+bench)

Command:

/usr/bin/make -C async_echo

Output

make: Entering directory '/home/louis/.opam/4.07.1+oclassic+bench/.opam-switch/build/async-echo-bench.1.0/async_echo'
ocamlfind ocamlopt -thread -syntax camlp4o -package async -package bin_prot.syntax -package core -c echo_common.ml
ocamlfind: Package `bin_prot.syntax' not found
Makefile:20: recipe for target 'echo_common.cmx' failed
make: *** [echo_common.cmx] Error 2
make: Leaving directory '/home/louis/.opam/4.07.1+oclassic+bench/.opam-switch/build/async-echo-bench.1.0/async_echo'
make: Entering directory '/home/louis/.opam/4.07.1+clambda+bench/.opam-switch/build/async-echo-bench.1.0/async_echo'
ocamlfind ocamlopt -thread -syntax camlp4o -package async -package bin_prot.syntax -package core -c echo_common.ml
ocamlfind: Package `bin_prot.syntax' not found
Makefile:20: recipe for target 'echo_common.cmx' failed
make: *** [echo_common.cmx] Error 2
make: Leaving directory '/home/louis/.opam/4.07.1+clambda+bench/.opam-switch/build/async-echo-bench.1.0/async_echo'