Package4.03.1+bench4.05.0+flambda+opt+bench4.06.1+flambda+bench4.06.1+flambda+opt+bench4.07.1+clambda+bench4.07.1+flambda+bench4.07.1+oclassic+bench4.08.0+gpr2165+bench4.08.0+mutmatch+bench4.08.0+trunk+bench4.08.0+trunk+flambda+bench4.08.0+trunk+flambda+oclassic+bench4.08.0+trunk+flambda+opt+bench4.03.1+bench time (s)4.05.0+flambda+opt+bench time (s)4.06.1+flambda+bench time (s)4.06.1+flambda+opt+bench time (s)4.07.1+clambda+bench time (s)4.07.1+flambda+bench time (s)4.07.1+oclassic+bench time (s)4.08.0+gpr2165+bench time (s)4.08.0+mutmatch+bench time (s)4.08.0+trunk+bench time (s)4.08.0+trunk+flambda+bench time (s)4.08.0+trunk+flambda+oclassic+bench time (s)4.08.0+trunk+flambda+opt+bench time (s)
almabench-bench.1.0---------OKAborted-Aborted---------0.6520.000-0.000
alt-ergo.2.3.0----OK-OK---Aborted-Aborted----21.020-21.273---0.000-0.000
alt-ergo-lib.2.3.0----OK-OK---Aborted-Aborted----22.869-24.008---0.000-0.000
alt-ergo-parsers.2.3.0----OK-OK---Aborted-Aborted----13.152-12.913---0.000-0.000
async.v0.12.0----OK-OK----------2.500-2.355------
async.v0.13.0---------AbortedAborted-Aborted---------0.0000.000-0.000
async.v0.9.0OK------------0.896------------
async-echo-bench.1.0Failure (2)---Failure (2)-Failure (2)--AbortedAborted-Aborted0.667---0.647-2.338--0.0000.000-0.000
async-rpc-bench.1.0Failure (2)---Failure (2)-Failure (2)--AbortedAborted-Aborted0.582---0.556-2.246--0.0000.000-0.000
async_extra.v0.12.0----OK-OK----------5.314-5.086------
async_extra.v0.9.0OK------------7.313------------
async_kernel.v0.12.0----OK-OK----------13.710-16.491------
async_kernel.v0.13.0---------AbortedAborted-Aborted---------0.0000.000-0.000
async_kernel.v0.9.0OK------------11.667------------
async_rpc_kernel.v0.12.0----OK-OK----------10.311-10.230------
async_rpc_kernel.v0.13.0---------AbortedAborted-Aborted---------0.0000.000-0.000
async_rpc_kernel.v0.9.0OK------------8.110------------
async_unix.v0.12.0----OK-OK----------13.025-15.149------
async_unix.v0.13.0---------AbortedAborted-Aborted---------0.0000.000-0.000
async_unix.v0.9.0OK------------11.984------------
base.v0.12.2----OK-OK----------7.597-8.115------
base.v0.13.0---------OKAborted-Aborted---------9.7990.000-0.000
base-bytes.base---------OKAborted-Aborted---------0.0000.000-0.000
base64.2.3.0OK------------0.557------------
base64.3.3.0----OK-OK--OKAborted-Aborted----2.242-2.033--1.4390.000-0.000
base_bigstring.v0.12.0----OK-OK----------1.049-3.372------
base_bigstring.v0.13.0---------AbortedAborted-Aborted---------0.0000.000-0.000
base_quickcheck.v0.12.1----OK-OK----------7.749-8.284------
base_quickcheck.v0.13.0---------AbortedAborted-Aborted---------0.0000.000-0.000
bdd-bench.1.0---------OKAborted-Aborted---------0.9100.000-0.000
bin_prot.v0.12.0----OK-OK----------9.451-12.144------
bin_prot.v0.13.0---------AbortedAborted-Aborted---------0.0000.000-0.000
bin_prot.v0.9.1OK------------7.583------------
biniou.1.2.1OK---OK-OK--OKAborted-Aborted15.419---26.103-27.033--12.9240.000-0.000
camlimages.5.0.1---------Failure (1)Aborted-Aborted---------0.7930.000-0.000
camlpdf.2.3---------OKAborted-Aborted---------25.1190.000-0.000
camlzip.1.10----------Aborted-Aborted----------0.000-0.000
chameneos-bench.1.0Failure (2)---Failure (2)-Failure (2)--AbortedAborted-Aborted0.628---0.468-2.160--0.0000.000-0.000
cohttp.1.0.0OK------------4.161------------
cohttp.2.4.0----OK-OK----------3.843-6.721------
cohttp.2.5.0---------AbortedAborted-Aborted---------0.0000.000-0.000
cohttp-bench.1.0Failure (2)---Failure (2)-Failure (2)--AbortedAborted-Aborted0.372---0.331-2.044--0.0000.000-0.000
conf-graphviz.0.1Failure (1)---Failure (1)-Failure (1)------0.160---0.177-0.183------
configurator.v0.11.0----OK-OK--OKAborted-Aborted----6.157-6.143--3.3970.000-0.000
configurator.v0.9.1OK------------14.482------------
core.v0.12.4----OK-OK----------28.448-28.942------
core.v0.13.0---------AbortedAborted-Aborted---------0.0000.000-0.000
core.v0.9.1OK------------25.977------------
core-micro-bench.1.0Failure (2)---Failure (2)-Failure (2)--AbortedAborted-Aborted1.401---1.452-1.491--0.0000.000-0.000
core-sequence-bench.1.0OK---OK-OK--AbortedAborted-Aborted0.117---0.058-0.062--0.0000.000-0.000
core_bench.v0.12.0----OK-OK----------8.436-10.166------
core_bench.v0.13.0---------AbortedAborted-Aborted---------0.0000.000-0.000
core_bench.v0.9.0OK------------3.525------------
core_extended.v0.12.0----OK-OK----------6.678-6.369------
core_extended.v0.9.0OK------------20.244------------
core_kernel.v0.12.3----OK-OK----------35.558-35.848------
core_kernel.v0.13.0---------AbortedAborted-Aborted---------0.0000.000-0.000
core_kernel.v0.9.0OK------------29.317------------
cpdf.2.3---------OKAborted-Aborted---------10.9750.000-0.000
cpdf-bench.1.0---------OKAborted-Aborted---------0.1870.000-0.000
cppo.1.6.6OK---OK-OK--OKAborted-Aborted2.195---1.101-1.826--1.5580.000-0.000
dune.2.2.0OK---OK-OK--OKAborted-Aborted9.863---14.208-16.291--16.2560.000-0.000
dune-configurator.1.11.4OK------------3.989------------
dune-configurator.2.2.0----OK-OK--OKAborted-Aborted----16.650-16.465--10.8370.000-0.000
dune-private-libs.2.2.0----OK-OK--OKAborted-Aborted----10.731-12.144--6.4500.000-0.000
easy-format.1.3.2OK---OK-OK--OKAborted-Aborted0.226---0.340-0.424--0.4880.000-0.000
expect_test_helpers.v0.12.0----OK-OK----------1.852-2.317------
expect_test_helpers_kernel.v0.12.0----OK-OK----------8.339-10.597------
fieldslib.v0.12.0----OK-OK----------0.365-0.383------
fieldslib.v0.13.0---------OKAborted-Aborted---------3.3930.000-0.000
fieldslib.v0.9.0OK------------1.496------------
frama-c.19.1OK------------74.033------------
frama-c.20.0----OK-OK----------85.590-105.672------
frama-c-bench.1.0OK---OK-OK------0.327---0.170-0.332------
jane-street-headers.v0.12.0----OK-OK----------0.188-0.259------
jane-street-headers.v0.13.0---------OKAborted-Aborted---------0.3240.000-0.000
jbuilder.1.0+beta20.2---------OKAborted-Aborted---------13.7210.000-0.000
json-bench-data.1.0---------OKAborted-Aborted---------0.0380.000-0.000
jsonm.1.0.1---------OKAborted-Aborted---------1.3350.000-0.000
jsonm-bench.1.0---------OKAborted-Aborted---------0.0400.000-0.000
jst-config.v0.12.0----OK-OK----------10.223-12.056------
jst-config.v0.13.0---------AbortedAborted-Aborted---------0.0000.000-0.000
kb-bench.1.0---------OKAborted-Aborted---------0.6640.000-0.000
lexifi-g2pp-bench.1.0---------OKAborted-Aborted---------0.6770.000-0.000
lwt.5.1.1OK---OK-OK--OKAborted-Aborted4.566---16.006-15.238--17.4760.000-0.000
menhir.20200211OK--------OKAborted-Aborted16.212--------11.0760.000-0.000
menhir-bench.1.0OK--------OKAborted-Aborted0.501--------0.3790.000-0.000
menhirLib.20200211OK--------OKAborted-Aborted2.489--------1.5840.000-0.000
menhirSdk.20200211OK--------OKAborted-Aborted0.473--------1.0850.000-0.000
minilight.1.6---------OKAborted-Aborted---------0.8030.000-0.000
minilight-bench.1.0---------OKAborted-Aborted---------0.1180.000-0.000
mmap.1.1.0OK---OK-OK--OKAborted-Aborted0.295---0.323-0.393--0.6790.000-0.000
nbcodec.1.0---------OKAborted-Aborted---------0.9150.000-0.000
nbcodec-bench.1.0---------OKAborted-Aborted---------0.1660.000-0.000
num.1.3---------OKAborted-Aborted---------2.0970.000-0.000
numerical-analysis-bench.1.0---------Failure (2)Aborted-Aborted---------13.3750.000-0.000
ocaml.4.08.0---------OKAborted-Aborted---------0.0910.000-0.000
ocaml-compiler-libs.v0.12.1----OK-OK--OKAborted-Aborted----1.780-2.349--2.5550.000-0.000
ocaml-migrate-parsetree.1.6.0OK---OK-OK--Failure (1)Aborted-Aborted7.311---21.465-21.158--3.2000.000-0.000
ocaml-variants.4.08.0+trunk---------OK------------370.832---
ocaml-variants.4.08.0+trunk+flambda----------Failure (1)------------0.289--
ocaml-variants.4.08.0+trunk+flambda+opt------------Failure (1)------------0.291
ocamlbuild.0.14.0---------OKAborted-Aborted---------12.0850.000-0.000
ocamlfind.1.8.1---------OKAborted-Aborted---------7.9320.000-0.000
ocplib-endian.0.8OK------------29.610------------
ocplib-endian.1.0----OK-OK--OKAborted-Aborted----37.797-38.191--24.7860.000-0.000
ocplib-simplex.0.4----------Aborted-Aborted----------0.000-0.000
octavius.1.2.2OK---OK-OK--OKAborted-Aborted14.184---3.130-3.505--3.2660.000-0.000
parsexp.v0.12.0----OK-OK----------3.523-4.324------
parsexp.v0.13.0---------OKAborted-Aborted---------3.6340.000-0.000
patdiff.v0.12.1----OK-OK----------5.385-6.410------
patdiff.v0.13.0---------AbortedAborted-Aborted---------0.0000.000-0.000
patdiff.v0.9.0OK------------6.443------------
patdiff-bench.1.0OK---OK-OK--AbortedAborted-Aborted0.183---0.250-0.186--0.0000.000-0.000
patience_diff.v0.12.0----OK-OK----------5.863-7.580------
patience_diff.v0.13.0---------AbortedAborted-Aborted---------0.0000.000-0.000
patience_diff.v0.9.0OK------------1.980------------
pcre.7.4.1----OK-OK----------4.503-5.270------
pcre.7.4.3---------Failure (1)Aborted-Aborted---------4.4610.000-0.000
ppx_assert.v0.12.0----OK-OK----------5.280-6.796------
ppx_assert.v0.13.0---------AbortedAborted-Aborted---------0.0000.000-0.000
ppx_assert.v0.9.0OK------------4.071------------
ppx_ast.v0.9.1OK------------3.852------------
ppx_base.v0.12.0----OK-OK----------19.025-15.979------
ppx_base.v0.13.0---------AbortedAborted-Aborted---------0.0000.000-0.000
ppx_base.v0.9.0OK------------8.493------------
ppx_bench.v0.12.0----OK-OK----------7.897-6.237------
ppx_bench.v0.13.0---------AbortedAborted-Aborted---------0.0000.000-0.000
ppx_bench.v0.9.1OK------------2.885------------
ppx_bin_prot.v0.12.1----OK-OK----------8.638-6.321------
ppx_bin_prot.v0.13.0---------AbortedAborted-Aborted---------0.0000.000-0.000
ppx_bin_prot.v0.9.0OK------------3.341------------
ppx_cold.v0.13.0---------AbortedAborted-Aborted---------0.0000.000-0.000
ppx_compare.v0.12.0----OK-OK----------3.901-4.963------
ppx_compare.v0.13.0---------AbortedAborted-Aborted---------0.0000.000-0.000
ppx_compare.v0.9.0OK------------3.963------------
ppx_core.v0.9.0OK------------6.083------------
ppx_custom_printf.v0.12.1----OK-OK----------6.081-7.574------
ppx_custom_printf.v0.13.0---------AbortedAborted-Aborted---------0.0000.000-0.000
ppx_custom_printf.v0.9.0OK------------9.436------------
ppx_derivers.1.2.1OK---OK-OK--OKAborted-Aborted0.299---0.443-0.794--0.5450.000-0.000
ppx_driver.v0.9.1OK------------3.085------------
ppx_enumerate.v0.12.0----OK-OK----------3.315-4.160------
ppx_enumerate.v0.13.0---------AbortedAborted-Aborted---------0.0000.000-0.000
ppx_enumerate.v0.9.0OK------------1.834------------
ppx_expect.v0.12.0----OK-OK----------13.663-14.930------
ppx_expect.v0.13.0---------AbortedAborted-Aborted---------0.0000.000-0.000
ppx_expect.v0.9.0OK------------12.004------------
ppx_fail.v0.12.0----OK-OK----------12.543-10.531------
ppx_fail.v0.13.0---------AbortedAborted-Aborted---------0.0000.000-0.000
ppx_fail.v0.9.0OK------------4.754------------
ppx_fields_conv.v0.12.0----OK-OK----------3.627-4.980------
ppx_fields_conv.v0.13.0---------AbortedAborted-Aborted---------0.0000.000-0.000
ppx_fields_conv.v0.9.0OK------------1.991------------
ppx_hash.v0.12.0----OK-OK----------7.404-8.568------
ppx_hash.v0.13.0---------AbortedAborted-Aborted---------0.0000.000-0.000
ppx_hash.v0.9.0OK------------2.548------------
ppx_here.v0.12.0----OK-OK----------3.244-4.967------
ppx_here.v0.13.0---------AbortedAborted-Aborted---------0.0000.000-0.000
ppx_here.v0.9.1OK------------2.409------------
ppx_inline_test.v0.12.0----OK-OK----------4.692-6.862------
ppx_inline_test.v0.13.0---------AbortedAborted-Aborted---------0.0000.000-0.000
ppx_inline_test.v0.9.2OK------------5.569------------
ppx_jane.v0.12.0----OK-OK----------2.930-3.915------
ppx_jane.v0.13.0---------AbortedAborted-Aborted---------0.0000.000-0.000
ppx_jane.v0.9.0OK------------0.834------------
ppx_js_style.v0.12.0----OK-OK----------4.829-7.152------
ppx_js_style.v0.13.0---------AbortedAborted-Aborted---------0.0000.000-0.000
ppx_js_style.v0.9.0OK------------9.265------------
ppx_let.v0.12.0----OK-OK----------2.763-4.056------
ppx_let.v0.13.0---------AbortedAborted-Aborted---------0.0000.000-0.000
ppx_let.v0.9.0OK------------3.605------------
ppx_metaquot.v0.9.0OK------------4.387------------
ppx_module_timer.v0.12.0----OK-OK----------6.606-6.575------
ppx_module_timer.v0.13.0---------AbortedAborted-Aborted---------0.0000.000-0.000
ppx_optcomp.v0.12.0----OK-OK----------3.170-2.806------
ppx_optcomp.v0.13.0---------AbortedAborted-Aborted---------0.0000.000-0.000
ppx_optcomp.v0.9.0OK------------1.805------------
ppx_optional.v0.12.0----OK-OK----------2.805-4.269------
ppx_optional.v0.13.0---------AbortedAborted-Aborted---------0.0000.000-0.000
ppx_optional.v0.9.0OK------------2.378------------
ppx_pipebang.v0.12.0----OK-OK----------9.531-11.139------
ppx_pipebang.v0.13.0---------AbortedAborted-Aborted---------0.0000.000-0.000
ppx_pipebang.v0.9.0OK------------10.038------------
ppx_sexp_conv.v0.12.0----OK-OK----------13.009-13.458------
ppx_sexp_conv.v0.13.0---------AbortedAborted-Aborted---------0.0000.000-0.000
ppx_sexp_conv.v0.9.0OK------------4.515------------
ppx_sexp_message.v0.12.0----OK-OK----------7.434-8.686------
ppx_sexp_message.v0.13.0---------AbortedAborted-Aborted---------0.0000.000-0.000
ppx_sexp_message.v0.9.0OK------------7.444------------
ppx_sexp_value.v0.12.0----OK-OK----------8.422-11.085------
ppx_sexp_value.v0.13.0---------AbortedAborted-Aborted---------0.0000.000-0.000
ppx_sexp_value.v0.9.0OK------------7.961------------
ppx_stable.v0.12.0----OK-OK----------20.367-19.023------
ppx_stable.v0.13.0---------AbortedAborted-Aborted---------0.0000.000-0.000
ppx_traverse.v0.9.0OK------------5.124------------
ppx_type_conv.v0.9.1OK------------10.810------------
ppx_typerep_conv.v0.12.0----OK-OK----------19.626-18.969------
ppx_typerep_conv.v0.13.0---------AbortedAborted-Aborted---------0.0000.000-0.000
ppx_typerep_conv.v0.9.0OK------------5.169------------
ppx_variants_conv.v0.12.0----OK-OK----------19.236-18.458------
ppx_variants_conv.v0.13.0---------AbortedAborted-Aborted---------0.0000.000-0.000
ppx_variants_conv.v0.9.0OK------------3.575------------
ppxlib.0.12.0---------AbortedAborted-Aborted---------0.0000.000-0.000
ppxlib.0.8.1----OK-OK----------10.198-12.120------
protocol_version_header.v0.12.0----OK-OK----------3.515-12.378------
protocol_version_header.v0.13.0---------AbortedAborted-Aborted---------0.0000.000-0.000
psmt2-frontend.0.2----------Aborted-Aborted----------0.000-0.000
re.1.9.0OK---OK-OK--OKAborted-Aborted11.265---4.228-4.346--2.5050.000-0.000
re2.v0.12.1----OK-OK----------65.227-67.488------
re2.v0.9.0OK------------63.387------------
result.1.4OK---OK-OK--OKAborted-Aborted0.305---0.713-0.891--0.8180.000-0.000
sauvola-bench.1.0---------AbortedAborted-Aborted---------0.0000.000-0.000
seq.0.2.2OK------------15.992------------
seq.base---------OKAborted-Aborted---------0.0620.000-0.000
sequence-bench.1.0---------OKAborted-Aborted---------2.4650.000-0.000
sexp_pretty.v0.12.0----OK-OK----------3.546-7.967------
sexplib.v0.12.0----OK-OK----------3.925-4.362------
sexplib.v0.13.0---------OKAborted-Aborted---------2.6150.000-0.000
sexplib0.v0.12.0----OK-OK----------1.208-1.242------
sexplib0.v0.13.0---------OKAborted-Aborted---------1.2350.000-0.000
shell.v0.12.0----OK-OK----------2.640-4.124------
spawn.v0.13.0----OK-OK--OKAborted-Aborted----27.694-0.925--0.8660.000-0.000
splittable_random.v0.12.0----OK-OK----------19.378-15.068------
splittable_random.v0.13.0---------AbortedAborted-Aborted---------0.0000.000-0.000
stdio.v0.12.0----OK-OK----------4.966-5.765------
stdio.v0.13.0---------OKAborted-Aborted---------4.4130.000-0.000
stdlib-shims.0.1.0----OK-OK--OKAborted-Aborted----0.591-28.050--14.1630.000-0.000
stringext.1.6.0OK---OK-OK--OKAborted-Aborted16.400---28.151-28.640--13.8920.000-0.000
textutils.v0.12.0----OK-OK----------9.155-9.524------
textutils.v0.13.0---------AbortedAborted-Aborted---------0.0000.000-0.000
textutils.v0.9.0OK------------3.799------------
textutils_kernel.v0.12.0----OK-OK----------10.600-4.649------
thread-bench.1.0Failure (2)---Failure (2)-Failure (2)--AbortedAborted-Aborted0.267---0.206-1.899--0.0000.000-0.000
time_now.v0.12.0----OK-OK----------5.148-6.500------
time_now.v0.13.0---------AbortedAborted-Aborted---------0.0000.000-0.000
topkg.1.0.1---------OKAborted-Aborted---------4.3900.000-0.000
typerep.v0.12.0----OK-OK----------5.608-6.499------
typerep.v0.13.0---------OKAborted-Aborted---------5.2710.000-0.000
uchar.0.0.2---------OKAborted-Aborted---------1.1770.000-0.000
uri.1.9.7OK------------8.348------------
uri.3.1.0----OK-OK--OKAborted-Aborted----9.215-8.899--2.0310.000-0.000
uri-sexp.3.1.0----OK-OK--AbortedAborted-Aborted----1.818-3.183--0.0000.000-0.000
uutf.1.0.2---------OKAborted-Aborted---------0.9310.000-0.000
valet-bench.1.0Failure (2)------------0.331------------
variantslib.v0.12.0----OK-OK----------7.854-9.022------
variantslib.v0.13.0---------OKAborted-Aborted---------6.5360.000-0.000
variantslib.v0.9.0OK------------5.882------------
yojson.1.7.0OK---OK-OK--OKAborted-Aborted11.456---9.125-8.911--9.7730.000-0.000
yojson-bench.1.0Failure (2)---Failure (2)-Failure (2)--Failure (2)Aborted-Aborted0.136---11.843-10.374--11.5250.000-0.000
zarith.1.9.1----------Aborted-Aborted----------0.000-0.000
Close

Error on yojson-bench.1.0 (4.08.0+trunk+bench)

Command:

/usr/bin/make -C yojson

Output

make: Entering directory '/home/louis/.opam/4.08.0+trunk+bench/.opam-switch/build/yojson-bench.1.0/yojson'
ocamlfind ocamlopt -I `ocamlfind query yojson` -o ydump_bench -package easy-format,biniou -linkpkg yojson.cmx yojson_biniou.cmx ydump.ml
gcc: error: /home/louis/.opam/4.08.0+trunk+bench/lib/yojson/yojson_biniou.o: No such file or directory
gcc: error: /home/louis/.opam/4.08.0+trunk+bench/lib/yojson/yojson.o: No such file or directory
File "caml_startup", line 1:
Error: Error during linking
Makefile:6: recipe for target 'all' failed
make: *** [all] Error 2
make: Leaving directory '/home/louis/.opam/4.08.0+trunk+bench/.opam-switch/build/yojson-bench.1.0/yojson'
Close

Error on yojson-bench.1.0 (4.07.1+oclassic+bench)

Command:

/usr/bin/make -C yojson

Output

make: Entering directory '/home/louis/.opam/4.07.1+oclassic+bench/.opam-switch/build/yojson-bench.1.0/yojson'
ocamlfind ocamlopt -I `ocamlfind query yojson` -o ydump_bench -package easy-format,biniou -linkpkg yojson.cmx yojson_biniou.cmx ydump.ml
gcc: error: /home/louis/.opam/4.07.1+oclassic+bench/lib/yojson/yojson_biniou.o: No such file or directory
gcc: error: /home/louis/.opam/4.07.1+oclassic+bench/lib/yojson/yojson.o: No such file or directory
File "caml_startup", line 1:
Error: Error during linking
Makefile:6: recipe for target 'all' failed
make: *** [all] Error 2
make: Leaving directory '/home/louis/.opam/4.07.1+oclassic+bench/.opam-switch/build/yojson-bench.1.0/yojson'
Close

Error on yojson-bench.1.0 (4.07.1+clambda+bench)

Command:

/usr/bin/make -C yojson

Output

make: Entering directory '/home/louis/.opam/4.07.1+clambda+bench/.opam-switch/build/yojson-bench.1.0/yojson'
ocamlfind ocamlopt -I `ocamlfind query yojson` -o ydump_bench -package easy-format,biniou -linkpkg yojson.cmx yojson_biniou.cmx ydump.ml
gcc: error: /home/louis/.opam/4.07.1+clambda+bench/lib/yojson/yojson_biniou.o: No such file or directory
gcc: error: /home/louis/.opam/4.07.1+clambda+bench/lib/yojson/yojson.o: No such file or directory
File "caml_startup", line 1:
Error: Error during linking
Makefile:6: recipe for target 'all' failed
make: *** [all] Error 2
make: Leaving directory '/home/louis/.opam/4.07.1+clambda+bench/.opam-switch/build/yojson-bench.1.0/yojson'
Close

Error on yojson-bench.1.0 (4.03.1+bench)

Command:

/usr/bin/make -C yojson

Output

make: Entering directory '/home/louis/.opam/4.03.1+bench/.opam-switch/build/yojson-bench.1.0/yojson'
ocamlfind ocamlopt -I `ocamlfind query yojson` -o ydump_bench -package easy-format,biniou -linkpkg yojson.cmx yojson_biniou.cmx ydump.ml
gcc: error: /home/louis/.opam/4.03.1+bench/lib/yojson/yojson_biniou.o: No such file or directory
gcc: error: /home/louis/.opam/4.03.1+bench/lib/yojson/yojson.o: No such file or directory
File "caml_startup", line 1:
Error: Error during linking
Makefile:6: recipe for target 'all' failed
make: *** [all] Error 2
make: Leaving directory '/home/louis/.opam/4.03.1+bench/.opam-switch/build/yojson-bench.1.0/yojson'
Close

Error on valet-bench.1.0 (4.03.1+bench)

Command:

/usr/bin/make -C valet

Output

make: Entering directory '/home/louis/.opam/4.03.1+bench/.opam-switch/build/valet-bench.1.0/valet'
ocamlbuild -use-ocamlfind test_lwt.native test_async.native
ocamlfind ocamldep -package react -package uuidm -package unix -package ocplib-endian -package lwt.unix -modules test_lwt.ml > test_lwt.ml.depends
ocamlfind ocamldep -package react -package uuidm -package ocplib-endian -modules test_lib.ml > test_lib.ml.depends
ocamlfind ocamldep -package uuidm -package unix -package ocplib-endian -modules valet_core.ml > valet_core.ml.depends
ocamlfind ocamldep -package react -package uuidm -package ocplib-endian -modules valet_react.ml > valet_react.ml.depends
ocamlfind ocamlc -c -g -bin-annot -package uuidm -package unix -package ocplib-endian -o valet_core.cmo valet_core.ml
ocamlfind ocamlc -c -g -bin-annot -package react -package uuidm -package ocplib-endian -o valet_react.cmo valet_react.ml
ocamlfind ocamlc -c -g -bin-annot -package react -package uuidm -package ocplib-endian -o test_lib.cmo test_lib.ml
ocamlfind ocamlc -c -g -bin-annot -package react -package uuidm -package unix -package ocplib-endian -package lwt.unix -o test_lwt.cmo test_lwt.ml
+ ocamlfind ocamlc -c -g -bin-annot -package react -package uuidm -package unix -package ocplib-endian -package lwt.unix -o test_lwt.cmo test_lwt.ml
ocamlfind: [WARNING] Package `threads': Linking problems may arise because of the missing -thread or -vmthread switch
ocamlfind ocamlopt -c -g -bin-annot -package uuidm -package unix -package ocplib-endian -o valet_core.cmx valet_core.ml
ocamlfind ocamlopt -c -g -bin-annot -package react -package uuidm -package ocplib-endian -o valet_react.cmx valet_react.ml
ocamlfind ocamlopt -c -g -bin-annot -package react -package uuidm -package ocplib-endian -o test_lib.cmx test_lib.ml
ocamlfind ocamlopt -c -g -bin-annot -package react -package uuidm -package unix -package ocplib-endian -package lwt.unix -o test_lwt.cmx test_lwt.ml
+ ocamlfind ocamlopt -c -g -bin-annot -package react -package uuidm -package unix -package ocplib-endian -package lwt.unix -o test_lwt.cmx test_lwt.ml
ocamlfind: [WARNING] Package `threads': Linking problems may arise because of the missing -thread or -vmthread switch
ocamlfind ocamlopt -linkpkg -g -package react -package uuidm -package unix -package ocplib-endian -package lwt.unix valet_core.cmx valet_react.cmx test_lib.cmx test_lwt.cmx -o test_lwt.native
+ ocamlfind ocamlopt -linkpkg -g -package react -package uuidm -package unix -package ocplib-endian -package lwt.unix valet_core.cmx valet_react.cmx test_lib.cmx test_lwt.cmx -o test_lwt.native
ocamlfind: [WARNING] Package `threads': Linking problems may arise because of the missing -thread or -vmthread switch
File "_none_", line 1:
Error: No implementations provided for the following modules:
         Mutex referenced from /home/louis/.opam/4.03.1+bench/lib/lwt/unix/lwt_unix.cmxa(Lwt_main)
Command exited with code 2.
Makefile:6: recipe for target 'all' failed
make: *** [all] Error 10
make: Leaving directory '/home/louis/.opam/4.03.1+bench/.opam-switch/build/valet-bench.1.0/valet'
Close

Error on thread-bench.1.0 (4.07.1+oclassic+bench)

Command:

/usr/bin/make -C thread

Output

make: Entering directory '/home/louis/.opam/4.07.1+oclassic+bench/.opam-switch/build/thread-bench.1.0/thread'
ocamlfind ocamlopt -package lwt.unix -linkpkg -o thread_sleep_lwt thread_sleep_lwt.ml
ocamlfind: [WARNING] Package `threads': Linking problems may arise because of the missing -thread or -vmthread switch
File "thread_sleep_lwt.ml", line 1:
Error: No implementations provided for the following modules:
         Mutex referenced from /home/louis/.opam/4.07.1+oclassic+bench/lib/lwt/unix/lwt_unix.cmxa(Lwt_main)
Makefile:7: recipe for target 'thread_sleep_lwt' failed
make: *** [thread_sleep_lwt] Error 2
make: Leaving directory '/home/louis/.opam/4.07.1+oclassic+bench/.opam-switch/build/thread-bench.1.0/thread'
Close

Error on thread-bench.1.0 (4.07.1+clambda+bench)

Command:

/usr/bin/make -C thread

Output

make: Entering directory '/home/louis/.opam/4.07.1+clambda+bench/.opam-switch/build/thread-bench.1.0/thread'
ocamlfind ocamlopt -package lwt.unix -linkpkg -o thread_sleep_lwt thread_sleep_lwt.ml
ocamlfind: [WARNING] Package `threads': Linking problems may arise because of the missing -thread or -vmthread switch
File "thread_sleep_lwt.ml", line 1:
Error: No implementations provided for the following modules:
         Mutex referenced from /home/louis/.opam/4.07.1+clambda+bench/lib/lwt/unix/lwt_unix.cmxa(Lwt_main)
Makefile:7: recipe for target 'thread_sleep_lwt' failed
make: *** [thread_sleep_lwt] Error 2
make: Leaving directory '/home/louis/.opam/4.07.1+clambda+bench/.opam-switch/build/thread-bench.1.0/thread'
Close

Error on thread-bench.1.0 (4.03.1+bench)

Command:

/usr/bin/make -C thread

Output

make: Entering directory '/home/louis/.opam/4.03.1+bench/.opam-switch/build/thread-bench.1.0/thread'
ocamlfind ocamlopt -package lwt.unix -linkpkg -o thread_sleep_lwt thread_sleep_lwt.ml
ocamlfind: [WARNING] Package `threads': Linking problems may arise because of the missing -thread or -vmthread switch
File "thread_sleep_lwt.ml", line 1:
Error: No implementations provided for the following modules:
         Mutex referenced from /home/louis/.opam/4.03.1+bench/lib/lwt/unix/lwt_unix.cmxa(Lwt_main)
Makefile:7: recipe for target 'thread_sleep_lwt' failed
make: *** [thread_sleep_lwt] Error 2
make: Leaving directory '/home/louis/.opam/4.03.1+bench/.opam-switch/build/thread-bench.1.0/thread'
Close

Error on pcre.7.4.3 (4.08.0+trunk+bench)

Command:

~/.opam/4.08.0+trunk+bench/bin/dune build -p pcre -j 7

Output

    ocamlopt src/config/discover.exe (exit 2)
(cd _build/default && /home/louis/.opam/4.08.0+trunk+bench/bin/ocamlopt.opt -w -40 -g -O3 -o src/config/discover.exe /home/louis/.opam/4.08.0+trunk+bench/lib/base/base_internalhash_types/base_internalhash_types.cmxa -I /home/louis/.opam/4.08.0+trunk+bench/lib/base/base_internalhash_types /home/louis/.opam/4.08.0+trunk+bench/lib/base/caml/caml.cmxa /home/louis/.opam/4.08.0+trunk+bench/lib/sexplib0/sexplib0.cmxa /home/louis/.opam/4.08.0+trunk+bench/lib/base/shadow_stdlib/shadow_stdlib.cmxa /home/louis/.opam/4.08.0+trunk+bench/lib/base/base.cmxa -I /home/louis/.opam/4.08.0+trunk+bench/lib/base /home/louis/.opam/4.08.0+trunk+bench/lib/ocaml/unix.cmxa -I /home/louis/.opam/4.08.0+trunk+bench/lib/ocaml /home/louis/.opam/4.08.0+trunk+bench/lib/dune-private-libs/stdune/stdune.cmxa -I /home/louis/.opam/4.08.0+trunk+bench/lib/dune-private-libs/stdune /home/louis/.opam/4.08.0+trunk+bench/lib/dune-private-libs/ocaml-config/ocaml_config.cmxa /home/louis/.opam/4.08.0+trunk+bench/lib/dune-private-libs/dune-lang/dune_lang.cmxa /home/louis/.opam/4.08.0+trunk+bench/lib/dune-configurator/configurator.cmxa src/config/.discover.eobjs/native/discover.cmx)
/home/louis/.opam/4.08.0+trunk+bench/lib/base/libbase_stubs.a(exn_stubs.o): In function `Base_clear_caml_backtrace_pos':
/home/louis/.opam/4.08.0+trunk+bench/.opam-switch/build/base.v0.13.0/_build/default/src/exn_stubs.c:6: undefined reference to `caml_backtrace_pos'
collect2: error: ld returned 1 exit status
File "caml_startup", line 1:
Error: Error during linking
Close

Error on ocaml-variants.4.08.0+trunk+flambda+opt (4.08.0+trunk+flambda+opt+bench)

Command:

~/.opam/4.08.0+trunk+flambda+opt+bench/.opam-switch/build/ocaml-variants.4.08.0+trunk+flambda+opt/./configure -prefix /home/louis/.opam/4.08.0+trunk+flambda+opt+bench -flambda -with-debug-runtime

Output

configure: error: unrecognized option: `-flambda'
Try `/home/louis/.opam/4.08.0+trunk+flambda+opt+bench/.opam-switch/build/ocaml-variants.4.08.0+trunk+flambda+opt/./configure --help' for more information
Close

Error on ocaml-variants.4.08.0+trunk+flambda (4.08.0+trunk+flambda+bench)

Command:

~/.opam/4.08.0+trunk+flambda+bench/.opam-switch/build/ocaml-variants.4.08.0+trunk+flambda/./configure -prefix /home/louis/.opam/4.08.0+trunk+flambda+bench -flambda -with-debug-runtime

Output

configure: error: unrecognized option: `-flambda'
Try `/home/louis/.opam/4.08.0+trunk+flambda+bench/.opam-switch/build/ocaml-variants.4.08.0+trunk+flambda/./configure --help' for more information
Close

Error on ocaml-migrate-parsetree.1.6.0 (4.08.0+trunk+bench)

Command:

~/.opam/4.08.0+trunk+bench/bin/dune build -p ocaml-migrate-parsetree -j 7

Output

       ocaml src/ast-version,src/compiler-functions-file (exit 1)
(cd _build/default/src && /home/louis/.opam/4.08.0+trunk+bench/bin/ocaml config/gen.ml 4.11.0+dev0-2019-10-18)
Unkown OCaml version 4.11.0+dev0-2019-10-18
Close

Error on numerical-analysis-bench.1.0 (4.08.0+trunk+bench)

Command:

/usr/bin/make

Output

ulimit -s 98304; ocamlopt.opt  -I simple_access `ocamldep.opt -sort simple_access/*.ml` main_nogcstats.ml -o simple_access.opt
ulimit -s 98304; ocamlopt.opt  -I lu-decomposition `ocamldep.opt -sort lu-decomposition/*.ml` main_nogcstats.ml -o lu-decomposition.opt
ulimit -s 98304; ocamlopt.opt  -I fft `ocamldep.opt -sort fft/*.ml` main_nogcstats.ml -o fft.opt
ulimit -s 98304; ocamlopt.opt  -I rnd_access `ocamldep.opt -sort rnd_access/*.ml` main_nogcstats.ml -o rnd_access.opt
ulimit -s 98304; ocamlopt.opt  -I k-means `ocamldep.opt -sort k-means/*.ml` main_nogcstats.ml -o k-means.opt
Fatal error: exception Stack overflow
Makefile:20: recipe for target 'k-means.opt' failed
make: *** [k-means.opt] Error 2
Close

Error on core-micro-bench.1.0 (4.07.1+oclassic+bench)

Command:

/usr/bin/make -C core_micro

Output

make: Entering directory '/home/louis/.opam/4.07.1+oclassic+bench/.opam-switch/build/core-micro-bench.1.0/core_micro'
ocamlbuild -use-ocamlfind runner.native
ocamlfind ocamldep -package str -package core -package core_bench.inline_benchmarks -modules runner.ml > runner.ml.depends
ocamlfind ocamlc -c -thread -package str -package core -package core_bench.inline_benchmarks -o runner.cmo runner.ml
+ ocamlfind ocamlc -c -thread -package str -package core -package core_bench.inline_benchmarks -o runner.cmo runner.ml
File "runner.ml", line 1, characters 5-13:
Error: Unbound module Core.Std
Command exited with code 2.
Makefile:4: recipe for target 'all' failed
make: *** [all] Error 10
make: Leaving directory '/home/louis/.opam/4.07.1+oclassic+bench/.opam-switch/build/core-micro-bench.1.0/core_micro'
Close

Error on core-micro-bench.1.0 (4.07.1+clambda+bench)

Command:

/usr/bin/make -C core_micro

Output

make: Entering directory '/home/louis/.opam/4.07.1+clambda+bench/.opam-switch/build/core-micro-bench.1.0/core_micro'
ocamlbuild -use-ocamlfind runner.native
ocamlfind ocamldep -package str -package core -package core_bench.inline_benchmarks -modules runner.ml > runner.ml.depends
ocamlfind ocamlc -c -thread -package str -package core -package core_bench.inline_benchmarks -o runner.cmo runner.ml
+ ocamlfind ocamlc -c -thread -package str -package core -package core_bench.inline_benchmarks -o runner.cmo runner.ml
File "runner.ml", line 1, characters 5-13:
Error: Unbound module Core.Std
Command exited with code 2.
Makefile:4: recipe for target 'all' failed
make: *** [all] Error 10
make: Leaving directory '/home/louis/.opam/4.07.1+clambda+bench/.opam-switch/build/core-micro-bench.1.0/core_micro'
Close

Error on core-micro-bench.1.0 (4.03.1+bench)

Command:

/usr/bin/make -C core_micro

Output

make: Entering directory '/home/louis/.opam/4.03.1+bench/.opam-switch/build/core-micro-bench.1.0/core_micro'
ocamlbuild -use-ocamlfind runner.native
ocamlfind ocamldep -package str -package core -package core_bench.inline_benchmarks -modules runner.ml > runner.ml.depends
ocamlfind ocamlc -c -thread -package str -package core -package core_bench.inline_benchmarks -o runner.cmo runner.ml
+ ocamlfind ocamlc -c -thread -package str -package core -package core_bench.inline_benchmarks -o runner.cmo runner.ml
File "runner.ml", line 1, characters 5-13:
Warning 3: deprecated: module Core.Std
[since 2017-02] Use Core. The Std sub-module is no longer needed
File "runner.ml", line 3, characters 15-55:
Error: Unbound module Pa_bench_lib
Command exited with code 2.
Makefile:4: recipe for target 'all' failed
make: *** [all] Error 10
make: Leaving directory '/home/louis/.opam/4.03.1+bench/.opam-switch/build/core-micro-bench.1.0/core_micro'
Close

Error on conf-graphviz.0.1 (4.07.1+oclassic+bench)

Command:

/usr/bin/which dot

Output


Close

Error on conf-graphviz.0.1 (4.07.1+clambda+bench)

Command:

/usr/bin/which dot

Output


Close

Error on conf-graphviz.0.1 (4.03.1+bench)

Command:

/usr/bin/which dot

Output


Close

Error on cohttp-bench.1.0 (4.07.1+oclassic+bench)

Command:

/usr/bin/make -C cohttp

Output

make: Entering directory '/home/louis/.opam/4.07.1+oclassic+bench/.opam-switch/build/cohttp-bench.1.0/cohttp'
ocamlbuild -use-ocamlfind cohttp_lwt_bench.native cohttp_async_bench.native
ocamlfind ocamldep -package lwt.unix -package cohttp.lwt -modules cohttp_lwt_bench.ml > cohttp_lwt_bench.ml.depends
+ ocamlfind ocamldep -package lwt.unix -package cohttp.lwt -modules cohttp_lwt_bench.ml > cohttp_lwt_bench.ml.depends
ocamlfind: Package `cohttp.lwt' not found
Command exited with code 2.
Makefile:6: recipe for target 'all' failed
make: *** [all] Error 10
make: Leaving directory '/home/louis/.opam/4.07.1+oclassic+bench/.opam-switch/build/cohttp-bench.1.0/cohttp'
Close

Error on cohttp-bench.1.0 (4.07.1+clambda+bench)

Command:

/usr/bin/make -C cohttp

Output

make: Entering directory '/home/louis/.opam/4.07.1+clambda+bench/.opam-switch/build/cohttp-bench.1.0/cohttp'
ocamlbuild -use-ocamlfind cohttp_lwt_bench.native cohttp_async_bench.native
ocamlfind ocamldep -package lwt.unix -package cohttp.lwt -modules cohttp_lwt_bench.ml > cohttp_lwt_bench.ml.depends
+ ocamlfind ocamldep -package lwt.unix -package cohttp.lwt -modules cohttp_lwt_bench.ml > cohttp_lwt_bench.ml.depends
ocamlfind: Package `cohttp.lwt' not found
Command exited with code 2.
Makefile:6: recipe for target 'all' failed
make: *** [all] Error 10
make: Leaving directory '/home/louis/.opam/4.07.1+clambda+bench/.opam-switch/build/cohttp-bench.1.0/cohttp'
Close

Error on cohttp-bench.1.0 (4.03.1+bench)

Command:

/usr/bin/make -C cohttp

Output

make: Entering directory '/home/louis/.opam/4.03.1+bench/.opam-switch/build/cohttp-bench.1.0/cohttp'
ocamlbuild -use-ocamlfind cohttp_lwt_bench.native cohttp_async_bench.native
ocamlfind ocamldep -package lwt.unix -package cohttp.lwt -modules cohttp_lwt_bench.ml > cohttp_lwt_bench.ml.depends
+ ocamlfind ocamldep -package lwt.unix -package cohttp.lwt -modules cohttp_lwt_bench.ml > cohttp_lwt_bench.ml.depends
ocamlfind: Package `cohttp-lwt-unix' not found - required by `cohttp.lwt'
Command exited with code 2.
Makefile:6: recipe for target 'all' failed
make: *** [all] Error 10
make: Leaving directory '/home/louis/.opam/4.03.1+bench/.opam-switch/build/cohttp-bench.1.0/cohttp'
Close

Error on chameneos-bench.1.0 (4.07.1+oclassic+bench)

Command:

/usr/bin/make -C chameneos-redux

Output

make: Entering directory '/home/louis/.opam/4.07.1+oclassic+bench/.opam-switch/build/chameneos-bench.1.0/chameneos-redux'
ocamlopt -bin-annot -thread unix.cmxa threads.cmxa chameneos_redux_th.ml -o chameneos_redux_th
ocamlopt -bin-annot -thread unix.cmxa threads.cmxa chameneos_redux_evtchn.ml -o chameneos_redux_evtchn
ocamlfind ocamlopt -bin-annot -package lwt.unix -linkpkg chameneos_redux_lwt.ml -o chameneos_redux_lwt
ocamlfind: [WARNING] Package `threads': Linking problems may arise because of the missing -thread or -vmthread switch
File "chameneos_redux_lwt.ml", line 1:
Error: No implementations provided for the following modules:
         Mutex referenced from /home/louis/.opam/4.07.1+oclassic+bench/lib/lwt/unix/lwt_unix.cmxa(Lwt_main)
Makefile:6: recipe for target 'chameneos_redux_lwt' failed
make: *** [chameneos_redux_lwt] Error 2
make: Leaving directory '/home/louis/.opam/4.07.1+oclassic+bench/.opam-switch/build/chameneos-bench.1.0/chameneos-redux'
Close

Error on chameneos-bench.1.0 (4.07.1+clambda+bench)

Command:

/usr/bin/make -C chameneos-redux

Output

make: Entering directory '/home/louis/.opam/4.07.1+clambda+bench/.opam-switch/build/chameneos-bench.1.0/chameneos-redux'
ocamlopt -bin-annot -thread unix.cmxa threads.cmxa chameneos_redux_th.ml -o chameneos_redux_th
ocamlopt -bin-annot -thread unix.cmxa threads.cmxa chameneos_redux_evtchn.ml -o chameneos_redux_evtchn
ocamlfind ocamlopt -bin-annot -package lwt.unix -linkpkg chameneos_redux_lwt.ml -o chameneos_redux_lwt
ocamlfind: [WARNING] Package `threads': Linking problems may arise because of the missing -thread or -vmthread switch
File "chameneos_redux_lwt.ml", line 1:
Error: No implementations provided for the following modules:
         Mutex referenced from /home/louis/.opam/4.07.1+clambda+bench/lib/lwt/unix/lwt_unix.cmxa(Lwt_main)
Makefile:6: recipe for target 'chameneos_redux_lwt' failed
make: *** [chameneos_redux_lwt] Error 2
make: Leaving directory '/home/louis/.opam/4.07.1+clambda+bench/.opam-switch/build/chameneos-bench.1.0/chameneos-redux'
Close

Error on chameneos-bench.1.0 (4.03.1+bench)

Command:

/usr/bin/make -C chameneos-redux

Output

make: Entering directory '/home/louis/.opam/4.03.1+bench/.opam-switch/build/chameneos-bench.1.0/chameneos-redux'
ocamlopt -bin-annot -thread unix.cmxa threads.cmxa chameneos_redux_th.ml -o chameneos_redux_th
ocamlopt -bin-annot -thread unix.cmxa threads.cmxa chameneos_redux_evtchn.ml -o chameneos_redux_evtchn
ocamlfind ocamlopt -bin-annot -package lwt.unix -linkpkg chameneos_redux_lwt.ml -o chameneos_redux_lwt
ocamlfind: [WARNING] Package `threads': Linking problems may arise because of the missing -thread or -vmthread switch
File "chameneos_redux_lwt.ml", line 1:
Error: No implementations provided for the following modules:
         Mutex referenced from /home/louis/.opam/4.03.1+bench/lib/lwt/unix/lwt_unix.cmxa(Lwt_main)
Makefile:6: recipe for target 'chameneos_redux_lwt' failed
make: *** [chameneos_redux_lwt] Error 2
make: Leaving directory '/home/louis/.opam/4.03.1+bench/.opam-switch/build/chameneos-bench.1.0/chameneos-redux'
Close

Error on camlimages.5.0.1 (4.08.0+trunk+bench)

Command:

~/.opam/4.08.0+trunk+bench/bin/jbuilder build -p camlimages -j 7

Output

       ocaml (internal)
ocamlfind: Package `graphics' not found
    ocamlopt config/.ciconfig.eobjs/xConfigurator.{cmx,o}
File "config/xConfigurator.ml", line 23, characters 16-25:
23 |     | exception Not_found -> []
                     ^^^^^^^^^
Alert deprecated: Not_found
[2016-09] this element comes from the stdlib distributed with OCaml.
Instead of raising [Not_found], consider using [raise_s] with an informative error
message.  If code needs to distinguish [Not_found] from other exceptions, please change
it to handle both [Not_found] and [Not_found_s].  Then, instead of raising [Not_found],
raise [Not_found_s] with an informative error message.
    ocamlopt config/ciconfig.exe (exit 2)
(cd _build/default && /home/louis/.opam/4.08.0+trunk+bench/bin/ocamlopt.opt -w -40 -w -6 -g -o config/ciconfig.exe -I /home/louis/.opam/4.08.0+trunk+bench/lib/base -I /home/louis/.opam/4.08.0+trunk+bench/lib/base/base_internalhash_types -I /home/louis/.opam/4.08.0+trunk+bench/lib/base/caml -I /home/louis/.opam/4.08.0+trunk+bench/lib/base/shadow_stdlib -I /home/louis/.opam/4.08.0+trunk+bench/lib/configurator -I /home/louis/.opam/4.08.0+trunk+bench/lib/findlib -I /home/louis/.opam/4.08.0+trunk+bench/lib/sexplib0 -I /home/louis/.opam/4.08.0+trunk+bench/lib/stdio /home/louis/.opam/4.08.0+trunk+bench/lib/base/base_internalhash_types/base_internalhash_types.cmxa /home/louis/.opam/4.08.0+trunk+bench/lib/base/caml/caml.cmxa /home/louis/.opam/4.08.0+trunk+bench/lib/base/shadow_stdlib/shadow_stdlib.cmxa /home/louis/.opam/4.08.0+trunk+bench/lib/sexplib0/sexplib0.cmxa /home/louis/.opam/4.08.0+trunk+bench/lib/base/base.cmxa /home/louis/.opam/4.08.0+trunk+bench/lib/stdio/stdio.cmxa /home/louis/.opam/4.08.0+trunk+bench/lib/ocaml/unix.cmxa /home/louis/.opam/4.08.0+trunk+bench/lib/configurator/configurator.cmxa /home/louis/.opam/4.08.0+trunk+bench/lib/findlib/findlib.cmxa config/.ciconfig.eobjs/xConfigurator.cmx config/.ciconfig.eobjs/ciconfig.cmx)
/home/louis/.opam/4.08.0+trunk+bench/lib/base/libbase_stubs.a(exn_stubs.o): In function `Base_clear_caml_backtrace_pos':
/home/louis/.opam/4.08.0+trunk+bench/.opam-switch/build/base.v0.13.0/_build/default/src/exn_stubs.c:6: undefined reference to `caml_backtrace_pos'
collect2: error: ld returned 1 exit status
File "caml_startup", line 1:
Error: Error during linking
Close

Error on async-rpc-bench.1.0 (4.07.1+oclassic+bench)

Command:

/usr/bin/make -C async_rpc

Output

make: Entering directory '/home/louis/.opam/4.07.1+oclassic+bench/.opam-switch/build/async-rpc-bench.1.0/async_rpc'
ocamlfind ocamlopt -thread -syntax camlp4o -package async -package bin_prot.syntax -package core -c rpc_common.ml
ocamlfind: Package `bin_prot.syntax' not found
Makefile:12: recipe for target 'rpc_common.cmx' failed
make: *** [rpc_common.cmx] Error 2
make: Leaving directory '/home/louis/.opam/4.07.1+oclassic+bench/.opam-switch/build/async-rpc-bench.1.0/async_rpc'
Close

Error on async-rpc-bench.1.0 (4.07.1+clambda+bench)

Command:

/usr/bin/make -C async_rpc

Output

make: Entering directory '/home/louis/.opam/4.07.1+clambda+bench/.opam-switch/build/async-rpc-bench.1.0/async_rpc'
ocamlfind ocamlopt -thread -syntax camlp4o -package async -package bin_prot.syntax -package core -c rpc_common.ml
ocamlfind: Package `bin_prot.syntax' not found
Makefile:12: recipe for target 'rpc_common.cmx' failed
make: *** [rpc_common.cmx] Error 2
make: Leaving directory '/home/louis/.opam/4.07.1+clambda+bench/.opam-switch/build/async-rpc-bench.1.0/async_rpc'
Close

Error on async-rpc-bench.1.0 (4.03.1+bench)

Command:

/usr/bin/make -C async_rpc

Output

make: Entering directory '/home/louis/.opam/4.03.1+bench/.opam-switch/build/async-rpc-bench.1.0/async_rpc'
ocamlfind ocamlopt -thread -syntax camlp4o -package async -package bin_prot.syntax -package core -c rpc_common.ml
ocamlfind: Package `bin_prot.syntax' not found
Makefile:12: recipe for target 'rpc_common.cmx' failed
make: *** [rpc_common.cmx] Error 2
make: Leaving directory '/home/louis/.opam/4.03.1+bench/.opam-switch/build/async-rpc-bench.1.0/async_rpc'
Close

Error on async-echo-bench.1.0 (4.07.1+oclassic+bench)

Command:

/usr/bin/make -C async_echo

Output

make: Entering directory '/home/louis/.opam/4.07.1+oclassic+bench/.opam-switch/build/async-echo-bench.1.0/async_echo'
ocamlfind ocamlopt -thread -syntax camlp4o -package async -package bin_prot.syntax -package core -c echo_common.ml
ocamlfind: Package `bin_prot.syntax' not found
Makefile:20: recipe for target 'echo_common.cmx' failed
make: *** [echo_common.cmx] Error 2
make: Leaving directory '/home/louis/.opam/4.07.1+oclassic+bench/.opam-switch/build/async-echo-bench.1.0/async_echo'
Close

Error on async-echo-bench.1.0 (4.07.1+clambda+bench)

Command:

/usr/bin/make -C async_echo

Output

make: Entering directory '/home/louis/.opam/4.07.1+clambda+bench/.opam-switch/build/async-echo-bench.1.0/async_echo'
ocamlfind ocamlopt -thread -syntax camlp4o -package async -package bin_prot.syntax -package core -c echo_common.ml
ocamlfind: Package `bin_prot.syntax' not found
Makefile:20: recipe for target 'echo_common.cmx' failed
make: *** [echo_common.cmx] Error 2
make: Leaving directory '/home/louis/.opam/4.07.1+clambda+bench/.opam-switch/build/async-echo-bench.1.0/async_echo'
Close

Error on async-echo-bench.1.0 (4.03.1+bench)

Command:

/usr/bin/make -C async_echo

Output

make: Entering directory '/home/louis/.opam/4.03.1+bench/.opam-switch/build/async-echo-bench.1.0/async_echo'
ocamlfind ocamlopt -thread -syntax camlp4o -package async -package bin_prot.syntax -package core -c echo_common.ml
ocamlfind: Package `bin_prot.syntax' not found
Makefile:20: recipe for target 'echo_common.cmx' failed
make: *** [echo_common.cmx] Error 2
make: Leaving directory '/home/louis/.opam/4.03.1+bench/.opam-switch/build/async-echo-bench.1.0/async_echo'