Package4.03.1+bench4.05.0+flambda+opt+bench4.06.1+flambda+bench4.06.1+flambda+opt+bench4.07.1+clambda+bench4.07.1+flambda+bench4.07.1+oclassic+bench4.08.0+gpr2165+bench4.08.0+mutmatch+bench4.08.0+trunk+bench4.08.0+trunk+flambda+bench4.08.0+trunk+flambda+oclassic+bench4.08.0+trunk+flambda+opt+bench4.03.1+bench time (s)4.05.0+flambda+opt+bench time (s)4.06.1+flambda+bench time (s)4.06.1+flambda+opt+bench time (s)4.07.1+clambda+bench time (s)4.07.1+flambda+bench time (s)4.07.1+oclassic+bench time (s)4.08.0+gpr2165+bench time (s)4.08.0+mutmatch+bench time (s)4.08.0+trunk+bench time (s)4.08.0+trunk+flambda+bench time (s)4.08.0+trunk+flambda+oclassic+bench time (s)4.08.0+trunk+flambda+opt+bench time (s)
almabench-bench.1.0----------Aborted-Aborted----------0.000-0.000
alt-ergo.2.3.1----OKOKOK---Aborted-Aborted----23.37814.32415.962---0.000-0.000
alt-ergo-lib.2.3.1----OKOKOK---Aborted-Aborted----22.98929.70325.562---0.000-0.000
alt-ergo-parsers.2.3.1----OKOKOK---Aborted-Aborted----13.16116.65313.738---0.000-0.000
async.v0.12.0----OKOKOK----------1.8302.4712.339------
async.v0.13.0--------AbortedAbortedAborted-Aborted--------0.0000.0000.000-0.000
async.v0.9.0OK------------0.904------------
async-echo-bench.1.0Failure (2)---Failure (2)Failure (2)Failure (2)-AbortedAbortedAborted-Aborted0.639---0.6030.6282.304-0.0000.0000.000-0.000
async-rpc-bench.1.0Failure (2)---Failure (2)Failure (2)Failure (2)-AbortedAbortedAborted-Aborted0.550---0.5160.5352.208-0.0000.0000.000-0.000
async_extra.v0.12.0----OKOKOK----------3.6775.1255.033------
async_extra.v0.9.0OK------------7.313------------
async_kernel.v0.12.0----OKOKOK----------13.37122.42815.198------
async_kernel.v0.13.0--------AbortedAbortedAborted-Aborted--------0.0000.0000.000-0.000
async_kernel.v0.9.0OK------------11.878------------
async_rpc_kernel.v0.12.0----OKOKOK----------10.65011.73611.318------
async_rpc_kernel.v0.13.0--------AbortedAbortedAborted-Aborted--------0.0000.0000.000-0.000
async_rpc_kernel.v0.9.0OK------------4.803------------
async_unix.v0.12.0----OKOKOK----------15.19319.36414.840------
async_unix.v0.13.0--------AbortedAbortedAborted-Aborted--------0.0000.0000.000-0.000
async_unix.v0.9.0OK------------11.782------------
base.v0.12.2----OKOKOK----------6.2608.0347.063------
base.v0.13.1--------AbortedOKAborted-Aborted--------0.0007.2840.000-0.000
base-bytes.base----------Aborted-Aborted----------0.000-0.000
base64.2.3.0OK------------0.603------------
base64.3.3.0----OKOKOK-AbortedOKAborted-Aborted----2.1692.3852.054-0.0001.6460.000-0.000
base_bigstring.v0.12.0----OKOKOK----------3.8474.4322.461------
base_bigstring.v0.13.0--------AbortedAbortedAborted-Aborted--------0.0000.0000.000-0.000
base_quickcheck.v0.12.1----OKOKOK----------4.7525.4528.343------
base_quickcheck.v0.13.0--------AbortedAbortedAborted-Aborted--------0.0000.0000.000-0.000
bdd-bench.1.0----------Aborted-Aborted----------0.000-0.000
bin_prot.v0.12.0----OKOKOK----------14.1729.16711.178------
bin_prot.v0.13.0--------AbortedAbortedAborted-Aborted--------0.0000.0000.000-0.000
bin_prot.v0.9.1OK------------7.044------------
biniou.1.2.1OK---OKOKOK-AbortedOKAborted-Aborted13.583---26.69633.60829.576-0.00018.4720.000-0.000
camlimages.5.0.1--------Aborted-Aborted-Aborted--------0.000-0.000-0.000
camlpdf.2.3----------Aborted-Aborted----------0.000-0.000
camlzip.1.10----------Aborted-Aborted----------0.000-0.000
chameneos-bench.1.0Failure (2)---Failure (2)Failure (2)Failure (2)-AbortedAbortedAborted-Aborted0.630---0.4390.4911.728-0.0000.0000.000-0.000
cohttp.1.1.1OK------------5.009------------
cohttp.2.4.0----OKOKOK----------10.0006.5358.091------
cohttp.2.5.1--------AbortedAbortedAborted-Aborted--------0.0000.0000.000-0.000
cohttp-bench.1.0Failure (2)---Failure (2)Failure (2)Failure (2)-AbortedAbortedAborted-Aborted0.357---0.2800.3371.574-0.0000.0000.000-0.000
conf-graphviz.0.1Failure (1)---Failure (1)Failure (1)Failure (1)------0.179---0.1680.1650.185------
configurator.v0.11.0----OKOKOK-AbortedOKAborted-Aborted----9.0944.9225.824-0.0002.8280.000-0.000
configurator.v0.9.1OK------------2.626------------
core.v0.12.4----OKOKOK----------27.37934.82028.371------
core.v0.13.0--------AbortedAbortedAborted-Aborted--------0.0000.0000.000-0.000
core.v0.9.1OK------------28.714------------
core-micro-bench.1.0Failure (2)---Failure (2)Failure (2)Failure (2)-AbortedAbortedAborted-Aborted1.236---5.5855.4311.517-0.0000.0000.000-0.000
core-sequence-bench.1.0OK---OKOKOK-AbortedAbortedAborted-Aborted0.052---0.0580.1170.072-0.0000.0000.000-0.000
core_bench.v0.12.0----OKOKOK----------5.4935.1099.215------
core_bench.v0.13.0--------AbortedAbortedAborted-Aborted--------0.0000.0000.000-0.000
core_bench.v0.9.0OK------------3.464------------
core_extended.v0.12.0----OKOKOK----------5.7326.6046.917------
core_extended.v0.9.0OK------------20.953------------
core_kernel.v0.12.3----OKOKOK----------39.23966.75239.231------
core_kernel.v0.13.1--------AbortedAbortedAborted-Aborted--------0.0000.0000.000-0.000
core_kernel.v0.9.0OK------------28.418------------
cpdf.2.3----------Aborted-Aborted----------0.000-0.000
cpdf-bench.1.0----------Aborted-Aborted----------0.000-0.000
cppo.1.6.6OK---OKOKOK-AbortedOKAborted-Aborted0.925---1.1961.8171.764-0.0001.2670.000-0.000
dune.2.2.0OK------------10.348------------
dune.2.3.1----OKOKOK-Failure (2)OKAborted-Aborted----13.62518.35015.255-0.88213.4190.000-0.000
dune-configurator.1.11.4OK------------4.009------------
dune-configurator.2.3.1----OKOKOK-AbortedOKAborted-Aborted----16.79117.46617.379-0.0008.5810.000-0.000
dune-private-libs.2.3.1----OKOKOK-AbortedOKAborted-Aborted----10.66414.19213.039-0.0005.5070.000-0.000
easy-format.1.3.2OK---OKOKOK-AbortedOKAborted-Aborted0.243---0.3440.4110.387-0.0000.3420.000-0.000
expect_test_helpers.v0.12.0----OKOKOK----------2.0822.1852.221------
expect_test_helpers_kernel.v0.12.0----OKOKOK----------8.68210.0669.786------
fieldslib.v0.12.0----OKOKOK----------0.3111.7111.300------
fieldslib.v0.13.0--------AbortedOKAborted-Aborted--------0.0003.0350.000-0.000
fieldslib.v0.9.0OK------------1.463------------
frama-c.19.1OK------------74.457------------
frama-c.20.0----OKOKOK----------95.299168.039112.842------
frama-c-bench.1.0OK---OKOKOK------0.365---0.3800.1580.216------
jane-street-headers.v0.12.0----OKOKOK----------0.2020.2250.212------
jane-street-headers.v0.13.0--------AbortedOKAborted-Aborted--------0.0000.2350.000-0.000
jbuilder.1.0+beta20.2----------Aborted-Aborted----------0.000-0.000
json-bench-data.1.0----------Aborted-Aborted----------0.000-0.000
jsonm.1.0.1----------Aborted-Aborted----------0.000-0.000
jsonm-bench.1.0----------Aborted-Aborted----------0.000-0.000
jst-config.v0.12.0----OKOKOK----------15.7599.91711.486------
jst-config.v0.13.0--------AbortedAbortedAborted-Aborted--------0.0000.0000.000-0.000
kb-bench.1.0----------Aborted-Aborted----------0.000-0.000
lexifi-g2pp-bench.1.0----------Aborted-Aborted----------0.000-0.000
lwt.5.1.2OK---OKOKOK-AbortedOKAborted-Aborted4.741---20.30218.34217.849-0.00015.7890.000-0.000
menhir.20200211OK-------AbortedOKAborted-Aborted15.042-------0.00018.3440.000-0.000
menhir-bench.1.0OK-------AbortedOKAborted-Aborted0.370-------0.0000.2900.000-0.000
menhirLib.20200211OK-------AbortedOKAborted-Aborted1.725-------0.0001.2470.000-0.000
menhirSdk.20200211OK-------AbortedOKAborted-Aborted0.526-------0.0000.7330.000-0.000
minilight.1.6----------Aborted-Aborted----------0.000-0.000
minilight-bench.1.0----------Aborted-Aborted----------0.000-0.000
mmap.1.1.0OK---OKOKOK-AbortedOKAborted-Aborted0.354---0.3120.3940.393-0.0000.3870.000-0.000
nbcodec.1.0----------Aborted-Aborted----------0.000-0.000
nbcodec-bench.1.0----------Aborted-Aborted----------0.000-0.000
num.1.3----------Aborted-Aborted----------0.000-0.000
numerical-analysis-bench.1.0---------Failure (2)Aborted-Aborted---------9.1750.000-0.000
ocaml.4.08.0----------Aborted-Aborted----------0.000-0.000
ocaml-compiler-libs.v0.12.1----OKOKOK-AbortedOKAborted-Aborted----1.7072.7582.498-0.0002.8120.000-0.000
ocaml-migrate-parsetree.1.6.0OK---OKOKOK-AbortedFailure (1)Aborted-Aborted8.496---21.83625.48222.623-0.0004.5630.000-0.000
ocaml-variants.4.08.0+trunk+flambda----------Failure (1)------------0.310--
ocaml-variants.4.08.0+trunk+flambda+opt------------Failure (1)------------0.293
ocamlbuild.0.14.0----------Aborted-Aborted----------0.000-0.000
ocamlfind.1.8.1----------Aborted-Aborted----------0.000-0.000
ocplib-endian.0.8OK------------27.104------------
ocplib-endian.1.0----OKOKOK-AbortedOKAborted-Aborted----38.20444.90540.879-0.00023.3600.000-0.000
ocplib-simplex.0.4----------Aborted-Aborted----------0.000-0.000
octavius.1.2.2OK---OKOKOK-AbortedOKAborted-Aborted2.195---2.3133.7573.556-0.0003.5250.000-0.000
parsexp.v0.12.0----OKOKOK----------3.9385.0004.559------
parsexp.v0.13.0--------AbortedOKAborted-Aborted--------0.0003.2480.000-0.000
patdiff.v0.12.1----OKOKOK----------5.3617.3066.097------
patdiff.v0.13.0--------AbortedAbortedAborted-Aborted--------0.0000.0000.000-0.000
patdiff.v0.9.0OK------------5.941------------
patdiff-bench.1.0OK---OKOKOK-AbortedAbortedAborted-Aborted0.150---0.2270.1790.201-0.0000.0000.000-0.000
patience_diff.v0.12.0----OKOKOK----------6.0036.9236.974------
patience_diff.v0.13.0--------AbortedAbortedAborted-Aborted--------0.0000.0000.000-0.000
patience_diff.v0.9.0OK------------2.068------------
pcre.7.4.1----OKOKOK----------3.9505.4415.284------
pcre.7.4.3--------AbortedOKAborted-Aborted--------0.0003.8930.000-0.000
ppx_assert.v0.12.0----OKOKOK----------10.7806.8587.571------
ppx_assert.v0.13.0--------AbortedAbortedAborted-Aborted--------0.0000.0000.000-0.000
ppx_assert.v0.9.0OK------------3.778------------
ppx_ast.v0.9.1OK------------2.948------------
ppx_base.v0.12.0----OKOKOK----------16.96611.08916.614------
ppx_base.v0.13.0--------AbortedAbortedAborted-Aborted--------0.0000.0000.000-0.000
ppx_base.v0.9.0OK------------5.310------------
ppx_bench.v0.12.0----OKOKOK----------8.2785.5734.691------
ppx_bench.v0.13.0--------AbortedAbortedAborted-Aborted--------0.0000.0000.000-0.000
ppx_bench.v0.9.1OK------------3.589------------
ppx_bin_prot.v0.12.1----OKOKOK----------5.0124.4498.038------
ppx_bin_prot.v0.13.0--------AbortedAbortedAborted-Aborted--------0.0000.0000.000-0.000
ppx_bin_prot.v0.9.0OK------------5.610------------
ppx_cold.v0.13.0--------AbortedAbortedAborted-Aborted--------0.0000.0000.000-0.000
ppx_compare.v0.12.0----OKOKOK----------2.0485.1464.743------
ppx_compare.v0.13.0--------AbortedAbortedAborted-Aborted--------0.0000.0000.000-0.000
ppx_compare.v0.9.0OK------------4.162------------
ppx_core.v0.9.0OK------------5.104------------
ppx_custom_printf.v0.12.1----OKOKOK----------13.0097.6359.610------
ppx_custom_printf.v0.13.0--------AbortedAbortedAborted-Aborted--------0.0000.0000.000-0.000
ppx_custom_printf.v0.9.0OK------------7.111------------
ppx_derivers.1.2.1OK---OKOKOK-AbortedOKAborted-Aborted0.295---0.5310.7060.518-0.0000.6260.000-0.000
ppx_driver.v0.9.1OK------------2.877------------
ppx_enumerate.v0.12.0----OKOKOK----------1.9335.3494.788------
ppx_enumerate.v0.13.0--------AbortedAbortedAborted-Aborted--------0.0000.0000.000-0.000
ppx_enumerate.v0.9.0OK------------2.273------------
ppx_expect.v0.12.0----OKOKOK----------16.70210.84214.297------
ppx_expect.v0.13.0--------AbortedAbortedAborted-Aborted--------0.0000.0000.000-0.000
ppx_expect.v0.9.0OK------------11.570------------
ppx_fail.v0.12.0----OKOKOK----------10.3206.8637.368------
ppx_fail.v0.13.0--------AbortedAbortedAborted-Aborted--------0.0000.0000.000-0.000
ppx_fail.v0.9.0OK------------5.263------------
ppx_fields_conv.v0.12.0----OKOKOK----------2.0935.3935.266------
ppx_fields_conv.v0.13.0--------AbortedAbortedAborted-Aborted--------0.0000.0000.000-0.000
ppx_fields_conv.v0.9.0OK------------4.718------------
ppx_hash.v0.12.0----OKOKOK----------15.1448.86710.311------
ppx_hash.v0.13.0--------AbortedAbortedAborted-Aborted--------0.0000.0000.000-0.000
ppx_hash.v0.9.0OK------------2.378------------
ppx_here.v0.12.0----OKOKOK----------1.7943.7014.310------
ppx_here.v0.13.0--------AbortedAbortedAborted-Aborted--------0.0000.0000.000-0.000
ppx_here.v0.9.1OK------------3.335------------
ppx_inline_test.v0.12.0----OKOKOK----------2.7717.8117.874------
ppx_inline_test.v0.13.0--------AbortedAbortedAborted-Aborted--------0.0000.0000.000-0.000
ppx_inline_test.v0.9.2OK------------6.042------------
ppx_jane.v0.12.0----OKOKOK----------2.2794.0903.737------
ppx_jane.v0.13.0--------AbortedAbortedAborted-Aborted--------0.0000.0000.000-0.000
ppx_jane.v0.9.0OK------------2.900------------
ppx_js_style.v0.12.0----OKOKOK----------2.8417.4077.224------
ppx_js_style.v0.13.0--------AbortedAbortedAborted-Aborted--------0.0000.0000.000-0.000
ppx_js_style.v0.9.0OK------------9.357------------
ppx_let.v0.12.0----OKOKOK----------1.6604.7254.493------
ppx_let.v0.13.0--------AbortedAbortedAborted-Aborted--------0.0000.0000.000-0.000
ppx_let.v0.9.0OK------------2.258------------
ppx_metaquot.v0.9.0OK------------4.381------------
ppx_module_timer.v0.12.0----OKOKOK----------5.6765.90410.490------
ppx_module_timer.v0.13.0--------AbortedAbortedAborted-Aborted--------0.0000.0000.000-0.000
ppx_optcomp.v0.12.0----OKOKOK----------1.5113.1653.239------
ppx_optcomp.v0.13.0--------AbortedAbortedAborted-Aborted--------0.0000.0000.000-0.000
ppx_optcomp.v0.9.0OK------------1.683------------
ppx_optional.v0.12.0----OKOKOK----------1.5853.8594.345------
ppx_optional.v0.13.0--------AbortedAbortedAborted-Aborted--------0.0000.0000.000-0.000
ppx_optional.v0.9.0OK------------2.400------------
ppx_pipebang.v0.12.0----OKOKOK----------4.7539.19611.502------
ppx_pipebang.v0.13.0--------AbortedAbortedAborted-Aborted--------0.0000.0000.000-0.000
ppx_pipebang.v0.9.0OK------------10.063------------
ppx_sexp_conv.v0.12.0----OKOKOK----------6.1878.19311.932------
ppx_sexp_conv.v0.13.0--------AbortedAbortedAborted-Aborted--------0.0000.0000.000-0.000
ppx_sexp_conv.v0.9.0OK------------4.964------------
ppx_sexp_message.v0.12.0----OKOKOK----------15.1278.93410.281------
ppx_sexp_message.v0.13.0--------AbortedAbortedAborted-Aborted--------0.0000.0000.000-0.000
ppx_sexp_message.v0.9.0OK------------5.408------------
ppx_sexp_value.v0.12.0----OKOKOK----------18.39011.83413.617------
ppx_sexp_value.v0.13.0--------AbortedAbortedAborted-Aborted--------0.0000.0000.000-0.000
ppx_sexp_value.v0.9.0OK------------6.252------------
ppx_stable.v0.12.0----OKOKOK----------13.82713.33216.056------
ppx_stable.v0.13.0--------AbortedAbortedAborted-Aborted--------0.0000.0000.000-0.000
ppx_traverse.v0.9.0OK------------5.577------------
ppx_type_conv.v0.9.1OK------------10.934------------
ppx_typerep_conv.v0.12.0----OKOKOK----------13.45513.23315.768------
ppx_typerep_conv.v0.13.0--------AbortedAbortedAborted-Aborted--------0.0000.0000.000-0.000
ppx_typerep_conv.v0.9.0OK------------1.942------------
ppx_variants_conv.v0.12.0----OKOKOK----------13.50712.87015.040------
ppx_variants_conv.v0.13.0--------AbortedAbortedAborted-Aborted--------0.0000.0000.000-0.000
ppx_variants_conv.v0.9.0OK------------3.640------------
ppxlib.0.12.0--------AbortedAbortedAborted-Aborted--------0.0000.0000.000-0.000
ppxlib.0.8.1----OKOKOK----------11.30818.09913.994------
protocol_version_header.v0.12.0----OKOKOK----------3.23611.72011.956------
protocol_version_header.v0.13.0--------AbortedAbortedAborted-Aborted--------0.0000.0000.000-0.000
psmt2-frontend.0.2--------Aborted-Aborted-Aborted--------0.000-0.000-0.000
re.1.9.0OK---OKOKOK-AbortedOKAborted-Aborted5.342---2.7784.2344.050-0.00015.4600.000-0.000
re2.v0.12.1----OKOKOK----------65.31066.98768.045------
re2.v0.9.0OK------------63.176------------
result.1.5OK---OKOKOK-AbortedOKAborted-Aborted13.806---0.7330.8710.946-0.0000.7260.000-0.000
sauvola-bench.1.0--------Aborted-Aborted-Aborted--------0.000-0.000-0.000
seq.0.2.2OK------------14.037------------
seq.base----------Aborted-Aborted----------0.000-0.000
sequence-bench.1.0----------Aborted-Aborted----------0.000-0.000
sexp_pretty.v0.12.0----OKOKOK----------1.7385.4335.205------
sexplib.v0.12.0----OKOKOK----------7.6473.6543.740------
sexplib.v0.13.0--------AbortedOKAborted-Aborted--------0.0002.5010.000-0.000
sexplib0.v0.12.0----OKOKOK----------1.3671.6821.233------
sexplib0.v0.13.0--------AbortedOKAborted-Aborted--------0.0001.1740.000-0.000
shell.v0.12.0----OKOKOK----------3.1224.1793.234------
spawn.v0.13.0----OKOKOK-AbortedOKAborted-Aborted----2.6721.0181.133-0.0000.9260.000-0.000
splittable_random.v0.12.0----OKOKOK----------15.62810.21315.858------
splittable_random.v0.13.0--------AbortedAbortedAborted-Aborted--------0.0000.0000.000-0.000
stdio.v0.12.0----OKOKOK----------0.9685.5715.793------
stdio.v0.13.0--------AbortedOKAborted-Aborted--------0.0004.3890.000-0.000
stdlib-shims.0.1.0----OKOKOK-AbortedOKAborted-Aborted----27.55333.85829.798-0.00019.0890.000-0.000
stringext.1.6.0OK---OKOKOK-AbortedOKAborted-Aborted14.339---28.12034.98330.925-0.00019.7760.000-0.000
textutils.v0.12.0----OKOKOK----------3.8559.4509.859------
textutils.v0.13.0--------AbortedAbortedAborted-Aborted--------0.0000.0000.000-0.000
textutils.v0.9.0OK------------1.889------------
textutils_kernel.v0.12.0----OKOKOK----------10.9474.4084.561------
thread-bench.1.0Failure (2)---Failure (2)Failure (2)Failure (2)-AbortedAbortedAborted-Aborted0.266---0.1820.2331.426-0.0000.0000.000-0.000
time_now.v0.12.0----OKOKOK----------3.5414.6003.446------
time_now.v0.13.0--------AbortedAbortedAborted-Aborted--------0.0000.0000.000-0.000
topkg.1.0.1----------Aborted-Aborted----------0.000-0.000
typerep.v0.12.0----OKOKOK----------10.9586.3736.426------
typerep.v0.13.0--------AbortedOKAborted-Aborted--------0.0004.9740.000-0.000
uchar.0.0.2----------Aborted-Aborted----------0.000-0.000
uri.1.9.7OK------------7.021------------
uri.3.1.0----OKOKOK-AbortedOKAborted-Aborted----9.2229.1119.311-0.0003.1430.000-0.000
uri-sexp.3.1.0----OKOKOK-AbortedAbortedAborted-Aborted----2.8482.9693.256-0.0000.0000.000-0.000
uutf.1.0.2----------Aborted-Aborted----------0.000-0.000
valet-bench.1.0Failure (2)------------0.327------------
variantslib.v0.12.0----OKOKOK----------12.2838.3508.496------
variantslib.v0.13.0--------AbortedOKAborted-Aborted--------0.0006.0070.000-0.000
variantslib.v0.9.0OK------------5.924------------
yojson.1.7.0OK---OKOKOK-AbortedOKAborted-Aborted10.101---9.0629.4729.216-0.0002.8010.000-0.000
yojson-bench.1.0Failure (2)---Failure (2)Failure (2)Failure (2)-AbortedFailure (2)Aborted-Aborted0.164---11.6701.4890.235-0.0000.2880.000-0.000
zarith.1.9.1----------Aborted-Aborted----------0.000-0.000
Close

Error on yojson-bench.1.0 (4.08.0+trunk+bench)

Command:

/usr/bin/make -C yojson

Output

make: Entering directory '/home/louis/.opam/4.08.0+trunk+bench/.opam-switch/build/yojson-bench.1.0/yojson'
ocamlfind ocamlopt -I `ocamlfind query yojson` -o ydump_bench -package easy-format,biniou -linkpkg yojson.cmx yojson_biniou.cmx ydump.ml
gcc: error: /home/louis/.opam/4.08.0+trunk+bench/lib/yojson/yojson_biniou.o: No such file or directory
gcc: error: /home/louis/.opam/4.08.0+trunk+bench/lib/yojson/yojson.o: No such file or directory
File "caml_startup", line 1:
Error: Error during linking
Makefile:6: recipe for target 'all' failed
make: *** [all] Error 2
make: Leaving directory '/home/louis/.opam/4.08.0+trunk+bench/.opam-switch/build/yojson-bench.1.0/yojson'
Close

Error on yojson-bench.1.0 (4.07.1+oclassic+bench)

Command:

/usr/bin/make -C yojson

Output

make: Entering directory '/home/louis/.opam/4.07.1+oclassic+bench/.opam-switch/build/yojson-bench.1.0/yojson'
ocamlfind ocamlopt -I `ocamlfind query yojson` -o ydump_bench -package easy-format,biniou -linkpkg yojson.cmx yojson_biniou.cmx ydump.ml
gcc: error: /home/louis/.opam/4.07.1+oclassic+bench/lib/yojson/yojson_biniou.o: No such file or directory
gcc: error: /home/louis/.opam/4.07.1+oclassic+bench/lib/yojson/yojson.o: No such file or directory
File "caml_startup", line 1:
Error: Error during linking
Makefile:6: recipe for target 'all' failed
make: *** [all] Error 2
make: Leaving directory '/home/louis/.opam/4.07.1+oclassic+bench/.opam-switch/build/yojson-bench.1.0/yojson'
Close

Error on yojson-bench.1.0 (4.07.1+flambda+bench)

Command:

/usr/bin/make -C yojson

Output

make: Entering directory '/home/louis/.opam/4.07.1+flambda+bench/.opam-switch/build/yojson-bench.1.0/yojson'
ocamlfind ocamlopt -I `ocamlfind query yojson` -o ydump_bench -package easy-format,biniou -linkpkg yojson.cmx yojson_biniou.cmx ydump.ml
gcc: error: /home/louis/.opam/4.07.1+flambda+bench/lib/yojson/yojson_biniou.o: No such file or directory
gcc: error: /home/louis/.opam/4.07.1+flambda+bench/lib/yojson/yojson.o: No such file or directory
File "caml_startup", line 1:
Error: Error during linking
Makefile:6: recipe for target 'all' failed
make: *** [all] Error 2
make: Leaving directory '/home/louis/.opam/4.07.1+flambda+bench/.opam-switch/build/yojson-bench.1.0/yojson'
Close

Error on yojson-bench.1.0 (4.07.1+clambda+bench)

Command:

/usr/bin/make -C yojson

Output

make: Entering directory '/home/louis/.opam/4.07.1+clambda+bench/.opam-switch/build/yojson-bench.1.0/yojson'
ocamlfind ocamlopt -I `ocamlfind query yojson` -o ydump_bench -package easy-format,biniou -linkpkg yojson.cmx yojson_biniou.cmx ydump.ml
gcc: error: /home/louis/.opam/4.07.1+clambda+bench/lib/yojson/yojson_biniou.o: No such file or directory
gcc: error: /home/louis/.opam/4.07.1+clambda+bench/lib/yojson/yojson.o: No such file or directory
File "caml_startup", line 1:
Error: Error during linking
Makefile:6: recipe for target 'all' failed
make: *** [all] Error 2
make: Leaving directory '/home/louis/.opam/4.07.1+clambda+bench/.opam-switch/build/yojson-bench.1.0/yojson'
Close

Error on yojson-bench.1.0 (4.03.1+bench)

Command:

/usr/bin/make -C yojson

Output

make: Entering directory '/home/louis/.opam/4.03.1+bench/.opam-switch/build/yojson-bench.1.0/yojson'
ocamlfind ocamlopt -I `ocamlfind query yojson` -o ydump_bench -package easy-format,biniou -linkpkg yojson.cmx yojson_biniou.cmx ydump.ml
gcc: error: /home/louis/.opam/4.03.1+bench/lib/yojson/yojson_biniou.o: No such file or directory
gcc: error: /home/louis/.opam/4.03.1+bench/lib/yojson/yojson.o: No such file or directory
File "caml_startup", line 1:
Error: Error during linking
Makefile:6: recipe for target 'all' failed
make: *** [all] Error 2
make: Leaving directory '/home/louis/.opam/4.03.1+bench/.opam-switch/build/yojson-bench.1.0/yojson'
Close

Error on valet-bench.1.0 (4.03.1+bench)

Command:

/usr/bin/make -C valet

Output

make: Entering directory '/home/louis/.opam/4.03.1+bench/.opam-switch/build/valet-bench.1.0/valet'
ocamlbuild -use-ocamlfind test_lwt.native test_async.native
ocamlfind ocamldep -package react -package uuidm -package unix -package ocplib-endian -package lwt.unix -modules test_lwt.ml > test_lwt.ml.depends
ocamlfind ocamldep -package react -package uuidm -package ocplib-endian -modules test_lib.ml > test_lib.ml.depends
ocamlfind ocamldep -package uuidm -package unix -package ocplib-endian -modules valet_core.ml > valet_core.ml.depends
ocamlfind ocamldep -package react -package uuidm -package ocplib-endian -modules valet_react.ml > valet_react.ml.depends
ocamlfind ocamlc -c -g -bin-annot -package uuidm -package unix -package ocplib-endian -o valet_core.cmo valet_core.ml
ocamlfind ocamlc -c -g -bin-annot -package react -package uuidm -package ocplib-endian -o valet_react.cmo valet_react.ml
ocamlfind ocamlc -c -g -bin-annot -package react -package uuidm -package ocplib-endian -o test_lib.cmo test_lib.ml
ocamlfind ocamlc -c -g -bin-annot -package react -package uuidm -package unix -package ocplib-endian -package lwt.unix -o test_lwt.cmo test_lwt.ml
+ ocamlfind ocamlc -c -g -bin-annot -package react -package uuidm -package unix -package ocplib-endian -package lwt.unix -o test_lwt.cmo test_lwt.ml
ocamlfind: [WARNING] Package `threads': Linking problems may arise because of the missing -thread or -vmthread switch
ocamlfind ocamlopt -c -g -bin-annot -package uuidm -package unix -package ocplib-endian -o valet_core.cmx valet_core.ml
ocamlfind ocamlopt -c -g -bin-annot -package react -package uuidm -package ocplib-endian -o valet_react.cmx valet_react.ml
ocamlfind ocamlopt -c -g -bin-annot -package react -package uuidm -package ocplib-endian -o test_lib.cmx test_lib.ml
ocamlfind ocamlopt -c -g -bin-annot -package react -package uuidm -package unix -package ocplib-endian -package lwt.unix -o test_lwt.cmx test_lwt.ml
+ ocamlfind ocamlopt -c -g -bin-annot -package react -package uuidm -package unix -package ocplib-endian -package lwt.unix -o test_lwt.cmx test_lwt.ml
ocamlfind: [WARNING] Package `threads': Linking problems may arise because of the missing -thread or -vmthread switch
ocamlfind ocamlopt -linkpkg -g -package react -package uuidm -package unix -package ocplib-endian -package lwt.unix valet_core.cmx valet_react.cmx test_lib.cmx test_lwt.cmx -o test_lwt.native
+ ocamlfind ocamlopt -linkpkg -g -package react -package uuidm -package unix -package ocplib-endian -package lwt.unix valet_core.cmx valet_react.cmx test_lib.cmx test_lwt.cmx -o test_lwt.native
ocamlfind: [WARNING] Package `threads': Linking problems may arise because of the missing -thread or -vmthread switch
File "_none_", line 1:
Error: No implementations provided for the following modules:
         Mutex referenced from /home/louis/.opam/4.03.1+bench/lib/lwt/unix/lwt_unix.cmxa(Lwt_main)
Command exited with code 2.
Makefile:6: recipe for target 'all' failed
make: *** [all] Error 10
make: Leaving directory '/home/louis/.opam/4.03.1+bench/.opam-switch/build/valet-bench.1.0/valet'
Close

Error on thread-bench.1.0 (4.07.1+oclassic+bench)

Command:

/usr/bin/make -C thread

Output

make: Entering directory '/home/louis/.opam/4.07.1+oclassic+bench/.opam-switch/build/thread-bench.1.0/thread'
ocamlfind ocamlopt -package lwt.unix -linkpkg -o thread_sleep_lwt thread_sleep_lwt.ml
ocamlfind: [WARNING] Package `threads': Linking problems may arise because of the missing -thread or -vmthread switch
File "thread_sleep_lwt.ml", line 1:
Error: No implementations provided for the following modules:
         Mutex referenced from /home/louis/.opam/4.07.1+oclassic+bench/lib/lwt/unix/lwt_unix.cmxa(Lwt_main)
Makefile:7: recipe for target 'thread_sleep_lwt' failed
make: *** [thread_sleep_lwt] Error 2
make: Leaving directory '/home/louis/.opam/4.07.1+oclassic+bench/.opam-switch/build/thread-bench.1.0/thread'
Close

Error on thread-bench.1.0 (4.07.1+flambda+bench)

Command:

/usr/bin/make -C thread

Output

make: Entering directory '/home/louis/.opam/4.07.1+flambda+bench/.opam-switch/build/thread-bench.1.0/thread'
ocamlfind ocamlopt -package lwt.unix -linkpkg -o thread_sleep_lwt thread_sleep_lwt.ml
ocamlfind: [WARNING] Package `threads': Linking problems may arise because of the missing -thread or -vmthread switch
File "thread_sleep_lwt.ml", line 1:
Error: No implementations provided for the following modules:
         Mutex referenced from /home/louis/.opam/4.07.1+flambda+bench/lib/lwt/unix/lwt_unix.cmxa(Lwt_main)
Makefile:7: recipe for target 'thread_sleep_lwt' failed
make: *** [thread_sleep_lwt] Error 2
make: Leaving directory '/home/louis/.opam/4.07.1+flambda+bench/.opam-switch/build/thread-bench.1.0/thread'
Close

Error on thread-bench.1.0 (4.07.1+clambda+bench)

Command:

/usr/bin/make -C thread

Output

make: Entering directory '/home/louis/.opam/4.07.1+clambda+bench/.opam-switch/build/thread-bench.1.0/thread'
ocamlfind ocamlopt -package lwt.unix -linkpkg -o thread_sleep_lwt thread_sleep_lwt.ml
ocamlfind: [WARNING] Package `threads': Linking problems may arise because of the missing -thread or -vmthread switch
File "thread_sleep_lwt.ml", line 1:
Error: No implementations provided for the following modules:
         Mutex referenced from /home/louis/.opam/4.07.1+clambda+bench/lib/lwt/unix/lwt_unix.cmxa(Lwt_main)
Makefile:7: recipe for target 'thread_sleep_lwt' failed
make: *** [thread_sleep_lwt] Error 2
make: Leaving directory '/home/louis/.opam/4.07.1+clambda+bench/.opam-switch/build/thread-bench.1.0/thread'
Close

Error on thread-bench.1.0 (4.03.1+bench)

Command:

/usr/bin/make -C thread

Output

make: Entering directory '/home/louis/.opam/4.03.1+bench/.opam-switch/build/thread-bench.1.0/thread'
ocamlfind ocamlopt -package lwt.unix -linkpkg -o thread_sleep_lwt thread_sleep_lwt.ml
ocamlfind: [WARNING] Package `threads': Linking problems may arise because of the missing -thread or -vmthread switch
File "thread_sleep_lwt.ml", line 1:
Error: No implementations provided for the following modules:
         Mutex referenced from /home/louis/.opam/4.03.1+bench/lib/lwt/unix/lwt_unix.cmxa(Lwt_main)
Makefile:7: recipe for target 'thread_sleep_lwt' failed
make: *** [thread_sleep_lwt] Error 2
make: Leaving directory '/home/louis/.opam/4.03.1+bench/.opam-switch/build/thread-bench.1.0/thread'
Close

Error on ocaml-variants.4.08.0+trunk+flambda+opt (4.08.0+trunk+flambda+opt+bench)

Command:

~/.opam/4.08.0+trunk+flambda+opt+bench/.opam-switch/build/ocaml-variants.4.08.0+trunk+flambda+opt/./configure -prefix /home/louis/.opam/4.08.0+trunk+flambda+opt+bench -flambda -with-debug-runtime

Output

configure: error: unrecognized option: `-flambda'
Try `/home/louis/.opam/4.08.0+trunk+flambda+opt+bench/.opam-switch/build/ocaml-variants.4.08.0+trunk+flambda+opt/./configure --help' for more information
Close

Error on ocaml-variants.4.08.0+trunk+flambda (4.08.0+trunk+flambda+bench)

Command:

~/.opam/4.08.0+trunk+flambda+bench/.opam-switch/build/ocaml-variants.4.08.0+trunk+flambda/./configure -prefix /home/louis/.opam/4.08.0+trunk+flambda+bench -flambda -with-debug-runtime

Output

configure: error: unrecognized option: `-flambda'
Try `/home/louis/.opam/4.08.0+trunk+flambda+bench/.opam-switch/build/ocaml-variants.4.08.0+trunk+flambda/./configure --help' for more information
Close

Error on ocaml-migrate-parsetree.1.6.0 (4.08.0+trunk+bench)

Command:

~/.opam/4.08.0+trunk+bench/bin/dune build -p ocaml-migrate-parsetree -j 7

Output

       ocaml src/ast-version,src/compiler-functions-file (exit 1)
(cd _build/default/src && /home/louis/.opam/4.08.0+trunk+bench/bin/ocaml config/gen.ml 4.11.0+dev0-2019-10-18)
Unkown OCaml version 4.11.0+dev0-2019-10-18
Close

Error on numerical-analysis-bench.1.0 (4.08.0+trunk+bench)

Command:

/usr/bin/make

Output

ulimit -s 98304; ocamlopt.opt  -I simple_access `ocamldep.opt -sort simple_access/*.ml` main_nogcstats.ml -o simple_access.opt
ulimit -s 98304; ocamlopt.opt  -I lu-decomposition `ocamldep.opt -sort lu-decomposition/*.ml` main_nogcstats.ml -o lu-decomposition.opt
ulimit -s 98304; ocamlopt.opt  -I fft `ocamldep.opt -sort fft/*.ml` main_nogcstats.ml -o fft.opt
ulimit -s 98304; ocamlopt.opt  -I rnd_access `ocamldep.opt -sort rnd_access/*.ml` main_nogcstats.ml -o rnd_access.opt
ulimit -s 98304; ocamlopt.opt  -I k-means `ocamldep.opt -sort k-means/*.ml` main_nogcstats.ml -o k-means.opt
Fatal error: exception Stack overflow
Makefile:20: recipe for target 'k-means.opt' failed
make: *** [k-means.opt] Error 2
Close

Error on dune.2.3.1 (4.08.0+mutmatch+bench)

Command:

~/.opam/4.08.0+mutmatch+bench/bin/ocaml bootstrap.ml -j 7

Output

ocamlc -custom -w -24 -g -o .duneboot.exe -I boot unix.cma boot/libs.ml boot/duneboot.ml
./.duneboot.exe -j 7
cd _boot && /home/louis/.opam/4.08.0+mutmatch+bench/bin/ocamldep.opt -modules -map main__.ml -map build_info__.ml -map dune.ml -map dune_action_plugin__.ml -map jbuild_support.ml -map dune_glob__.ml -map dune_re__.ml -map dune_cache_daemon__.ml -map dune_cache__.ml -map dune_util.ml -map memo__.ml -map dag__.ml -map incremental_cycles__.ml -map dune_lang__.ml -map stdune__.ml -args source_files
File "src/stdune/result.ml", line 63, characters 8-11:
Error: Syntax error: operator expected.
File "src/stdune/daemonize.ml", line 83, characters 11-13:
Error: Syntax error: operator expected.
File "src/stdune/loc.ml", line 51, characters 7-8:
Error: Syntax error
File "src/stdune/applicative.ml", line 5, characters 10-13:
Error: Syntax error: operator expected.
File "src/stdune/applicative_intf.ml", line 17, characters 10-13:
Error: Syntax error: operator expected.
File "src/stdune/csexp.ml", line 80, characters 5-6:
Error: Syntax error
File "src/stdune/option.mli", line 12, characters 8-11:
Error: Syntax error: operator expected.
File "src/stdune/result.mli", line 29, characters 8-11:
Error: Syntax error: operator expected.
File "src/stdune/option.ml", line 16, characters 8-11:
Error: Syntax error: operator expected.
File "src/dune_lang/syntax.ml", line 156, characters 9-16:
Error: Syntax error
File "src/dune_lang/decoder.mli", line 234, characters 6-9:
Error: Syntax error: operator expected.
File "src/dune_lang/versioned_file.ml", line 105, characters 7-8:
Error: Syntax error
File "src/dune_lang/decoder.ml", line 98, characters 6-9:
Error: Syntax error: operator expected.
File "src/fiber/fiber.ml", line 198, characters 8-11:
Error: Syntax error: operator expected.
File "src/fiber/fiber.mli", line 37, characters 8-11:
Error: Syntax error: operator expected.
File "src/memo/memo.ml", line 117, characters 13-16:
Error: Syntax error: operator expected.
File "src/dune_cache/dune_cache.ml", line 145, characters 11-16:
Error: Syntax error
File "src/dune_cache_daemon/dune_cache_daemon.ml", line 169, characters 8-9:
Error: Syntax error: operator expected.
File "src/dune_cache_daemon/messages.ml", line 85, characters 13-18:
Error: Syntax error
File "src/ocaml-config/ocaml_config.ml", line 307, characters 7-8:
Error: Syntax error
File "otherlibs/action-plugin/src/dune_action_plugin.ml", line 189, characters 10-13:
Error: Syntax error: operator expected.
File "otherlibs/action-plugin/src/protocol.ml", line 106, characters 11-12:
Error: Syntax error
File "otherlibs/action-plugin/src/dune_action_plugin.mli", line 52, characters 10-13:
Error: Syntax error: operator expected.
File "otherlibs/action-plugin/src/serializable_intf.ml", line 40, characters 7-8:
Error: Syntax error
File "src/dune/dep_conf.ml", line 28, characters 7-8:
Error: Syntax error
File "src/dune/profile.ml", line 41, characters 7-11:
Error: Syntax error
File "src/dune/dune_init.ml", line 86, characters 9-10:
Error: Syntax error: operator expected.
File "src/dune/obj_dir.ml", line 64, characters 12-23:
Error: Syntax error: operator expected.
File "src/dune/ocamldep.ml", line 106, characters 11-16:
Error: Syntax error
File "src/dune/ordered_set_lang.ml", line 90, characters 13-22:
Error: Syntax error
File "src/dune/super_context.ml", line 135, characters 7-8:
Error: Syntax error
File "src/dune/module.ml", line 274, characters 10-14:
Error: Syntax error: operator expected.
File "src/dune/lib_info.ml", line 25, characters 12-15:
Error: Syntax error: operator expected.
File "src/dune/vcs.ml", line 47, characters 12-16:
Error: Syntax error: operator expected.
File "src/dune/dialect.ml", line 42, characters 9-12:
Error: Syntax error
File "src/dune/sub_system.ml", line 40, characters 7-8:
Error: Syntax error
File "src/dune/simple_rules.ml", line 200, characters 17-18:
Error: Syntax error: operator expected.
File "src/dune/findlib/findlib.ml", line 427, characters 11-12:
Error: Syntax error: operator expected.
File "src/dune/format_config.ml", line 54, characters 9-17:
Error: Syntax error
File "src/dune/dune_load.ml", line 183, characters 11-12:
Error: Syntax error: operator expected.
File "src/dune/predicate_lang.ml", line 38, characters 9-10:
Error: Syntax error
File "src/dune/ocaml_stdlib.ml", line 21, characters 10-31:
Error: Syntax error: operator expected.
File "src/dune/stats.ml", line 62, characters 9-15:
Error: Syntax error
File "src/dune/lib.ml", line 377, characters 9-13:
Error: Syntax error: operator expected.
File "src/dune/context.ml", line 201, characters 7-8:
Error: Syntax error
File "src/dune/file_tree.ml", line 442, characters 9-10:
Error: Syntax error
File "src/dune/dep_graph.ml", line 25, characters 7-17:
Error: Syntax error
File "src/dune/expander.ml", line 138, characters 9-22:
Error: Syntax error: operator expected.
File "src/dune/case_lang.ml", line 12, characters 10-11:
Error: Syntax error: operator expected.
File "src/dune/module_compilation.ml", line 27, characters 7-11:
Error: Syntax error
File "src/dune/mode.ml", line 127, characters 14-18:
Error: Syntax error: operator expected.
File "src/dune/install_rules.ml", line 231, characters 13-14:
Error: Syntax error: operator expected.
File "src/dune/artifact_substitution.ml", line 333, characters 11-12:
Error: Syntax error: operator expected.
File "src/dune/dune_file.ml", line 33, characters 8-9:
Error: Syntax error: operator expected.
File "src/dune/lib_kind.ml", line 17, characters 9-10:
Error: Syntax error
File "src/dune/pform.ml", line 287, characters 7-8:
Error: Syntax error
File "src/dune/action_exec.ml", line 139, characters 7-8:
Error: Syntax error
File "src/dune/workspace.ml", line 88, characters 11-14:
Error: Syntax error
File "src/dune/string_with_vars.ml", line 40, characters 7-21:
Error: Syntax error
File "src/dune/wrapped.ml", line 14, characters 17-18:
Error: Syntax error: operator expected.
File "src/dune/foreign.ml", line 94, characters 5-6:
Error: Syntax error
File "src/dune/build.mli", line 36, characters 10-13:
Error: Syntax error: operator expected.
File "src/dune/preprocessing.ml", line 147, characters 16-19:
Error: Syntax error: operator expected.
File "src/dune/process.ml", line 452, characters 5-6:
Error: Syntax error
File "src/dune/config.ml", line 230, characters 7-14:
Error: Syntax error
File "src/dune/gen_rules.ml", line 234, characters 11-18:
Error: Syntax error
File "src/dune/file_binding.ml", line 65, characters 13-20:
Error: Syntax error
File "src/dune/odoc.ml", line 151, characters 10-14:
Error: Syntax error: operator expected.
File "src/dune/dir_contents.ml", line 388, characters 15-16:
Error: Syntax error: operator expected.
File "src/dune/dpath.ml", line 153, characters 9-18:
Error: Syntax error
File "src/dune/dune_env.ml", line 13, characters 9-10:
Error: Syntax error
File "src/dune/dune_package.ml", line 111, characters 10-11:
Error: Syntax error: operator expected.
File "src/dune/modules.ml", line 48, characters 12-28:
Error: Syntax error: operator expected.
File "src/dune/foreign_rules.ml", line 166, characters 16-17:
Error: Syntax error: operator expected.
File "src/dune/sub_dirs.ml", line 145, characters 11-12:
Error: Syntax error
File "src/dune/cinaps.ml", line 26, characters 10-13:
Error: Syntax error: operator expected.
File "src/dune/diff.ml", line 22, characters 7-12:
Error: Syntax error
File "src/dune/alias.ml", line 66, characters 7-8:
Error: Syntax error
File "src/dune/opam_create.ml", line 157, characters 10-18:
Error: Syntax error: operator expected.
File "src/dune/dune_project.ml", line 365, characters 11-12:
Error: Syntax error
File "src/dune/print_diff.ml", line 45, characters 7-8:
Error: Syntax error
File "src/dune/merlin.ml", line 140, characters 9-10:
Error: Syntax error: operator expected.
File "src/dune/utop.ml", line 26, characters 5-6:
Error: Syntax error: operator expected.
File "src/dune/link_time_code_gen.ml", line 174, characters 7-15:
Error: Syntax error
File "src/dune/dep_rules.ml", line 29, characters 12-13:
Error: Syntax error: operator expected.
File "src/dune/bindings.ml", line 40, characters 7-8:
Error: Syntax error
File "src/dune/build.ml", line 50, characters 8-11:
Error: Syntax error: operator expected.
File "src/dune/format_rules.ml", line 49, characters 11-12:
Error: Syntax error
File "src/dune/scheduler.ml", line 610, characters 7-8:
Error: Syntax error
File "src/dune/lib_dep.ml", line 14, characters 12-13:
Error: Syntax error: operator expected.
File "src/dune/module_name.ml", line 113, characters 9-10:
Error: Syntax error
File "src/dune/action_ast.ml", line 57, characters 19-23:
Error: Syntax error: operator expected.
File "src/dune/package.ml", line 50, characters 7-8:
Error: Syntax error
File "src/dune/main.ml", line 62, characters 7-15:
Error: Syntax error
File "src/dune/foreign_sources.ml", line 85, characters 13-14:
Error: Syntax error: operator expected.
File "src/dune/artifacts.ml", line 63, characters 9-12:
Error: Syntax error
File "src/dune/watermarks.ml", line 167, characters 15-18:
Error: Syntax error
File "src/dune/ocaml_flags.ml", line 81, characters 9-15:
Error: Syntax error
File "src/dune/exe_rules.ml", line 98, characters 9-14:
Error: Syntax error
File "src/dune/blang.ml", line 77, characters 15-16:
Error: Syntax error: operator expected.
File "src/dune/build_system.ml", line 125, characters 11-19:
Error: Syntax error
File "src/dune/inline_tests.ml", line 34, characters 16-19:
Error: Syntax error: operator expected.
File "bin/external_lib_deps.ml", line 117, characters 7-13:
Error: Syntax error
File "bin/install_uninstall.ml", line 18, characters 7-8:
Error: Syntax error
File "bin/format_dune_file.ml", line 19, characters 7-15:
Error: Syntax error
File "bin/init.ml", line 39, characters 5-6:
Error: Syntax error
File "bin/help.ml", line 109, characters 10-20:
Error: Syntax error
File "bin/installed_libraries.ml", line 9, characters 7-13:
Error: Syntax error
File "bin/printenv.ml", line 16, characters 7-10:
Error: Syntax error
File "bin/cache_daemon.ml", line 63, characters 7-8:
Error: Syntax error
File "bin/common.ml", line 11, characters 8-11:
Error: Syntax error: operator expected.
File "bin/exec.ml", line 36, characters 7-13:
Error: Syntax error
File "bin/subst.ml", line 61, characters 7-8:
Error: Syntax error
File "bin/compute.ml", line 19, characters 10-16:
Error: Syntax error
File "bin/utop.ml", line 17, characters 7-13:
Error: Syntax error
File "bin/print_rules.ml", line 77, characters 9-17:
Error: Syntax error
File "bin/import.ml", line 85, characters 7-8:
Error: Syntax error
File "bin/upgrade.ml", line 17, characters 7-13:
Error: Syntax error
File "bin/main.ml", line 7, characters 7-8:
Error: Syntax error
File "bin/common.mli", line 69, characters 8-11:
Error: Syntax error: operator expected.


Close

Error on core-micro-bench.1.0 (4.07.1+oclassic+bench)

Command:

/usr/bin/make -C core_micro

Output

make: Entering directory '/home/louis/.opam/4.07.1+oclassic+bench/.opam-switch/build/core-micro-bench.1.0/core_micro'
ocamlbuild -use-ocamlfind runner.native
ocamlfind ocamldep -package str -package core -package core_bench.inline_benchmarks -modules runner.ml > runner.ml.depends
ocamlfind ocamlc -c -thread -package str -package core -package core_bench.inline_benchmarks -o runner.cmo runner.ml
+ ocamlfind ocamlc -c -thread -package str -package core -package core_bench.inline_benchmarks -o runner.cmo runner.ml
File "runner.ml", line 1, characters 5-13:
Error: Unbound module Core.Std
Command exited with code 2.
Makefile:4: recipe for target 'all' failed
make: *** [all] Error 10
make: Leaving directory '/home/louis/.opam/4.07.1+oclassic+bench/.opam-switch/build/core-micro-bench.1.0/core_micro'
Close

Error on core-micro-bench.1.0 (4.07.1+flambda+bench)

Command:

/usr/bin/make -C core_micro

Output

make: Entering directory '/home/louis/.opam/4.07.1+flambda+bench/.opam-switch/build/core-micro-bench.1.0/core_micro'
ocamlbuild -use-ocamlfind runner.native
ocamlfind ocamldep -package str -package core -package core_bench.inline_benchmarks -modules runner.ml > runner.ml.depends
ocamlfind ocamlc -c -thread -package str -package core -package core_bench.inline_benchmarks -o runner.cmo runner.ml
+ ocamlfind ocamlc -c -thread -package str -package core -package core_bench.inline_benchmarks -o runner.cmo runner.ml
File "runner.ml", line 1, characters 5-13:
Error: Unbound module Core.Std
Command exited with code 2.
Makefile:4: recipe for target 'all' failed
make: *** [all] Error 10
make: Leaving directory '/home/louis/.opam/4.07.1+flambda+bench/.opam-switch/build/core-micro-bench.1.0/core_micro'
Close

Error on core-micro-bench.1.0 (4.07.1+clambda+bench)

Command:

/usr/bin/make -C core_micro

Output

make: Entering directory '/home/louis/.opam/4.07.1+clambda+bench/.opam-switch/build/core-micro-bench.1.0/core_micro'
ocamlbuild -use-ocamlfind runner.native
ocamlfind ocamldep -package str -package core -package core_bench.inline_benchmarks -modules runner.ml > runner.ml.depends
ocamlfind ocamlc -c -thread -package str -package core -package core_bench.inline_benchmarks -o runner.cmo runner.ml
+ ocamlfind ocamlc -c -thread -package str -package core -package core_bench.inline_benchmarks -o runner.cmo runner.ml
File "runner.ml", line 1, characters 5-13:
Error: Unbound module Core.Std
Command exited with code 2.
Makefile:4: recipe for target 'all' failed
make: *** [all] Error 10
make: Leaving directory '/home/louis/.opam/4.07.1+clambda+bench/.opam-switch/build/core-micro-bench.1.0/core_micro'
Close

Error on core-micro-bench.1.0 (4.03.1+bench)

Command:

/usr/bin/make -C core_micro

Output

make: Entering directory '/home/louis/.opam/4.03.1+bench/.opam-switch/build/core-micro-bench.1.0/core_micro'
ocamlbuild -use-ocamlfind runner.native
ocamlfind ocamldep -package str -package core -package core_bench.inline_benchmarks -modules runner.ml > runner.ml.depends
ocamlfind ocamlc -c -thread -package str -package core -package core_bench.inline_benchmarks -o runner.cmo runner.ml
+ ocamlfind ocamlc -c -thread -package str -package core -package core_bench.inline_benchmarks -o runner.cmo runner.ml
File "runner.ml", line 1, characters 5-13:
Warning 3: deprecated: module Core.Std
[since 2017-02] Use Core. The Std sub-module is no longer needed
File "runner.ml", line 3, characters 15-55:
Error: Unbound module Pa_bench_lib
Command exited with code 2.
Makefile:4: recipe for target 'all' failed
make: *** [all] Error 10
make: Leaving directory '/home/louis/.opam/4.03.1+bench/.opam-switch/build/core-micro-bench.1.0/core_micro'
Close

Error on conf-graphviz.0.1 (4.07.1+oclassic+bench)

Command:

/usr/bin/which dot

Output


Close

Error on conf-graphviz.0.1 (4.07.1+flambda+bench)

Command:

/usr/bin/which dot

Output


Close

Error on conf-graphviz.0.1 (4.07.1+clambda+bench)

Command:

/usr/bin/which dot

Output


Close

Error on conf-graphviz.0.1 (4.03.1+bench)

Command:

/usr/bin/which dot

Output


Close

Error on cohttp-bench.1.0 (4.07.1+oclassic+bench)

Command:

/usr/bin/make -C cohttp

Output

make: Entering directory '/home/louis/.opam/4.07.1+oclassic+bench/.opam-switch/build/cohttp-bench.1.0/cohttp'
ocamlbuild -use-ocamlfind cohttp_lwt_bench.native cohttp_async_bench.native
ocamlfind ocamldep -package lwt.unix -package cohttp.lwt -modules cohttp_lwt_bench.ml > cohttp_lwt_bench.ml.depends
+ ocamlfind ocamldep -package lwt.unix -package cohttp.lwt -modules cohttp_lwt_bench.ml > cohttp_lwt_bench.ml.depends
ocamlfind: Package `cohttp.lwt' not found
Command exited with code 2.
Makefile:6: recipe for target 'all' failed
make: *** [all] Error 10
make: Leaving directory '/home/louis/.opam/4.07.1+oclassic+bench/.opam-switch/build/cohttp-bench.1.0/cohttp'
Close

Error on cohttp-bench.1.0 (4.07.1+flambda+bench)

Command:

/usr/bin/make -C cohttp

Output

make: Entering directory '/home/louis/.opam/4.07.1+flambda+bench/.opam-switch/build/cohttp-bench.1.0/cohttp'
ocamlbuild -use-ocamlfind cohttp_lwt_bench.native cohttp_async_bench.native
ocamlfind ocamldep -package lwt.unix -package cohttp.lwt -modules cohttp_lwt_bench.ml > cohttp_lwt_bench.ml.depends
+ ocamlfind ocamldep -package lwt.unix -package cohttp.lwt -modules cohttp_lwt_bench.ml > cohttp_lwt_bench.ml.depends
ocamlfind: Package `cohttp.lwt' not found
Command exited with code 2.
Makefile:6: recipe for target 'all' failed
make: *** [all] Error 10
make: Leaving directory '/home/louis/.opam/4.07.1+flambda+bench/.opam-switch/build/cohttp-bench.1.0/cohttp'
Close

Error on cohttp-bench.1.0 (4.07.1+clambda+bench)

Command:

/usr/bin/make -C cohttp

Output

make: Entering directory '/home/louis/.opam/4.07.1+clambda+bench/.opam-switch/build/cohttp-bench.1.0/cohttp'
ocamlbuild -use-ocamlfind cohttp_lwt_bench.native cohttp_async_bench.native
ocamlfind ocamldep -package lwt.unix -package cohttp.lwt -modules cohttp_lwt_bench.ml > cohttp_lwt_bench.ml.depends
+ ocamlfind ocamldep -package lwt.unix -package cohttp.lwt -modules cohttp_lwt_bench.ml > cohttp_lwt_bench.ml.depends
ocamlfind: Package `cohttp.lwt' not found
Command exited with code 2.
Makefile:6: recipe for target 'all' failed
make: *** [all] Error 10
make: Leaving directory '/home/louis/.opam/4.07.1+clambda+bench/.opam-switch/build/cohttp-bench.1.0/cohttp'
Close

Error on cohttp-bench.1.0 (4.03.1+bench)

Command:

/usr/bin/make -C cohttp

Output

make: Entering directory '/home/louis/.opam/4.03.1+bench/.opam-switch/build/cohttp-bench.1.0/cohttp'
ocamlbuild -use-ocamlfind cohttp_lwt_bench.native cohttp_async_bench.native
ocamlfind ocamldep -package lwt.unix -package cohttp.lwt -modules cohttp_lwt_bench.ml > cohttp_lwt_bench.ml.depends
+ ocamlfind ocamldep -package lwt.unix -package cohttp.lwt -modules cohttp_lwt_bench.ml > cohttp_lwt_bench.ml.depends
ocamlfind: Package `cohttp-lwt-unix' not found - required by `cohttp.lwt'
Command exited with code 2.
Makefile:6: recipe for target 'all' failed
make: *** [all] Error 10
make: Leaving directory '/home/louis/.opam/4.03.1+bench/.opam-switch/build/cohttp-bench.1.0/cohttp'
Close

Error on chameneos-bench.1.0 (4.07.1+oclassic+bench)

Command:

/usr/bin/make -C chameneos-redux

Output

make: Entering directory '/home/louis/.opam/4.07.1+oclassic+bench/.opam-switch/build/chameneos-bench.1.0/chameneos-redux'
ocamlopt -bin-annot -thread unix.cmxa threads.cmxa chameneos_redux_th.ml -o chameneos_redux_th
ocamlopt -bin-annot -thread unix.cmxa threads.cmxa chameneos_redux_evtchn.ml -o chameneos_redux_evtchn
ocamlfind ocamlopt -bin-annot -package lwt.unix -linkpkg chameneos_redux_lwt.ml -o chameneos_redux_lwt
ocamlfind: [WARNING] Package `threads': Linking problems may arise because of the missing -thread or -vmthread switch
File "chameneos_redux_lwt.ml", line 1:
Error: No implementations provided for the following modules:
         Mutex referenced from /home/louis/.opam/4.07.1+oclassic+bench/lib/lwt/unix/lwt_unix.cmxa(Lwt_main)
Makefile:6: recipe for target 'chameneos_redux_lwt' failed
make: *** [chameneos_redux_lwt] Error 2
make: Leaving directory '/home/louis/.opam/4.07.1+oclassic+bench/.opam-switch/build/chameneos-bench.1.0/chameneos-redux'
Close

Error on chameneos-bench.1.0 (4.07.1+flambda+bench)

Command:

/usr/bin/make -C chameneos-redux

Output

make: Entering directory '/home/louis/.opam/4.07.1+flambda+bench/.opam-switch/build/chameneos-bench.1.0/chameneos-redux'
ocamlopt -bin-annot -thread unix.cmxa threads.cmxa chameneos_redux_th.ml -o chameneos_redux_th
ocamlopt -bin-annot -thread unix.cmxa threads.cmxa chameneos_redux_evtchn.ml -o chameneos_redux_evtchn
ocamlfind ocamlopt -bin-annot -package lwt.unix -linkpkg chameneos_redux_lwt.ml -o chameneos_redux_lwt
ocamlfind: [WARNING] Package `threads': Linking problems may arise because of the missing -thread or -vmthread switch
File "chameneos_redux_lwt.ml", line 1:
Error: No implementations provided for the following modules:
         Mutex referenced from /home/louis/.opam/4.07.1+flambda+bench/lib/lwt/unix/lwt_unix.cmxa(Lwt_main)
Makefile:6: recipe for target 'chameneos_redux_lwt' failed
make: *** [chameneos_redux_lwt] Error 2
make: Leaving directory '/home/louis/.opam/4.07.1+flambda+bench/.opam-switch/build/chameneos-bench.1.0/chameneos-redux'
Close

Error on chameneos-bench.1.0 (4.07.1+clambda+bench)

Command:

/usr/bin/make -C chameneos-redux

Output

make: Entering directory '/home/louis/.opam/4.07.1+clambda+bench/.opam-switch/build/chameneos-bench.1.0/chameneos-redux'
ocamlopt -bin-annot -thread unix.cmxa threads.cmxa chameneos_redux_th.ml -o chameneos_redux_th
ocamlopt -bin-annot -thread unix.cmxa threads.cmxa chameneos_redux_evtchn.ml -o chameneos_redux_evtchn
ocamlfind ocamlopt -bin-annot -package lwt.unix -linkpkg chameneos_redux_lwt.ml -o chameneos_redux_lwt
ocamlfind: [WARNING] Package `threads': Linking problems may arise because of the missing -thread or -vmthread switch
File "chameneos_redux_lwt.ml", line 1:
Error: No implementations provided for the following modules:
         Mutex referenced from /home/louis/.opam/4.07.1+clambda+bench/lib/lwt/unix/lwt_unix.cmxa(Lwt_main)
Makefile:6: recipe for target 'chameneos_redux_lwt' failed
make: *** [chameneos_redux_lwt] Error 2
make: Leaving directory '/home/louis/.opam/4.07.1+clambda+bench/.opam-switch/build/chameneos-bench.1.0/chameneos-redux'
Close

Error on chameneos-bench.1.0 (4.03.1+bench)

Command:

/usr/bin/make -C chameneos-redux

Output

make: Entering directory '/home/louis/.opam/4.03.1+bench/.opam-switch/build/chameneos-bench.1.0/chameneos-redux'
ocamlopt -bin-annot -thread unix.cmxa threads.cmxa chameneos_redux_th.ml -o chameneos_redux_th
ocamlopt -bin-annot -thread unix.cmxa threads.cmxa chameneos_redux_evtchn.ml -o chameneos_redux_evtchn
ocamlfind ocamlopt -bin-annot -package lwt.unix -linkpkg chameneos_redux_lwt.ml -o chameneos_redux_lwt
ocamlfind: [WARNING] Package `threads': Linking problems may arise because of the missing -thread or -vmthread switch
File "chameneos_redux_lwt.ml", line 1:
Error: No implementations provided for the following modules:
         Mutex referenced from /home/louis/.opam/4.03.1+bench/lib/lwt/unix/lwt_unix.cmxa(Lwt_main)
Makefile:6: recipe for target 'chameneos_redux_lwt' failed
make: *** [chameneos_redux_lwt] Error 2
make: Leaving directory '/home/louis/.opam/4.03.1+bench/.opam-switch/build/chameneos-bench.1.0/chameneos-redux'
Close

Error on async-rpc-bench.1.0 (4.07.1+oclassic+bench)

Command:

/usr/bin/make -C async_rpc

Output

make: Entering directory '/home/louis/.opam/4.07.1+oclassic+bench/.opam-switch/build/async-rpc-bench.1.0/async_rpc'
ocamlfind ocamlopt -thread -syntax camlp4o -package async -package bin_prot.syntax -package core -c rpc_common.ml
ocamlfind: Package `bin_prot.syntax' not found
Makefile:12: recipe for target 'rpc_common.cmx' failed
make: *** [rpc_common.cmx] Error 2
make: Leaving directory '/home/louis/.opam/4.07.1+oclassic+bench/.opam-switch/build/async-rpc-bench.1.0/async_rpc'
Close

Error on async-rpc-bench.1.0 (4.07.1+flambda+bench)

Command:

/usr/bin/make -C async_rpc

Output

make: Entering directory '/home/louis/.opam/4.07.1+flambda+bench/.opam-switch/build/async-rpc-bench.1.0/async_rpc'
ocamlfind ocamlopt -thread -syntax camlp4o -package async -package bin_prot.syntax -package core -c rpc_common.ml
ocamlfind: Package `bin_prot.syntax' not found
Makefile:12: recipe for target 'rpc_common.cmx' failed
make: *** [rpc_common.cmx] Error 2
make: Leaving directory '/home/louis/.opam/4.07.1+flambda+bench/.opam-switch/build/async-rpc-bench.1.0/async_rpc'
Close

Error on async-rpc-bench.1.0 (4.07.1+clambda+bench)

Command:

/usr/bin/make -C async_rpc

Output

make: Entering directory '/home/louis/.opam/4.07.1+clambda+bench/.opam-switch/build/async-rpc-bench.1.0/async_rpc'
ocamlfind ocamlopt -thread -syntax camlp4o -package async -package bin_prot.syntax -package core -c rpc_common.ml
ocamlfind: Package `bin_prot.syntax' not found
Makefile:12: recipe for target 'rpc_common.cmx' failed
make: *** [rpc_common.cmx] Error 2
make: Leaving directory '/home/louis/.opam/4.07.1+clambda+bench/.opam-switch/build/async-rpc-bench.1.0/async_rpc'
Close

Error on async-rpc-bench.1.0 (4.03.1+bench)

Command:

/usr/bin/make -C async_rpc

Output

make: Entering directory '/home/louis/.opam/4.03.1+bench/.opam-switch/build/async-rpc-bench.1.0/async_rpc'
ocamlfind ocamlopt -thread -syntax camlp4o -package async -package bin_prot.syntax -package core -c rpc_common.ml
ocamlfind: Package `bin_prot.syntax' not found
Makefile:12: recipe for target 'rpc_common.cmx' failed
make: *** [rpc_common.cmx] Error 2
make: Leaving directory '/home/louis/.opam/4.03.1+bench/.opam-switch/build/async-rpc-bench.1.0/async_rpc'
Close

Error on async-echo-bench.1.0 (4.07.1+oclassic+bench)

Command:

/usr/bin/make -C async_echo

Output

make: Entering directory '/home/louis/.opam/4.07.1+oclassic+bench/.opam-switch/build/async-echo-bench.1.0/async_echo'
ocamlfind ocamlopt -thread -syntax camlp4o -package async -package bin_prot.syntax -package core -c echo_common.ml
ocamlfind: Package `bin_prot.syntax' not found
Makefile:20: recipe for target 'echo_common.cmx' failed
make: *** [echo_common.cmx] Error 2
make: Leaving directory '/home/louis/.opam/4.07.1+oclassic+bench/.opam-switch/build/async-echo-bench.1.0/async_echo'
Close

Error on async-echo-bench.1.0 (4.07.1+flambda+bench)

Command:

/usr/bin/make -C async_echo

Output

make: Entering directory '/home/louis/.opam/4.07.1+flambda+bench/.opam-switch/build/async-echo-bench.1.0/async_echo'
ocamlfind ocamlopt -thread -syntax camlp4o -package async -package bin_prot.syntax -package core -c echo_common.ml
ocamlfind: Package `bin_prot.syntax' not found
Makefile:20: recipe for target 'echo_common.cmx' failed
make: *** [echo_common.cmx] Error 2
make: Leaving directory '/home/louis/.opam/4.07.1+flambda+bench/.opam-switch/build/async-echo-bench.1.0/async_echo'
Close

Error on async-echo-bench.1.0 (4.07.1+clambda+bench)

Command:

/usr/bin/make -C async_echo

Output

make: Entering directory '/home/louis/.opam/4.07.1+clambda+bench/.opam-switch/build/async-echo-bench.1.0/async_echo'
ocamlfind ocamlopt -thread -syntax camlp4o -package async -package bin_prot.syntax -package core -c echo_common.ml
ocamlfind: Package `bin_prot.syntax' not found
Makefile:20: recipe for target 'echo_common.cmx' failed
make: *** [echo_common.cmx] Error 2
make: Leaving directory '/home/louis/.opam/4.07.1+clambda+bench/.opam-switch/build/async-echo-bench.1.0/async_echo'
Close

Error on async-echo-bench.1.0 (4.03.1+bench)

Command:

/usr/bin/make -C async_echo

Output

make: Entering directory '/home/louis/.opam/4.03.1+bench/.opam-switch/build/async-echo-bench.1.0/async_echo'
ocamlfind ocamlopt -thread -syntax camlp4o -package async -package bin_prot.syntax -package core -c echo_common.ml
ocamlfind: Package `bin_prot.syntax' not found
Makefile:20: recipe for target 'echo_common.cmx' failed
make: *** [echo_common.cmx] Error 2
make: Leaving directory '/home/louis/.opam/4.03.1+bench/.opam-switch/build/async-echo-bench.1.0/async_echo'