Package4.03.1+bench4.05.0+flambda+opt+bench4.06.1+flambda+bench4.06.1+flambda+opt+bench4.07.1+clambda+bench4.07.1+flambda+bench4.07.1+oclassic+bench4.08.0+gpr2165+bench4.08.0+mutmatch+bench4.08.0+trunk+bench4.08.0+trunk+flambda+bench4.08.0+trunk+flambda+oclassic+bench4.08.0+trunk+flambda+opt+bench4.03.1+bench time (s)4.05.0+flambda+opt+bench time (s)4.06.1+flambda+bench time (s)4.06.1+flambda+opt+bench time (s)4.07.1+clambda+bench time (s)4.07.1+flambda+bench time (s)4.07.1+oclassic+bench time (s)4.08.0+gpr2165+bench time (s)4.08.0+mutmatch+bench time (s)4.08.0+trunk+bench time (s)4.08.0+trunk+flambda+bench time (s)4.08.0+trunk+flambda+oclassic+bench time (s)4.08.0+trunk+flambda+opt+bench time (s)
almabench-bench.1.0------------Aborted------------0.000
alt-ergo.2.3.1-----OK------Aborted-----21.489------0.000
alt-ergo-lib.2.3.1-----OK------Aborted-----32.415------0.000
alt-ergo-parsers.2.3.1-----OK------Aborted-----17.658------0.000
async.v0.12.0-----OK------------3.808-------
async.v0.13.0------------Aborted------------0.000
async-echo-bench.1.0-----Failure (2)------Aborted-----0.643------0.000
async-rpc-bench.1.0-----Failure (2)------Aborted-----0.556------0.000
async_extra.v0.12.0-----OK------------4.608-------
async_kernel.v0.12.0-----OK------------21.541-------
async_kernel.v0.13.0------------Aborted------------0.000
async_rpc_kernel.v0.12.0-----OK------------11.460-------
async_rpc_kernel.v0.13.0------------Aborted------------0.000
async_unix.v0.12.0-----OK------------19.001-------
async_unix.v0.13.0------------Aborted------------0.000
base.v0.12.2-----OK------------7.287-------
base.v0.13.1------------Aborted------------0.000
base-bytes.base------------Aborted------------0.000
base64.3.3.0-----OK------Aborted-----2.292------0.000
base_bigstring.v0.12.0-----OK------------3.394-------
base_bigstring.v0.13.0------------Aborted------------0.000
base_quickcheck.v0.12.1-----OK------------3.813-------
base_quickcheck.v0.13.0------------Aborted------------0.000
bdd-bench.1.0------------Aborted------------0.000
bin_prot.v0.12.0-----OK------------11.036-------
bin_prot.v0.13.0------------Aborted------------0.000
biniou.1.2.1-----OK------Aborted-----35.337------0.000
camlimages.5.0.1------------Aborted------------0.000
camlpdf.2.3------------Aborted------------0.000
camlzip.1.10------------Aborted------------0.000
chameneos-bench.1.0-----Failure (2)------Aborted-----0.510------0.000
cohttp.2.4.0-----OK------------5.380-------
cohttp.2.5.1------------Aborted------------0.000
cohttp-bench.1.0-----Failure (2)------Aborted-----0.357------0.000
conf-graphviz.0.1-----Failure (1)------------0.170-------
configurator.v0.11.0-----OK------Aborted-----6.677------0.000
core.v0.12.4-----OK------------34.780-------
core.v0.13.0------------Aborted------------0.000
core-micro-bench.1.0-----Failure (2)------Aborted-----5.391------0.000
core-sequence-bench.1.0-----OK------Aborted-----0.058------0.000
core_bench.v0.12.0-----OK------------5.131-------
core_bench.v0.13.0------------Aborted------------0.000
core_extended.v0.12.0-----OK------------7.144-------
core_kernel.v0.12.3-----OK------------68.811-------
core_kernel.v0.13.1------------Aborted------------0.000
cpdf.2.3------------Aborted------------0.000
cpdf-bench.1.0------------Aborted------------0.000
cppo.1.6.6-----OK------Aborted-----2.592------0.000
dune.2.4.0-----OK------Aborted-----19.682------0.000
dune-configurator.2.4.0-----OK------Aborted-----18.476------0.000
dune-private-libs.2.4.0-----OK------Aborted-----15.331------0.000
easy-format.1.3.2-----OK------Aborted-----0.413------0.000
expect_test_helpers.v0.12.0-----OK------------2.260-------
expect_test_helpers_kernel.v0.12.0-----OK------------11.311-------
fieldslib.v0.12.0-----OK------------0.461-------
fieldslib.v0.13.0------------Aborted------------0.000
frama-c.20.0-----OK------------163.618-------
frama-c-bench.1.0-----OK------------0.165-------
jane-street-headers.v0.12.0-----OK------------0.211-------
jane-street-headers.v0.13.0------------Aborted------------0.000
jbuilder.1.0+beta20.2------------Aborted------------0.000
json-bench-data.1.0------------Aborted------------0.000
jsonm.1.0.1------------Aborted------------0.000
jsonm-bench.1.0------------Aborted------------0.000
jst-config.v0.12.0-----OK------------12.223-------
jst-config.v0.13.0------------Aborted------------0.000
kb-bench.1.0------------Aborted------------0.000
lexifi-g2pp-bench.1.0------------Aborted------------0.000
lwt.5.2.0-----OK------Aborted-----16.554------0.000
menhir.20200211------------Aborted------------0.000
menhir-bench.1.0------------Aborted------------0.000
menhirLib.20200211------------Aborted------------0.000
menhirSdk.20200211------------Aborted------------0.000
minilight.1.6------------Aborted------------0.000
minilight-bench.1.0------------Aborted------------0.000
mmap.1.1.0-----OK------Aborted-----0.377------0.000
nbcodec.1.0------------Aborted------------0.000
nbcodec-bench.1.0------------Aborted------------0.000
num.1.3------------Aborted------------0.000
numerical-analysis-bench.1.0------------Aborted------------0.000
ocaml.4.08.0------------Aborted------------0.000
ocaml-compiler-libs.v0.12.1-----OK------Aborted-----3.010------0.000
ocaml-migrate-parsetree.1.6.0-----OK------Aborted-----26.931------0.000
ocaml-variants.4.08.0+trunk+flambda+opt------------Failure (1)------------0.304
ocamlbuild.0.14.0------------Aborted------------0.000
ocamlfind.1.8.1------------Aborted------------0.000
ocplib-endian.1.0-----OK------Aborted-----48.031------0.000
ocplib-simplex.0.4------------Aborted------------0.000
octavius.1.2.2-----OK------Aborted-----4.245------0.000
parsexp.v0.12.0-----OK------------4.888-------
parsexp.v0.13.0------------Aborted------------0.000
patdiff.v0.12.1-----OK------------7.369-------
patdiff.v0.13.0------------Aborted------------0.000
patdiff-bench.1.0-----OK------Aborted-----0.155------0.000
patience_diff.v0.12.0-----OK------------7.381-------
patience_diff.v0.13.0------------Aborted------------0.000
pcre.7.4.1-----OK------------5.595-------
pcre.7.4.3------------Aborted------------0.000
ppx_assert.v0.12.0-----OK------------8.263-------
ppx_assert.v0.13.0------------Aborted------------0.000
ppx_base.v0.12.0-----OK------------15.338-------
ppx_base.v0.13.0------------Aborted------------0.000
ppx_bench.v0.12.0-----OK------------4.272-------
ppx_bench.v0.13.0------------Aborted------------0.000
ppx_bin_prot.v0.12.1-----OK------------5.383-------
ppx_bin_prot.v0.13.0------------Aborted------------0.000
ppx_cold.v0.13.0------------Aborted------------0.000
ppx_compare.v0.12.0-----OK------------5.073-------
ppx_compare.v0.13.0------------Aborted------------0.000
ppx_custom_printf.v0.12.1-----OK------------9.039-------
ppx_custom_printf.v0.13.0------------Aborted------------0.000
ppx_derivers.1.2.1-----OK------Aborted-----1.352------0.000
ppx_enumerate.v0.12.0-----OK------------4.722-------
ppx_enumerate.v0.13.0------------Aborted------------0.000
ppx_expect.v0.12.0-----OK------------13.383-------
ppx_expect.v0.13.0------------Aborted------------0.000
ppx_fail.v0.12.0-----OK------------8.463-------
ppx_fail.v0.13.0------------Aborted------------0.000
ppx_fields_conv.v0.12.0-----OK------------5.019-------
ppx_fields_conv.v0.13.0------------Aborted------------0.000
ppx_hash.v0.12.0-----OK------------10.652-------
ppx_hash.v0.13.0------------Aborted------------0.000
ppx_here.v0.12.0-----OK------------5.063-------
ppx_here.v0.13.0------------Aborted------------0.000
ppx_inline_test.v0.12.0-----OK------------7.071-------
ppx_inline_test.v0.13.0------------Aborted------------0.000
ppx_jane.v0.12.0-----OK------------3.380-------
ppx_jane.v0.13.0------------Aborted------------0.000
ppx_js_style.v0.12.0-----OK------------7.612-------
ppx_js_style.v0.13.0------------Aborted------------0.000
ppx_let.v0.12.0-----OK------------4.258-------
ppx_let.v0.13.0------------Aborted------------0.000
ppx_module_timer.v0.12.0-----OK------------5.119-------
ppx_module_timer.v0.13.0------------Aborted------------0.000
ppx_optcomp.v0.12.0-----OK------------4.090-------
ppx_optcomp.v0.13.0------------Aborted------------0.000
ppx_optional.v0.12.0-----OK------------4.646-------
ppx_optional.v0.13.0------------Aborted------------0.000
ppx_pipebang.v0.12.0-----OK------------12.624-------
ppx_pipebang.v0.13.0------------Aborted------------0.000
ppx_sexp_conv.v0.12.0-----OK------------14.740-------
ppx_sexp_conv.v0.13.0------------Aborted------------0.000
ppx_sexp_message.v0.12.0-----OK------------10.703-------
ppx_sexp_message.v0.13.0------------Aborted------------0.000
ppx_sexp_value.v0.12.0-----OK------------11.823-------
ppx_sexp_value.v0.13.0------------Aborted------------0.000
ppx_stable.v0.12.0-----OK------------18.112-------
ppx_stable.v0.13.0------------Aborted------------0.000
ppx_typerep_conv.v0.12.0-----OK------------17.177-------
ppx_typerep_conv.v0.13.0------------Aborted------------0.000
ppx_variants_conv.v0.12.0-----OK------------17.118-------
ppx_variants_conv.v0.13.0------------Aborted------------0.000
ppxlib.0.12.0------------Aborted------------0.000
ppxlib.0.8.1-----OK------------14.837-------
protocol_version_header.v0.12.0-----OK------------9.722-------
protocol_version_header.v0.13.0------------Aborted------------0.000
psmt2-frontend.0.2------------Aborted------------0.000
re.1.9.0-----OK------Aborted-----4.880------0.000
re2.v0.12.1-----OK------------68.234-------
result.1.5-----OK------Aborted-----1.175------0.000
sauvola-bench.1.0------------Aborted------------0.000
seq.base------------Aborted------------0.000
sequence-bench.1.0------------Aborted------------0.000
sexp_pretty.v0.12.0-----OK------------2.922-------
sexplib.v0.12.0-----OK------------4.220-------
sexplib.v0.13.0------------Aborted------------0.000
sexplib0.v0.12.0-----OK------------1.415-------
sexplib0.v0.13.0------------Aborted------------0.000
shell.v0.12.0-----OK------------3.996-------
spawn.v0.13.0-----OK------Aborted-----36.157------0.000
splittable_random.v0.12.0-----OK------------16.316-------
splittable_random.v0.13.0------------Aborted------------0.000
stdio.v0.12.0-----OK------------5.901-------
stdio.v0.13.0------------Aborted------------0.000
stdlib-shims.0.1.0-----OK------Aborted-----0.764------0.000
stringext.1.6.0-----OK------Aborted-----36.440------0.000
textutils.v0.12.0-----OK------------9.565-------
textutils.v0.13.0------------Aborted------------0.000
textutils_kernel.v0.12.0-----OK------------4.729-------
thread-bench.1.0-----Failure (2)------Aborted-----0.225------0.000
time_now.v0.12.0-----OK------------1.973-------
time_now.v0.13.0------------Aborted------------0.000
topkg.1.0.1------------Aborted------------0.000
typerep.v0.12.0-----OK------------6.854-------
typerep.v0.13.0------------Aborted------------0.000
uchar.0.0.2------------Aborted------------0.000
uri.3.1.0-----OK------Aborted-----10.463------0.000
uri-sexp.3.1.0-----OK------Aborted-----3.519------0.000
uutf.1.0.2------------Aborted------------0.000
variantslib.v0.12.0-----OK------------9.326-------
variantslib.v0.13.0------------Aborted------------0.000
yojson.1.7.0-----OK------Aborted-----10.557------0.000
yojson-bench.1.0-----Failure (2)------Aborted-----1.545------0.000
zarith.1.9.1------------Aborted------------0.000
Close

Error on yojson-bench.1.0 (4.07.1+flambda+bench)

Command:

/usr/bin/make -C yojson

Output

make: Entering directory '/home/louis/.opam/4.07.1+flambda+bench/.opam-switch/build/yojson-bench.1.0/yojson'
ocamlfind ocamlopt -I `ocamlfind query yojson` -o ydump_bench -package easy-format,biniou -linkpkg yojson.cmx yojson_biniou.cmx ydump.ml
gcc: error: /home/louis/.opam/4.07.1+flambda+bench/lib/yojson/yojson_biniou.o: No such file or directory
gcc: error: /home/louis/.opam/4.07.1+flambda+bench/lib/yojson/yojson.o: No such file or directory
File "caml_startup", line 1:
Error: Error during linking
Makefile:6: recipe for target 'all' failed
make: *** [all] Error 2
make: Leaving directory '/home/louis/.opam/4.07.1+flambda+bench/.opam-switch/build/yojson-bench.1.0/yojson'
Close

Error on thread-bench.1.0 (4.07.1+flambda+bench)

Command:

/usr/bin/make -C thread

Output

make: Entering directory '/home/louis/.opam/4.07.1+flambda+bench/.opam-switch/build/thread-bench.1.0/thread'
ocamlfind ocamlopt -package lwt.unix -linkpkg -o thread_sleep_lwt thread_sleep_lwt.ml
ocamlfind: [WARNING] Package `threads': Linking problems may arise because of the missing -thread or -vmthread switch
File "thread_sleep_lwt.ml", line 1:
Error: No implementations provided for the following modules:
         Mutex referenced from /home/louis/.opam/4.07.1+flambda+bench/lib/lwt/unix/lwt_unix.cmxa(Lwt_main)
Makefile:7: recipe for target 'thread_sleep_lwt' failed
make: *** [thread_sleep_lwt] Error 2
make: Leaving directory '/home/louis/.opam/4.07.1+flambda+bench/.opam-switch/build/thread-bench.1.0/thread'
Close

Error on ocaml-variants.4.08.0+trunk+flambda+opt (4.08.0+trunk+flambda+opt+bench)

Command:

~/.opam/4.08.0+trunk+flambda+opt+bench/.opam-switch/build/ocaml-variants.4.08.0+trunk+flambda+opt/./configure -prefix /home/louis/.opam/4.08.0+trunk+flambda+opt+bench -flambda -with-debug-runtime

Output

configure: error: unrecognized option: `-flambda'
Try `/home/louis/.opam/4.08.0+trunk+flambda+opt+bench/.opam-switch/build/ocaml-variants.4.08.0+trunk+flambda+opt/./configure --help' for more information
Close

Error on core-micro-bench.1.0 (4.07.1+flambda+bench)

Command:

/usr/bin/make -C core_micro

Output

make: Entering directory '/home/louis/.opam/4.07.1+flambda+bench/.opam-switch/build/core-micro-bench.1.0/core_micro'
ocamlbuild -use-ocamlfind runner.native
ocamlfind ocamldep -package str -package core -package core_bench.inline_benchmarks -modules runner.ml > runner.ml.depends
ocamlfind ocamlc -c -thread -package str -package core -package core_bench.inline_benchmarks -o runner.cmo runner.ml
+ ocamlfind ocamlc -c -thread -package str -package core -package core_bench.inline_benchmarks -o runner.cmo runner.ml
File "runner.ml", line 1, characters 5-13:
Error: Unbound module Core.Std
Command exited with code 2.
Makefile:4: recipe for target 'all' failed
make: *** [all] Error 10
make: Leaving directory '/home/louis/.opam/4.07.1+flambda+bench/.opam-switch/build/core-micro-bench.1.0/core_micro'
Close

Error on conf-graphviz.0.1 (4.07.1+flambda+bench)

Command:

/usr/bin/which dot

Output


Close

Error on cohttp-bench.1.0 (4.07.1+flambda+bench)

Command:

/usr/bin/make -C cohttp

Output

make: Entering directory '/home/louis/.opam/4.07.1+flambda+bench/.opam-switch/build/cohttp-bench.1.0/cohttp'
ocamlbuild -use-ocamlfind cohttp_lwt_bench.native cohttp_async_bench.native
ocamlfind ocamldep -package lwt.unix -package cohttp.lwt -modules cohttp_lwt_bench.ml > cohttp_lwt_bench.ml.depends
+ ocamlfind ocamldep -package lwt.unix -package cohttp.lwt -modules cohttp_lwt_bench.ml > cohttp_lwt_bench.ml.depends
ocamlfind: Package `cohttp.lwt' not found
Command exited with code 2.
Makefile:6: recipe for target 'all' failed
make: *** [all] Error 10
make: Leaving directory '/home/louis/.opam/4.07.1+flambda+bench/.opam-switch/build/cohttp-bench.1.0/cohttp'
Close

Error on chameneos-bench.1.0 (4.07.1+flambda+bench)

Command:

/usr/bin/make -C chameneos-redux

Output

make: Entering directory '/home/louis/.opam/4.07.1+flambda+bench/.opam-switch/build/chameneos-bench.1.0/chameneos-redux'
ocamlopt -bin-annot -thread unix.cmxa threads.cmxa chameneos_redux_th.ml -o chameneos_redux_th
ocamlopt -bin-annot -thread unix.cmxa threads.cmxa chameneos_redux_evtchn.ml -o chameneos_redux_evtchn
ocamlfind ocamlopt -bin-annot -package lwt.unix -linkpkg chameneos_redux_lwt.ml -o chameneos_redux_lwt
ocamlfind: [WARNING] Package `threads': Linking problems may arise because of the missing -thread or -vmthread switch
File "chameneos_redux_lwt.ml", line 1:
Error: No implementations provided for the following modules:
         Mutex referenced from /home/louis/.opam/4.07.1+flambda+bench/lib/lwt/unix/lwt_unix.cmxa(Lwt_main)
Makefile:6: recipe for target 'chameneos_redux_lwt' failed
make: *** [chameneos_redux_lwt] Error 2
make: Leaving directory '/home/louis/.opam/4.07.1+flambda+bench/.opam-switch/build/chameneos-bench.1.0/chameneos-redux'
Close

Error on async-rpc-bench.1.0 (4.07.1+flambda+bench)

Command:

/usr/bin/make -C async_rpc

Output

make: Entering directory '/home/louis/.opam/4.07.1+flambda+bench/.opam-switch/build/async-rpc-bench.1.0/async_rpc'
ocamlfind ocamlopt -thread -syntax camlp4o -package async -package bin_prot.syntax -package core -c rpc_common.ml
ocamlfind: Package `bin_prot.syntax' not found
Makefile:12: recipe for target 'rpc_common.cmx' failed
make: *** [rpc_common.cmx] Error 2
make: Leaving directory '/home/louis/.opam/4.07.1+flambda+bench/.opam-switch/build/async-rpc-bench.1.0/async_rpc'
Close

Error on async-echo-bench.1.0 (4.07.1+flambda+bench)

Command:

/usr/bin/make -C async_echo

Output

make: Entering directory '/home/louis/.opam/4.07.1+flambda+bench/.opam-switch/build/async-echo-bench.1.0/async_echo'
ocamlfind ocamlopt -thread -syntax camlp4o -package async -package bin_prot.syntax -package core -c echo_common.ml
ocamlfind: Package `bin_prot.syntax' not found
Makefile:20: recipe for target 'echo_common.cmx' failed
make: *** [echo_common.cmx] Error 2
make: Leaving directory '/home/louis/.opam/4.07.1+flambda+bench/.opam-switch/build/async-echo-bench.1.0/async_echo'