Package4.03.1+bench4.05.0+flambda+opt+bench4.06.1+flambda+bench4.06.1+flambda+opt+bench4.07.1+clambda+bench4.07.1+flambda+bench4.07.1+oclassic+bench4.08.0+gpr2165+bench4.08.0+mutmatch+bench4.08.0+trunk+bench4.08.0+trunk+flambda+bench4.08.0+trunk+flambda+oclassic+bench4.08.0+trunk+flambda+opt+bench4.03.1+bench time (s)4.05.0+flambda+opt+bench time (s)4.06.1+flambda+bench time (s)4.06.1+flambda+opt+bench time (s)4.07.1+clambda+bench time (s)4.07.1+flambda+bench time (s)4.07.1+oclassic+bench time (s)4.08.0+gpr2165+bench time (s)4.08.0+mutmatch+bench time (s)4.08.0+trunk+bench time (s)4.08.0+trunk+flambda+bench time (s)4.08.0+trunk+flambda+oclassic+bench time (s)4.08.0+trunk+flambda+opt+bench time (s)
almabench-bench.1.0----------Aborted-Aborted----------0.000-0.000
alt-ergo.2.3.1----OKOK----Aborted-Aborted----5.8814.163----0.000-0.000
alt-ergo-lib.2.3.1----OKOK----Aborted-Aborted----20.67137.940----0.000-0.000
alt-ergo-parsers.2.3.1----OKOK----Aborted-Aborted----12.6908.801----0.000-0.000
async.v0.12.0----OKOK-----------2.5102.546-------
async.v0.13.0----------Aborted-Aborted----------0.000-0.000
async-echo-bench.1.0----Failure (2)Failure (2)----Aborted-Aborted----0.5860.539----0.000-0.000
async-rpc-bench.1.0----Failure (2)Failure (2)----Aborted-Aborted----0.5030.460----0.000-0.000
async_extra.v0.12.0----OKOK-----------4.9115.340-------
async_kernel.v0.12.0----OKOK-----------17.03422.161-------
async_kernel.v0.13.0----------Aborted-Aborted----------0.000-0.000
async_rpc_kernel.v0.12.0----OKOK-----------8.80810.682-------
async_rpc_kernel.v0.13.0----------Aborted-Aborted----------0.000-0.000
async_unix.v0.12.0----OKOK-----------12.34718.829-------
async_unix.v0.13.0----------Aborted-Aborted----------0.000-0.000
base.v0.12.2----OKOK-----------22.56312.036-------
base.v0.13.1----------Aborted-Aborted----------0.000-0.000
base-bytes.base----------Aborted-Aborted----------0.000-0.000
base64.3.4.0----OKOK----Aborted-Aborted----1.6161.932----0.000-0.000
base_bigstring.v0.12.0----OKOK-----------1.0323.140-------
base_bigstring.v0.13.0----------Aborted-Aborted----------0.000-0.000
base_quickcheck.v0.12.1----OKOK-----------4.8956.145-------
base_quickcheck.v0.13.0----------Aborted-Aborted----------0.000-0.000
bdd-bench.1.0----------Aborted-Aborted----------0.000-0.000
bin_prot.v0.12.0----OKOK-----------12.47410.371-------
bin_prot.v0.13.0----------Aborted-Aborted----------0.000-0.000
biniou.1.2.1----OKOK----Aborted-Aborted----30.17139.520----0.000-0.000
camlimages.5.0.1----------Aborted-Aborted----------0.000-0.000
camlpdf.2.3----------Aborted-Aborted----------0.000-0.000
camlzip.1.10----------Aborted-Aborted----------0.000-0.000
chameneos-bench.1.0----Failure (2)Failure (2)----Aborted-Aborted----0.4300.479----0.000-0.000
cohttp.2.4.0----OKOK-----------6.4135.690-------
cohttp.2.5.1----------Aborted-Aborted----------0.000-0.000
cohttp-bench.1.0----Failure (2)Failure (2)----Aborted-Aborted----0.3080.292----0.000-0.000
conf-graphviz.0.1----Failure (1)Failure (1)-----------0.1770.186-------
configurator.v0.11.0----OKOK----Aborted-Aborted----3.7252.407----0.000-0.000
core.v0.12.4----OKOK-----------26.81134.193-------
core.v0.13.0----------Aborted-Aborted----------0.000-0.000
core-micro-bench.1.0----Failure (2)Failure (2)----Aborted-Aborted----1.3925.377----0.000-0.000
core-sequence-bench.1.0----OKOK----Aborted-Aborted----0.1340.065----0.000-0.000
core_bench.v0.12.0----OKOK-----------7.9845.000-------
core_bench.v0.13.0----------Aborted-Aborted----------0.000-0.000
core_extended.v0.12.0----OKOK-----------7.1027.267-------
core_kernel.v0.12.3----OKOK-----------48.42469.999-------
core_kernel.v0.13.1----------Aborted-Aborted----------0.000-0.000
cpdf.2.3----------Aborted-Aborted----------0.000-0.000
cpdf-bench.1.0----------Aborted-Aborted----------0.000-0.000
cppo.1.6.6----OKOK----Aborted-Aborted----1.4343.144----0.000-0.000
dune.2.4.0----OKOK----Aborted-Aborted----13.07418.624----0.000-0.000
dune-configurator.2.4.0----OKOK----Aborted-Aborted----19.38519.274----0.000-0.000
dune-private-libs.2.4.0----OKOK----Aborted-Aborted----8.12621.541----0.000-0.000
easy-format.1.3.2----OKOK----Aborted-Aborted----0.3522.044----0.000-0.000
expect_test_helpers.v0.12.0----OKOK-----------1.9252.213-------
expect_test_helpers_kernel.v0.12.0----OKOK-----------10.72310.679-------
fieldslib.v0.12.0----OKOK-----------0.3411.763-------
fieldslib.v0.13.0----------Aborted-Aborted----------0.000-0.000
frama-c.19.1----OKOK-----------96.764156.846-------
frama-c-bench.1.0----OKOK-----------0.2230.128-------
jane-street-headers.v0.12.0----OKOK-----------0.2391.784-------
jane-street-headers.v0.13.0----------Aborted-Aborted----------0.000-0.000
jbuilder.1.0+beta20.2----------Aborted-Aborted----------0.000-0.000
json-bench-data.1.0----------Aborted-Aborted----------0.000-0.000
jsonm.1.0.1----------Aborted-Aborted----------0.000-0.000
jsonm-bench.1.0----------Aborted-Aborted----------0.000-0.000
jst-config.v0.12.0----OKOK-----------12.49510.853-------
jst-config.v0.13.0----------Aborted-Aborted----------0.000-0.000
kb-bench.1.0----------Aborted-Aborted----------0.000-0.000
lexifi-g2pp-bench.1.0----------Aborted-Aborted----------0.000-0.000
lwt.5.2.0----OKOK----Aborted-Aborted----37.21132.670----0.000-0.000
menhir.20200211----OKOK----Aborted-Aborted----30.80138.554----0.000-0.000
menhir-bench.1.0----OKOK----Aborted-Aborted----0.3000.384----0.000-0.000
menhirLib.20200211----OKOK----Aborted-Aborted----2.1023.027----0.000-0.000
menhirSdk.20200211----OKOK----Aborted-Aborted----1.8552.254----0.000-0.000
minilight.1.6----------Aborted-Aborted----------0.000-0.000
minilight-bench.1.0----------Aborted-Aborted----------0.000-0.000
mmap.1.1.0----OKOK----Aborted-Aborted----1.0410.750----0.000-0.000
nbcodec.1.0----------Aborted-Aborted----------0.000-0.000
nbcodec-bench.1.0----------Aborted-Aborted----------0.000-0.000
num.1.3----------Aborted-Aborted----------0.000-0.000
numerical-analysis-bench.1.0----------Aborted-Aborted----------0.000-0.000
ocaml.4.08.0----------Aborted-Aborted----------0.000-0.000
ocaml-compiler-libs.v0.12.1----OKOK----Aborted-Aborted----3.0033.171----0.000-0.000
ocaml-migrate-parsetree.1.6.0----OKOK----Aborted-Aborted----9.74527.791----0.000-0.000
ocaml-variants.4.08.0+trunk+flambda----------Failure (1)------------0.393--
ocaml-variants.4.08.0+trunk+flambda+opt------------Failure (1)------------0.306
ocamlbuild.0.14.0----------Aborted-Aborted----------0.000-0.000
ocamlfind.1.8.1----------Aborted-Aborted----------0.000-0.000
ocplib-endian.1.0----OKOK----Aborted-Aborted----36.74052.619----0.000-0.000
ocplib-simplex.0.4----------Aborted-Aborted----------0.000-0.000
octavius.1.2.2----OKOK----Aborted-Aborted----2.9423.428----0.000-0.000
parsexp.v0.12.0----OKOK-----------2.2636.272-------
parsexp.v0.13.0----------Aborted-Aborted----------0.000-0.000
patdiff.v0.12.1----OKOK-----------4.7917.147-------
patdiff.v0.13.0----------Aborted-Aborted----------0.000-0.000
patdiff-bench.1.0----OKOK----Aborted-Aborted----0.1990.168----0.000-0.000
patience_diff.v0.12.0----OKOK-----------6.5237.861-------
patience_diff.v0.13.0----------Aborted-Aborted----------0.000-0.000
pcre.7.4.1----OKOK-----------4.7336.157-------
pcre.7.4.3----------Aborted-Aborted----------0.000-0.000
ppx_assert.v0.12.0----OKOK-----------5.2329.745-------
ppx_assert.v0.13.0----------Aborted-Aborted----------0.000-0.000
ppx_base.v0.12.0----OKOK-----------24.26314.800-------
ppx_base.v0.13.0----------Aborted-Aborted----------0.000-0.000
ppx_bench.v0.12.0----OKOK-----------3.23010.005-------
ppx_bench.v0.13.0----------Aborted-Aborted----------0.000-0.000
ppx_bin_prot.v0.12.1----OKOK-----------11.9265.398-------
ppx_bin_prot.v0.13.0----------Aborted-Aborted----------0.000-0.000
ppx_cold.v0.13.0----------Aborted-Aborted----------0.000-0.000
ppx_compare.v0.12.0----OKOK-----------3.3794.813-------
ppx_compare.v0.13.0----------Aborted-Aborted----------0.000-0.000
ppx_custom_printf.v0.12.1----OKOK-----------5.92010.483-------
ppx_custom_printf.v0.13.0----------Aborted-Aborted----------0.000-0.000
ppx_derivers.1.2.1----OKOK----Aborted-Aborted----1.0010.738----0.000-0.000
ppx_enumerate.v0.12.0----OKOK-----------3.0594.478-------
ppx_enumerate.v0.13.0----------Aborted-Aborted----------0.000-0.000
ppx_expect.v0.12.0----OKOK-----------18.12313.081-------
ppx_expect.v0.13.0----------Aborted-Aborted----------0.000-0.000
ppx_fail.v0.12.0----OKOK-----------4.78214.062-------
ppx_fail.v0.13.0----------Aborted-Aborted----------0.000-0.000
ppx_fields_conv.v0.12.0----OKOK-----------3.2264.571-------
ppx_fields_conv.v0.13.0----------Aborted-Aborted----------0.000-0.000
ppx_hash.v0.12.0----OKOK-----------6.80011.432-------
ppx_hash.v0.13.0----------Aborted-Aborted----------0.000-0.000
ppx_here.v0.12.0----OKOK-----------2.8703.746-------
ppx_here.v0.13.0----------Aborted-Aborted----------0.000-0.000
ppx_inline_test.v0.12.0----OKOK-----------3.7895.887-------
ppx_inline_test.v0.13.0----------Aborted-Aborted----------0.000-0.000
ppx_jane.v0.12.0----OKOK-----------1.5782.027-------
ppx_jane.v0.13.0----------Aborted-Aborted----------0.000-0.000
ppx_js_style.v0.12.0----OKOK-----------3.8185.868-------
ppx_js_style.v0.13.0----------Aborted-Aborted----------0.000-0.000
ppx_let.v0.12.0----OKOK-----------3.0365.764-------
ppx_let.v0.13.0----------Aborted-Aborted----------0.000-0.000
ppx_module_timer.v0.12.0----OKOK-----------4.5347.017-------
ppx_module_timer.v0.13.0----------Aborted-Aborted----------0.000-0.000
ppx_optcomp.v0.12.0----OKOK-----------1.5864.562-------
ppx_optcomp.v0.13.0----------Aborted-Aborted----------0.000-0.000
ppx_optional.v0.12.0----OKOK-----------2.4125.530-------
ppx_optional.v0.13.0----------Aborted-Aborted----------0.000-0.000
ppx_pipebang.v0.12.0----OKOK-----------5.23013.479-------
ppx_pipebang.v0.13.0----------Aborted-Aborted----------0.000-0.000
ppx_sexp_conv.v0.12.0----OKOK-----------6.76516.364-------
ppx_sexp_conv.v0.13.0----------Aborted-Aborted----------0.000-0.000
ppx_sexp_message.v0.12.0----OKOK-----------6.83611.388-------
ppx_sexp_message.v0.13.0----------Aborted-Aborted----------0.000-0.000
ppx_sexp_value.v0.12.0----OKOK-----------9.89013.747-------
ppx_sexp_value.v0.13.0----------Aborted-Aborted----------0.000-0.000
ppx_stable.v0.12.0----OKOK-----------9.68725.752-------
ppx_stable.v0.13.0----------Aborted-Aborted----------0.000-0.000
ppx_typerep_conv.v0.12.0----OKOK-----------9.18922.915-------
ppx_typerep_conv.v0.13.0----------Aborted-Aborted----------0.000-0.000
ppx_variants_conv.v0.12.0----OKOK-----------9.16722.534-------
ppx_variants_conv.v0.13.0----------Aborted-Aborted----------0.000-0.000
ppxlib.0.12.0----------Aborted-Aborted----------0.000-0.000
ppxlib.0.8.1----OKOK-----------14.07415.153-------
protocol_version_header.v0.12.0----OKOK-----------3.92312.449-------
protocol_version_header.v0.13.0----------Aborted-Aborted----------0.000-0.000
psmt2-frontend.0.2----OKOK----Aborted-Aborted----35.57444.105----0.000-0.000
re.1.9.0----OKOK----Aborted-Aborted----3.3414.229----0.000-0.000
re2.v0.12.1----OKOK-----------64.28366.315-------
result.1.5----OKOK----Aborted-Aborted----0.6891.022----0.000-0.000
sauvola-bench.1.0----------Aborted-Aborted----------0.000-0.000
seq.base----------Aborted-Aborted----------0.000-0.000
sequence-bench.1.0----------Aborted-Aborted----------0.000-0.000
sexp_pretty.v0.12.0----OKOK-----------3.1452.663-------
sexplib.v0.12.0----OKOK-----------1.2083.650-------
sexplib.v0.13.0----------Aborted-Aborted----------0.000-0.000
sexplib0.v0.12.0----OKOK-----------1.1501.502-------
sexplib0.v0.13.0----------Aborted-Aborted----------0.000-0.000
shell.v0.12.0----OKOK-----------2.6023.918-------
spawn.v0.13.0----OKOK----Aborted-Aborted----0.8540.970----0.000-0.000
splittable_random.v0.12.0----OKOK-----------23.80914.082-------
splittable_random.v0.13.0----------Aborted-Aborted----------0.000-0.000
stdio.v0.12.0----OKOK-----------1.2776.070-------
stdio.v0.13.0----------Aborted-Aborted----------0.000-0.000
stdlib-shims.0.1.0----OKOK----Aborted-Aborted----28.5264.608----0.000-0.000
stringext.1.6.0----OKOK----Aborted-Aborted----30.94340.956----0.000-0.000
textutils.v0.12.0----OKOK-----------9.5789.651-------
textutils.v0.13.0----------Aborted-Aborted----------0.000-0.000
textutils_kernel.v0.12.0----OKOK-----------8.9525.209-------
thread-bench.1.0----Failure (2)Failure (2)----Aborted-Aborted----0.1950.205----0.000-0.000
time_now.v0.12.0----OKOK-----------4.4241.912-------
time_now.v0.13.0----------Aborted-Aborted----------0.000-0.000
topkg.1.0.1----------Aborted-Aborted----------0.000-0.000
typerep.v0.12.0----OKOK-----------5.7885.906-------
typerep.v0.13.0----------Aborted-Aborted----------0.000-0.000
uchar.0.0.2----------Aborted-Aborted----------0.000-0.000
uri.3.1.0----OKOK----Aborted-Aborted----5.42010.947----0.000-0.000
uri-sexp.3.1.0----OKOK----Aborted-Aborted----1.7475.083----0.000-0.000
uutf.1.0.2----------Aborted-Aborted----------0.000-0.000
variantslib.v0.12.0----OKOK-----------1.1175.743-------
variantslib.v0.13.0----------Aborted-Aborted----------0.000-0.000
why3.1.3.0----OKOK-----------35.45849.944-------
yojson.1.7.0----OKOK----Aborted-Aborted----2.91010.501----0.000-0.000
yojson-bench.1.0----Failure (2)Failure (2)----Aborted-Aborted----11.9770.819----0.000-0.000
zarith.1.9.1----------Aborted-Aborted----------0.000-0.000
Close

Error on yojson-bench.1.0 (4.07.1+flambda+bench)

Command:

/usr/bin/make -C yojson

Output

make: Entering directory '/home/louis/.opam/4.07.1+flambda+bench/.opam-switch/build/yojson-bench.1.0/yojson'
ocamlfind ocamlopt -I `ocamlfind query yojson` -o ydump_bench -package easy-format,biniou -linkpkg yojson.cmx yojson_biniou.cmx ydump.ml
gcc: error: /home/louis/.opam/4.07.1+flambda+bench/lib/yojson/yojson_biniou.o: No such file or directory
gcc: error: /home/louis/.opam/4.07.1+flambda+bench/lib/yojson/yojson.o: No such file or directory
File "caml_startup", line 1:
Error: Error during linking
Makefile:6: recipe for target 'all' failed
make: *** [all] Error 2
make: Leaving directory '/home/louis/.opam/4.07.1+flambda+bench/.opam-switch/build/yojson-bench.1.0/yojson'
Close

Error on yojson-bench.1.0 (4.07.1+clambda+bench)

Command:

/usr/bin/make -C yojson

Output

make: Entering directory '/home/louis/.opam/4.07.1+clambda+bench/.opam-switch/build/yojson-bench.1.0/yojson'
ocamlfind ocamlopt -I `ocamlfind query yojson` -o ydump_bench -package easy-format,biniou -linkpkg yojson.cmx yojson_biniou.cmx ydump.ml
gcc: error: /home/louis/.opam/4.07.1+clambda+bench/lib/yojson/yojson_biniou.o: No such file or directory
gcc: error: /home/louis/.opam/4.07.1+clambda+bench/lib/yojson/yojson.o: No such file or directory
File "caml_startup", line 1:
Error: Error during linking
Makefile:6: recipe for target 'all' failed
make: *** [all] Error 2
make: Leaving directory '/home/louis/.opam/4.07.1+clambda+bench/.opam-switch/build/yojson-bench.1.0/yojson'
Close

Error on thread-bench.1.0 (4.07.1+flambda+bench)

Command:

/usr/bin/make -C thread

Output

make: Entering directory '/home/louis/.opam/4.07.1+flambda+bench/.opam-switch/build/thread-bench.1.0/thread'
ocamlfind ocamlopt -package lwt.unix -linkpkg -o thread_sleep_lwt thread_sleep_lwt.ml
ocamlfind: [WARNING] Package `threads': Linking problems may arise because of the missing -thread or -vmthread switch
File "thread_sleep_lwt.ml", line 1:
Error: No implementations provided for the following modules:
         Mutex referenced from /home/louis/.opam/4.07.1+flambda+bench/lib/lwt/unix/lwt_unix.cmxa(Lwt_main)
Makefile:7: recipe for target 'thread_sleep_lwt' failed
make: *** [thread_sleep_lwt] Error 2
make: Leaving directory '/home/louis/.opam/4.07.1+flambda+bench/.opam-switch/build/thread-bench.1.0/thread'
Close

Error on thread-bench.1.0 (4.07.1+clambda+bench)

Command:

/usr/bin/make -C thread

Output

make: Entering directory '/home/louis/.opam/4.07.1+clambda+bench/.opam-switch/build/thread-bench.1.0/thread'
ocamlfind ocamlopt -package lwt.unix -linkpkg -o thread_sleep_lwt thread_sleep_lwt.ml
ocamlfind: [WARNING] Package `threads': Linking problems may arise because of the missing -thread or -vmthread switch
File "thread_sleep_lwt.ml", line 1:
Error: No implementations provided for the following modules:
         Mutex referenced from /home/louis/.opam/4.07.1+clambda+bench/lib/lwt/unix/lwt_unix.cmxa(Lwt_main)
Makefile:7: recipe for target 'thread_sleep_lwt' failed
make: *** [thread_sleep_lwt] Error 2
make: Leaving directory '/home/louis/.opam/4.07.1+clambda+bench/.opam-switch/build/thread-bench.1.0/thread'
Close

Error on ocaml-variants.4.08.0+trunk+flambda+opt (4.08.0+trunk+flambda+opt+bench)

Command:

~/.opam/4.08.0+trunk+flambda+opt+bench/.opam-switch/build/ocaml-variants.4.08.0+trunk+flambda+opt/./configure -prefix /home/louis/.opam/4.08.0+trunk+flambda+opt+bench -flambda -with-debug-runtime

Output

configure: error: unrecognized option: `-flambda'
Try `/home/louis/.opam/4.08.0+trunk+flambda+opt+bench/.opam-switch/build/ocaml-variants.4.08.0+trunk+flambda+opt/./configure --help' for more information
Close

Error on ocaml-variants.4.08.0+trunk+flambda (4.08.0+trunk+flambda+bench)

Command:

~/.opam/4.08.0+trunk+flambda+bench/.opam-switch/build/ocaml-variants.4.08.0+trunk+flambda/./configure -prefix /home/louis/.opam/4.08.0+trunk+flambda+bench -flambda -with-debug-runtime

Output

configure: error: unrecognized option: `-flambda'
Try `/home/louis/.opam/4.08.0+trunk+flambda+bench/.opam-switch/build/ocaml-variants.4.08.0+trunk+flambda/./configure --help' for more information
Close

Error on core-micro-bench.1.0 (4.07.1+flambda+bench)

Command:

/usr/bin/make -C core_micro

Output

make: Entering directory '/home/louis/.opam/4.07.1+flambda+bench/.opam-switch/build/core-micro-bench.1.0/core_micro'
ocamlbuild -use-ocamlfind runner.native
ocamlfind ocamldep -package str -package core -package core_bench.inline_benchmarks -modules runner.ml > runner.ml.depends
ocamlfind ocamlc -c -thread -package str -package core -package core_bench.inline_benchmarks -o runner.cmo runner.ml
+ ocamlfind ocamlc -c -thread -package str -package core -package core_bench.inline_benchmarks -o runner.cmo runner.ml
File "runner.ml", line 1, characters 5-13:
Error: Unbound module Core.Std
Command exited with code 2.
Makefile:4: recipe for target 'all' failed
make: *** [all] Error 10
make: Leaving directory '/home/louis/.opam/4.07.1+flambda+bench/.opam-switch/build/core-micro-bench.1.0/core_micro'
Close

Error on core-micro-bench.1.0 (4.07.1+clambda+bench)

Command:

/usr/bin/make -C core_micro

Output

make: Entering directory '/home/louis/.opam/4.07.1+clambda+bench/.opam-switch/build/core-micro-bench.1.0/core_micro'
ocamlbuild -use-ocamlfind runner.native
ocamlfind ocamldep -package str -package core -package core_bench.inline_benchmarks -modules runner.ml > runner.ml.depends
ocamlfind ocamlc -c -thread -package str -package core -package core_bench.inline_benchmarks -o runner.cmo runner.ml
+ ocamlfind ocamlc -c -thread -package str -package core -package core_bench.inline_benchmarks -o runner.cmo runner.ml
File "runner.ml", line 1, characters 5-13:
Error: Unbound module Core.Std
Command exited with code 2.
Makefile:4: recipe for target 'all' failed
make: *** [all] Error 10
make: Leaving directory '/home/louis/.opam/4.07.1+clambda+bench/.opam-switch/build/core-micro-bench.1.0/core_micro'
Close

Error on conf-graphviz.0.1 (4.07.1+flambda+bench)

Command:

/usr/bin/which dot

Output


Close

Error on conf-graphviz.0.1 (4.07.1+clambda+bench)

Command:

/usr/bin/which dot

Output


Close

Error on cohttp-bench.1.0 (4.07.1+flambda+bench)

Command:

/usr/bin/make -C cohttp

Output

make: Entering directory '/home/louis/.opam/4.07.1+flambda+bench/.opam-switch/build/cohttp-bench.1.0/cohttp'
ocamlbuild -use-ocamlfind cohttp_lwt_bench.native cohttp_async_bench.native
ocamlfind ocamldep -package lwt.unix -package cohttp.lwt -modules cohttp_lwt_bench.ml > cohttp_lwt_bench.ml.depends
+ ocamlfind ocamldep -package lwt.unix -package cohttp.lwt -modules cohttp_lwt_bench.ml > cohttp_lwt_bench.ml.depends
ocamlfind: Package `cohttp.lwt' not found
Command exited with code 2.
Makefile:6: recipe for target 'all' failed
make: *** [all] Error 10
make: Leaving directory '/home/louis/.opam/4.07.1+flambda+bench/.opam-switch/build/cohttp-bench.1.0/cohttp'
Close

Error on cohttp-bench.1.0 (4.07.1+clambda+bench)

Command:

/usr/bin/make -C cohttp

Output

make: Entering directory '/home/louis/.opam/4.07.1+clambda+bench/.opam-switch/build/cohttp-bench.1.0/cohttp'
ocamlbuild -use-ocamlfind cohttp_lwt_bench.native cohttp_async_bench.native
ocamlfind ocamldep -package lwt.unix -package cohttp.lwt -modules cohttp_lwt_bench.ml > cohttp_lwt_bench.ml.depends
+ ocamlfind ocamldep -package lwt.unix -package cohttp.lwt -modules cohttp_lwt_bench.ml > cohttp_lwt_bench.ml.depends
ocamlfind: Package `cohttp.lwt' not found
Command exited with code 2.
Makefile:6: recipe for target 'all' failed
make: *** [all] Error 10
make: Leaving directory '/home/louis/.opam/4.07.1+clambda+bench/.opam-switch/build/cohttp-bench.1.0/cohttp'
Close

Error on chameneos-bench.1.0 (4.07.1+flambda+bench)

Command:

/usr/bin/make -C chameneos-redux

Output

make: Entering directory '/home/louis/.opam/4.07.1+flambda+bench/.opam-switch/build/chameneos-bench.1.0/chameneos-redux'
ocamlopt -bin-annot -thread unix.cmxa threads.cmxa chameneos_redux_th.ml -o chameneos_redux_th
ocamlopt -bin-annot -thread unix.cmxa threads.cmxa chameneos_redux_evtchn.ml -o chameneos_redux_evtchn
ocamlfind ocamlopt -bin-annot -package lwt.unix -linkpkg chameneos_redux_lwt.ml -o chameneos_redux_lwt
ocamlfind: [WARNING] Package `threads': Linking problems may arise because of the missing -thread or -vmthread switch
File "chameneos_redux_lwt.ml", line 1:
Error: No implementations provided for the following modules:
         Mutex referenced from /home/louis/.opam/4.07.1+flambda+bench/lib/lwt/unix/lwt_unix.cmxa(Lwt_main)
Makefile:6: recipe for target 'chameneos_redux_lwt' failed
make: *** [chameneos_redux_lwt] Error 2
make: Leaving directory '/home/louis/.opam/4.07.1+flambda+bench/.opam-switch/build/chameneos-bench.1.0/chameneos-redux'
Close

Error on chameneos-bench.1.0 (4.07.1+clambda+bench)

Command:

/usr/bin/make -C chameneos-redux

Output

make: Entering directory '/home/louis/.opam/4.07.1+clambda+bench/.opam-switch/build/chameneos-bench.1.0/chameneos-redux'
ocamlopt -bin-annot -thread unix.cmxa threads.cmxa chameneos_redux_th.ml -o chameneos_redux_th
ocamlopt -bin-annot -thread unix.cmxa threads.cmxa chameneos_redux_evtchn.ml -o chameneos_redux_evtchn
ocamlfind ocamlopt -bin-annot -package lwt.unix -linkpkg chameneos_redux_lwt.ml -o chameneos_redux_lwt
ocamlfind: [WARNING] Package `threads': Linking problems may arise because of the missing -thread or -vmthread switch
File "chameneos_redux_lwt.ml", line 1:
Error: No implementations provided for the following modules:
         Mutex referenced from /home/louis/.opam/4.07.1+clambda+bench/lib/lwt/unix/lwt_unix.cmxa(Lwt_main)
Makefile:6: recipe for target 'chameneos_redux_lwt' failed
make: *** [chameneos_redux_lwt] Error 2
make: Leaving directory '/home/louis/.opam/4.07.1+clambda+bench/.opam-switch/build/chameneos-bench.1.0/chameneos-redux'
Close

Error on async-rpc-bench.1.0 (4.07.1+flambda+bench)

Command:

/usr/bin/make -C async_rpc

Output

make: Entering directory '/home/louis/.opam/4.07.1+flambda+bench/.opam-switch/build/async-rpc-bench.1.0/async_rpc'
ocamlfind ocamlopt -thread -syntax camlp4o -package async -package bin_prot.syntax -package core -c rpc_common.ml
ocamlfind: Package `bin_prot.syntax' not found
Makefile:12: recipe for target 'rpc_common.cmx' failed
make: *** [rpc_common.cmx] Error 2
make: Leaving directory '/home/louis/.opam/4.07.1+flambda+bench/.opam-switch/build/async-rpc-bench.1.0/async_rpc'
Close

Error on async-rpc-bench.1.0 (4.07.1+clambda+bench)

Command:

/usr/bin/make -C async_rpc

Output

make: Entering directory '/home/louis/.opam/4.07.1+clambda+bench/.opam-switch/build/async-rpc-bench.1.0/async_rpc'
ocamlfind ocamlopt -thread -syntax camlp4o -package async -package bin_prot.syntax -package core -c rpc_common.ml
ocamlfind: Package `bin_prot.syntax' not found
Makefile:12: recipe for target 'rpc_common.cmx' failed
make: *** [rpc_common.cmx] Error 2
make: Leaving directory '/home/louis/.opam/4.07.1+clambda+bench/.opam-switch/build/async-rpc-bench.1.0/async_rpc'
Close

Error on async-echo-bench.1.0 (4.07.1+flambda+bench)

Command:

/usr/bin/make -C async_echo

Output

make: Entering directory '/home/louis/.opam/4.07.1+flambda+bench/.opam-switch/build/async-echo-bench.1.0/async_echo'
ocamlfind ocamlopt -thread -syntax camlp4o -package async -package bin_prot.syntax -package core -c echo_common.ml
ocamlfind: Package `bin_prot.syntax' not found
Makefile:20: recipe for target 'echo_common.cmx' failed
make: *** [echo_common.cmx] Error 2
make: Leaving directory '/home/louis/.opam/4.07.1+flambda+bench/.opam-switch/build/async-echo-bench.1.0/async_echo'
Close

Error on async-echo-bench.1.0 (4.07.1+clambda+bench)

Command:

/usr/bin/make -C async_echo

Output

make: Entering directory '/home/louis/.opam/4.07.1+clambda+bench/.opam-switch/build/async-echo-bench.1.0/async_echo'
ocamlfind ocamlopt -thread -syntax camlp4o -package async -package bin_prot.syntax -package core -c echo_common.ml
ocamlfind: Package `bin_prot.syntax' not found
Makefile:20: recipe for target 'echo_common.cmx' failed
make: *** [echo_common.cmx] Error 2
make: Leaving directory '/home/louis/.opam/4.07.1+clambda+bench/.opam-switch/build/async-echo-bench.1.0/async_echo'