Package4.03.1+bench4.05.0+flambda+opt+bench4.06.1+flambda+bench4.06.1+flambda+opt+bench4.07.1+clambda+bench4.07.1+flambda+bench4.07.1+oclassic+bench4.08.0+gpr2165+bench4.08.0+mutmatch+bench4.08.0+trunk+bench4.08.0+trunk+flambda+bench4.08.0+trunk+flambda+oclassic+bench4.08.0+trunk+flambda+opt+bench4.03.1+bench time (s)4.05.0+flambda+opt+bench time (s)4.06.1+flambda+bench time (s)4.06.1+flambda+opt+bench time (s)4.07.1+clambda+bench time (s)4.07.1+flambda+bench time (s)4.07.1+oclassic+bench time (s)4.08.0+gpr2165+bench time (s)4.08.0+mutmatch+bench time (s)4.08.0+trunk+bench time (s)4.08.0+trunk+flambda+bench time (s)4.08.0+trunk+flambda+oclassic+bench time (s)4.08.0+trunk+flambda+opt+bench time (s)
almabench-bench.1.0-----------AbortedAborted-----------0.0000.000
alt-ergo.2.3.1------OK----AbortedAborted------3.807----0.0000.000
alt-ergo-lib.2.3.1------OK----AbortedAborted------31.657----0.0000.000
alt-ergo-parsers.2.3.1------OK----AbortedAborted------9.227----0.0000.000
async.v0.12.0------OK------------2.441------
async.v0.13.0--------AbortedAborted-AbortedAborted--------0.0000.000-0.0000.000
async.v0.9.0OK------------0.892------------
async-echo-bench.1.0Failure (2)-----Failure (2)-AbortedAborted-AbortedAborted0.668-----2.631-0.0000.000-0.0000.000
async-rpc-bench.1.0Failure (2)-----Failure (2)-AbortedAborted-AbortedAborted0.591-----2.536-0.0000.000-0.0000.000
async_extra.v0.12.0------OK------------5.283------
async_extra.v0.9.0OK------------7.555------------
async_kernel.v0.12.0------OK------------15.970------
async_kernel.v0.13.0--------AbortedAborted-AbortedAborted--------0.0000.000-0.0000.000
async_kernel.v0.9.0OK------------11.474------------
async_rpc_kernel.v0.12.0------OK------------10.015------
async_rpc_kernel.v0.13.0--------AbortedAborted-AbortedAborted--------0.0000.000-0.0000.000
async_rpc_kernel.v0.9.0OK------------8.524------------
async_unix.v0.12.0------OK------------17.821------
async_unix.v0.13.0--------AbortedAborted-AbortedAborted--------0.0000.000-0.0000.000
async_unix.v0.9.0OK------------11.519------------
base.v0.12.2------OK------------10.794------
base.v0.13.1--------AbortedOK-AbortedAborted--------0.0007.932-0.0000.000
base-bytes.base-----------AbortedAborted-----------0.0000.000
base64.2.3.0OK------------0.597------------
base64.3.4.0------OK-AbortedOK-AbortedAborted------1.877-0.0001.768-0.0000.000
base_bigstring.v0.12.0------OK------------3.039------
base_bigstring.v0.13.0--------AbortedAborted-AbortedAborted--------0.0000.000-0.0000.000
base_quickcheck.v0.12.1------OK------------9.292------
base_quickcheck.v0.13.0--------AbortedAborted-AbortedAborted--------0.0000.000-0.0000.000
bdd-bench.1.0-----------AbortedAborted-----------0.0000.000
bin_prot.v0.12.0------OK------------11.400------
bin_prot.v0.13.0--------AbortedAborted-AbortedAborted--------0.0000.000-0.0000.000
bin_prot.v0.9.1OK------------8.357------------
biniou.1.2.1OK-----OK-AbortedOK-AbortedAborted15.293-----34.796-0.00020.931-0.0000.000
camlimages.5.0.1--------Aborted--AbortedAborted--------0.000--0.0000.000
camlpdf.2.3-----------AbortedAborted-----------0.0000.000
camlzip.1.10-----------AbortedAborted-----------0.0000.000
chameneos-bench.1.0Failure (2)-----Failure (2)-AbortedAborted-AbortedAborted0.641-----2.440-0.0000.000-0.0000.000
cohttp.1.1.1OK------------4.343------------
cohttp.2.4.0------OK------------8.259------
cohttp.2.5.1--------AbortedAborted-AbortedAborted--------0.0000.000-0.0000.000
cohttp-bench.1.0Failure (2)-----Failure (2)-AbortedAborted-AbortedAborted0.385-----2.288-0.0000.000-0.0000.000
conf-graphviz.0.1Failure (1)-----Failure (1)------0.194-----0.176------
configurator.v0.11.0------OK-AbortedOK-AbortedAborted------2.468-0.0002.968-0.0000.000
configurator.v0.9.1OK------------18.354------------
core.v0.12.4------OK------------28.821------
core.v0.13.0--------AbortedAborted-AbortedAborted--------0.0000.000-0.0000.000
core.v0.9.1OK------------26.172------------
core-micro-bench.1.0Failure (2)-----Failure (2)-AbortedAborted-AbortedAborted1.370-----4.964-0.0000.000-0.0000.000
core-sequence-bench.1.0OK-----OK-AbortedAborted-AbortedAborted0.061-----0.045-0.0000.000-0.0000.000
core_bench.v0.12.0------OK------------4.512------
core_bench.v0.13.0--------AbortedAborted-AbortedAborted--------0.0000.000-0.0000.000
core_bench.v0.9.0OK------------3.510------------
core_extended.v0.12.0------OK------------5.619------
core_extended.v0.9.0OK------------21.271------------
core_kernel.v0.12.3------OK------------38.405------
core_kernel.v0.13.1--------AbortedAborted-AbortedAborted--------0.0000.000-0.0000.000
core_kernel.v0.9.0OK------------30.282------------
cpdf.2.3-----------AbortedAborted-----------0.0000.000
cpdf-bench.1.0-----------AbortedAborted-----------0.0000.000
cppo.1.6.6OK-----OK-AbortedOK-AbortedAborted0.936-----1.556-0.0001.368-0.0000.000
dune.2.2.0OK------------10.143------------
dune.2.4.0------OK-Failure (2)OK-AbortedAborted------16.412-0.88311.938-0.0000.000
dune-configurator.1.11.4OK------------3.817------------
dune-configurator.2.4.0------OK-AbortedOK-AbortedAborted------19.111-0.0009.521-0.0000.000
dune-private-libs.2.4.0------OK-AbortedOK-AbortedAborted------17.456-0.0005.917-0.0000.000
easy-format.1.3.2OK-----OK-AbortedOK-AbortedAborted0.240-----0.378-0.0000.556-0.0000.000
expect_test_helpers.v0.12.0------OK------------2.293------
expect_test_helpers_kernel.v0.12.0------OK------------10.480------
fieldslib.v0.12.0------OK------------3.331------
fieldslib.v0.13.0--------AbortedOK-AbortedAborted--------0.0003.066-0.0000.000
fieldslib.v0.9.0OK------------1.231------------
frama-c.19.1OK-----OK------75.024-----107.534------
frama-c-bench.1.0OK-----OK------0.326-----0.398------
jane-street-headers.v0.12.0------OK------------0.222------
jane-street-headers.v0.13.0--------AbortedOK-AbortedAborted--------0.0000.325-0.0000.000
jbuilder.1.0+beta20.2-----------AbortedAborted-----------0.0000.000
json-bench-data.1.0-----------AbortedAborted-----------0.0000.000
jsonm.1.0.1---------Aborted-AbortedAborted---------0.000-0.0000.000
jsonm-bench.1.0---------Aborted-AbortedAborted---------0.000-0.0000.000
jst-config.v0.12.0------OK------------11.431------
jst-config.v0.13.0--------AbortedAborted-AbortedAborted--------0.0000.000-0.0000.000
kb-bench.1.0-----------AbortedAborted-----------0.0000.000
lexifi-g2pp-bench.1.0-----------AbortedAborted-----------0.0000.000
lwt.5.2.0OK-----OK-AbortedOK-AbortedAborted4.317-----31.401-0.00016.651-0.0000.000
menhir.20200211OK-----OK-AbortedOK-AbortedAborted17.004-----32.789-0.00020.346-0.0000.000
menhir-bench.1.0OK-----OK-AbortedOK-AbortedAborted0.340-----0.353-0.0000.302-0.0000.000
menhirLib.20200211OK-----OK-AbortedOK-AbortedAborted1.564-----1.749-0.0001.325-0.0000.000
menhirSdk.20200211OK-----OK-AbortedOK-AbortedAborted0.538-----0.810-0.0000.571-0.0000.000
minilight.1.6-----------AbortedAborted-----------0.0000.000
minilight-bench.1.0-----------AbortedAborted-----------0.0000.000
mmap.1.1.0OK-----OK-AbortedOK-AbortedAborted0.356-----0.499-0.0000.377-0.0000.000
nbcodec.1.0-----------AbortedAborted-----------0.0000.000
nbcodec-bench.1.0-----------AbortedAborted-----------0.0000.000
num.1.3-----------AbortedAborted-----------0.0000.000
numerical-analysis-bench.1.0---------Failure (2)-AbortedAborted---------8.334-0.0000.000
ocaml.4.08.0-----------AbortedAborted-----------0.0000.000
ocaml-compiler-libs.v0.12.1------OK-AbortedOK-AbortedAborted------2.707-0.0002.045-0.0000.000
ocaml-migrate-parsetree.1.6.0OK-----OK-AbortedFailure (1)-AbortedAborted8.346-----25.811-0.0004.746-0.0000.000
ocaml-variants.4.08.0+trunk+flambda+oclassic-----------Failure (1)------------0.253-
ocaml-variants.4.08.0+trunk+flambda+opt------------Failure (1)------------0.313
ocamlbuild.0.14.0-----------AbortedAborted-----------0.0000.000
ocamlfind.1.8.1-----------AbortedAborted-----------0.0000.000
ocplib-endian.0.8OK------------29.740------------
ocplib-endian.1.0------OK-AbortedOK-AbortedAborted------47.742-0.00025.844-0.0000.000
ocplib-simplex.0.4-----------AbortedAborted-----------0.0000.000
octavius.1.2.2OK-----OK-AbortedOK-AbortedAborted2.139-----4.655-0.0003.286-0.0000.000
parsexp.v0.12.0------OK------------3.292------
parsexp.v0.13.0--------AbortedOK-AbortedAborted--------0.0003.266-0.0000.000
patdiff.v0.12.1------OK------------6.217------
patdiff.v0.13.0--------AbortedAborted-AbortedAborted--------0.0000.000-0.0000.000
patdiff.v0.9.0OK------------6.408------------
patdiff-bench.1.0OK-----OK-AbortedAborted-AbortedAborted0.158-----0.169-0.0000.000-0.0000.000
patience_diff.v0.12.0------OK------------7.413------
patience_diff.v0.13.0--------AbortedAborted-AbortedAborted--------0.0000.000-0.0000.000
patience_diff.v0.9.0OK------------1.974------------
pcre.7.4.1------OK------------3.256------
pcre.7.4.3--------AbortedOK-AbortedAborted--------0.0004.241-0.0000.000
ppx_assert.v0.12.0------OK------------11.114------
ppx_assert.v0.13.0--------AbortedAborted-AbortedAborted--------0.0000.000-0.0000.000
ppx_assert.v0.9.0OK------------4.495------------
ppx_ast.v0.9.1OK------------3.198------------
ppx_base.v0.12.0------OK------------4.583------
ppx_base.v0.13.0--------AbortedAborted-AbortedAborted--------0.0000.000-0.0000.000
ppx_base.v0.9.0OK------------4.565------------
ppx_bench.v0.12.0------OK------------10.004------
ppx_bench.v0.13.0--------AbortedAborted-AbortedAborted--------0.0000.000-0.0000.000
ppx_bench.v0.9.1OK------------4.018------------
ppx_bin_prot.v0.12.1------OK------------8.759------
ppx_bin_prot.v0.13.0--------AbortedAborted-AbortedAborted--------0.0000.000-0.0000.000
ppx_bin_prot.v0.9.0OK------------7.517------------
ppx_cold.v0.13.0--------AbortedAborted-AbortedAborted--------0.0000.000-0.0000.000
ppx_compare.v0.12.0------OK------------6.465------
ppx_compare.v0.13.0--------AbortedAborted-AbortedAborted--------0.0000.000-0.0000.000
ppx_compare.v0.9.0OK------------6.995------------
ppx_core.v0.9.0OK------------4.239------------
ppx_custom_printf.v0.12.1------OK------------11.687------
ppx_custom_printf.v0.13.0--------AbortedAborted-AbortedAborted--------0.0000.000-0.0000.000
ppx_custom_printf.v0.9.0OK------------6.441------------
ppx_derivers.1.2.1OK-----OK-AbortedOK-AbortedAborted0.320-----0.684-0.0000.395-0.0000.000
ppx_driver.v0.9.1OK------------1.504------------
ppx_enumerate.v0.12.0------OK------------5.880------
ppx_enumerate.v0.13.0--------AbortedAborted-AbortedAborted--------0.0000.000-0.0000.000
ppx_enumerate.v0.9.0OK------------2.603------------
ppx_expect.v0.12.0------OK------------13.485------
ppx_expect.v0.13.0--------AbortedAborted-AbortedAborted--------0.0000.000-0.0000.000
ppx_expect.v0.9.0OK------------12.864------------
ppx_fail.v0.12.0------OK------------14.172------
ppx_fail.v0.13.0--------AbortedAborted-AbortedAborted--------0.0000.000-0.0000.000
ppx_fail.v0.9.0OK------------4.731------------
ppx_fields_conv.v0.12.0------OK------------5.924------
ppx_fields_conv.v0.13.0--------AbortedAborted-AbortedAborted--------0.0000.000-0.0000.000
ppx_fields_conv.v0.9.0OK------------2.783------------
ppx_hash.v0.12.0------OK------------12.162------
ppx_hash.v0.13.0--------AbortedAborted-AbortedAborted--------0.0000.000-0.0000.000
ppx_hash.v0.9.0OK------------2.822------------
ppx_here.v0.12.0------OK------------5.563------
ppx_here.v0.13.0--------AbortedAborted-AbortedAborted--------0.0000.000-0.0000.000
ppx_here.v0.9.1OK------------2.905------------
ppx_inline_test.v0.12.0------OK------------8.689------
ppx_inline_test.v0.13.0--------AbortedAborted-AbortedAborted--------0.0000.000-0.0000.000
ppx_inline_test.v0.9.2OK------------5.650------------
ppx_jane.v0.12.0------OK------------6.291------
ppx_jane.v0.13.0--------AbortedAborted-AbortedAborted--------0.0000.000-0.0000.000
ppx_jane.v0.9.0OK------------1.122------------
ppx_js_style.v0.12.0------OK------------8.731------
ppx_js_style.v0.13.0--------AbortedAborted-AbortedAborted--------0.0000.000-0.0000.000
ppx_js_style.v0.9.0OK------------9.290------------
ppx_let.v0.12.0------OK------------3.799------
ppx_let.v0.13.0--------AbortedAborted-AbortedAborted--------0.0000.000-0.0000.000
ppx_let.v0.9.0OK------------1.937------------
ppx_metaquot.v0.9.0OK------------3.991------------
ppx_module_timer.v0.12.0------OK------------6.325------
ppx_module_timer.v0.13.0--------AbortedAborted-AbortedAborted--------0.0000.000-0.0000.000
ppx_optcomp.v0.12.0------OK------------2.813------
ppx_optcomp.v0.13.0--------AbortedAborted-AbortedAborted--------0.0000.000-0.0000.000
ppx_optcomp.v0.9.0OK------------0.953------------
ppx_optional.v0.12.0------OK------------3.639------
ppx_optional.v0.13.0--------AbortedAborted-AbortedAborted--------0.0000.000-0.0000.000
ppx_optional.v0.9.0OK------------2.515------------
ppx_pipebang.v0.12.0------OK------------11.580------
ppx_pipebang.v0.13.0--------AbortedAborted-AbortedAborted--------0.0000.000-0.0000.000
ppx_pipebang.v0.9.0OK------------9.799------------
ppx_sexp_conv.v0.12.0------OK------------13.573------
ppx_sexp_conv.v0.13.0--------AbortedAborted-AbortedAborted--------0.0000.000-0.0000.000
ppx_sexp_conv.v0.9.0OK------------8.395------------
ppx_sexp_message.v0.12.0------OK------------12.060------
ppx_sexp_message.v0.13.0--------AbortedAborted-AbortedAborted--------0.0000.000-0.0000.000
ppx_sexp_message.v0.9.0OK------------6.148------------
ppx_sexp_value.v0.12.0------OK------------12.864------
ppx_sexp_value.v0.13.0--------AbortedAborted-AbortedAborted--------0.0000.000-0.0000.000
ppx_sexp_value.v0.9.0OK------------6.394------------
ppx_stable.v0.12.0------OK------------22.759------
ppx_stable.v0.13.0--------AbortedAborted-AbortedAborted--------0.0000.000-0.0000.000
ppx_traverse.v0.9.0OK------------9.290------------
ppx_type_conv.v0.9.1OK------------10.811------------
ppx_typerep_conv.v0.12.0------OK------------22.697------
ppx_typerep_conv.v0.13.0--------AbortedAborted-AbortedAborted--------0.0000.000-0.0000.000
ppx_typerep_conv.v0.9.0OK------------9.277------------
ppx_variants_conv.v0.12.0------OK------------22.386------
ppx_variants_conv.v0.13.0--------AbortedAborted-AbortedAborted--------0.0000.000-0.0000.000
ppx_variants_conv.v0.9.0OK------------7.272------------
ppxlib.0.12.0--------AbortedAborted-AbortedAborted--------0.0000.000-0.0000.000
ppxlib.0.8.1------OK------------14.326------
protocol_version_header.v0.12.0------OK------------4.997------
protocol_version_header.v0.13.0--------AbortedAborted-AbortedAborted--------0.0000.000-0.0000.000
psmt2-frontend.0.2------OK-Aborted--AbortedAborted------42.472-0.000--0.0000.000
re.1.9.0OK-----OK-AbortedOK-AbortedAborted5.492-----7.536-0.00017.713-0.0000.000
re2.v0.12.1------OK------------65.952------
re2.v0.9.0OK------------63.129------------
result.1.5OK-----OK-AbortedOK-AbortedAborted15.122-----0.960-0.0001.165-0.0000.000
sauvola-bench.1.0--------Aborted--AbortedAborted--------0.000--0.0000.000
seq.0.2.2OK------------15.421------------
seq.base-----------AbortedAborted-----------0.0000.000
sequence-bench.1.0-----------AbortedAborted-----------0.0000.000
sexp_pretty.v0.12.0------OK------------14.098------
sexplib.v0.12.0------OK------------3.656------
sexplib.v0.13.0--------AbortedOK-AbortedAborted--------0.0002.465-0.0000.000
sexplib0.v0.12.0------OK------------1.538------
sexplib0.v0.13.0--------AbortedOK-AbortedAborted--------0.0001.786-0.0000.000
shell.v0.12.0------OK------------4.082------
spawn.v0.13.0------OK-AbortedOK-AbortedAborted------0.909-0.0000.934-0.0000.000
splittable_random.v0.12.0------OK------------17.713------
splittable_random.v0.13.0--------AbortedAborted-AbortedAborted--------0.0000.000-0.0000.000
stdio.v0.12.0------OK------------3.218------
stdio.v0.13.0--------AbortedOK-AbortedAborted--------0.0004.661-0.0000.000
stdlib-shims.0.1.0------OK-AbortedOK-AbortedAborted------1.219-0.00020.885-0.0000.000
stringext.1.6.0OK-----OK-AbortedOK-AbortedAborted15.766-----36.243-0.00022.015-0.0000.000
textutils.v0.12.0------OK------------9.021------
textutils.v0.13.0--------AbortedAborted-AbortedAborted--------0.0000.000-0.0000.000
textutils.v0.9.0OK------------5.561------------
textutils_kernel.v0.12.0------OK------------12.411------
thread-bench.1.0Failure (2)-----Failure (2)-AbortedAborted-AbortedAborted0.279-----2.131-0.0000.000-0.0000.000
time_now.v0.12.0------OK------------10.096------
time_now.v0.13.0--------AbortedAborted-AbortedAborted--------0.0000.000-0.0000.000
topkg.1.0.1---------Failure (2)-AbortedAborted---------0.401-0.0000.000
typerep.v0.12.0------OK------------3.174------
typerep.v0.13.0--------AbortedOK-AbortedAborted--------0.0005.281-0.0000.000
uchar.0.0.2-----------AbortedAborted-----------0.0000.000
uri.1.9.7OK------------6.676------------
uri.3.1.0------OK-AbortedOK-AbortedAborted------11.036-0.0003.149-0.0000.000
uri-sexp.3.1.0------OK-AbortedAborted-AbortedAborted------5.625-0.0000.000-0.0000.000
uutf.1.0.2---------Aborted-AbortedAborted---------0.000-0.0000.000
valet-bench.1.0Failure (2)------------0.329------------
variantslib.v0.12.0------OK------------3.105------
variantslib.v0.13.0--------AbortedOK-AbortedAborted--------0.0006.274-0.0000.000
variantslib.v0.9.0OK------------5.651------------
why3.1.3.0------OK------------42.350------
yojson.1.7.0OK-----OK-AbortedOK-AbortedAborted10.811-----10.477-0.0002.702-0.0000.000
yojson-bench.1.0Failure (2)-----Failure (2)-AbortedFailure (2)-AbortedAborted0.173-----0.713-0.0000.243-0.0000.000
zarith.1.9.1-----------AbortedAborted-----------0.0000.000
Close

Error on yojson-bench.1.0 (4.08.0+trunk+bench)

Command:

/usr/bin/make -C yojson

Output

make: Entering directory '/home/louis/.opam/4.08.0+trunk+bench/.opam-switch/build/yojson-bench.1.0/yojson'
ocamlfind ocamlopt -I `ocamlfind query yojson` -o ydump_bench -package easy-format,biniou -linkpkg yojson.cmx yojson_biniou.cmx ydump.ml
gcc: error: /home/louis/.opam/4.08.0+trunk+bench/lib/yojson/yojson_biniou.o: No such file or directory
gcc: error: /home/louis/.opam/4.08.0+trunk+bench/lib/yojson/yojson.o: No such file or directory
File "caml_startup", line 1:
Error: Error during linking
Makefile:6: recipe for target 'all' failed
make: *** [all] Error 2
make: Leaving directory '/home/louis/.opam/4.08.0+trunk+bench/.opam-switch/build/yojson-bench.1.0/yojson'
Close

Error on yojson-bench.1.0 (4.07.1+oclassic+bench)

Command:

/usr/bin/make -C yojson

Output

make: Entering directory '/home/louis/.opam/4.07.1+oclassic+bench/.opam-switch/build/yojson-bench.1.0/yojson'
ocamlfind ocamlopt -I `ocamlfind query yojson` -o ydump_bench -package easy-format,biniou -linkpkg yojson.cmx yojson_biniou.cmx ydump.ml
gcc: error: /home/louis/.opam/4.07.1+oclassic+bench/lib/yojson/yojson_biniou.o: No such file or directory
gcc: error: /home/louis/.opam/4.07.1+oclassic+bench/lib/yojson/yojson.o: No such file or directory
File "caml_startup", line 1:
Error: Error during linking
Makefile:6: recipe for target 'all' failed
make: *** [all] Error 2
make: Leaving directory '/home/louis/.opam/4.07.1+oclassic+bench/.opam-switch/build/yojson-bench.1.0/yojson'
Close

Error on yojson-bench.1.0 (4.03.1+bench)

Command:

/usr/bin/make -C yojson

Output

make: Entering directory '/home/louis/.opam/4.03.1+bench/.opam-switch/build/yojson-bench.1.0/yojson'
ocamlfind ocamlopt -I `ocamlfind query yojson` -o ydump_bench -package easy-format,biniou -linkpkg yojson.cmx yojson_biniou.cmx ydump.ml
gcc: error: /home/louis/.opam/4.03.1+bench/lib/yojson/yojson_biniou.o: No such file or directory
gcc: error: /home/louis/.opam/4.03.1+bench/lib/yojson/yojson.o: No such file or directory
File "caml_startup", line 1:
Error: Error during linking
Makefile:6: recipe for target 'all' failed
make: *** [all] Error 2
make: Leaving directory '/home/louis/.opam/4.03.1+bench/.opam-switch/build/yojson-bench.1.0/yojson'
Close

Error on valet-bench.1.0 (4.03.1+bench)

Command:

/usr/bin/make -C valet

Output

make: Entering directory '/home/louis/.opam/4.03.1+bench/.opam-switch/build/valet-bench.1.0/valet'
ocamlbuild -use-ocamlfind test_lwt.native test_async.native
ocamlfind ocamldep -package react -package uuidm -package unix -package ocplib-endian -package lwt.unix -modules test_lwt.ml > test_lwt.ml.depends
ocamlfind ocamldep -package react -package uuidm -package ocplib-endian -modules test_lib.ml > test_lib.ml.depends
ocamlfind ocamldep -package uuidm -package unix -package ocplib-endian -modules valet_core.ml > valet_core.ml.depends
ocamlfind ocamldep -package react -package uuidm -package ocplib-endian -modules valet_react.ml > valet_react.ml.depends
ocamlfind ocamlc -c -g -bin-annot -package uuidm -package unix -package ocplib-endian -o valet_core.cmo valet_core.ml
ocamlfind ocamlc -c -g -bin-annot -package react -package uuidm -package ocplib-endian -o valet_react.cmo valet_react.ml
ocamlfind ocamlc -c -g -bin-annot -package react -package uuidm -package ocplib-endian -o test_lib.cmo test_lib.ml
ocamlfind ocamlc -c -g -bin-annot -package react -package uuidm -package unix -package ocplib-endian -package lwt.unix -o test_lwt.cmo test_lwt.ml
+ ocamlfind ocamlc -c -g -bin-annot -package react -package uuidm -package unix -package ocplib-endian -package lwt.unix -o test_lwt.cmo test_lwt.ml
ocamlfind: [WARNING] Package `threads': Linking problems may arise because of the missing -thread or -vmthread switch
ocamlfind ocamlopt -c -g -bin-annot -package uuidm -package unix -package ocplib-endian -o valet_core.cmx valet_core.ml
ocamlfind ocamlopt -c -g -bin-annot -package react -package uuidm -package ocplib-endian -o valet_react.cmx valet_react.ml
ocamlfind ocamlopt -c -g -bin-annot -package react -package uuidm -package ocplib-endian -o test_lib.cmx test_lib.ml
ocamlfind ocamlopt -c -g -bin-annot -package react -package uuidm -package unix -package ocplib-endian -package lwt.unix -o test_lwt.cmx test_lwt.ml
+ ocamlfind ocamlopt -c -g -bin-annot -package react -package uuidm -package unix -package ocplib-endian -package lwt.unix -o test_lwt.cmx test_lwt.ml
ocamlfind: [WARNING] Package `threads': Linking problems may arise because of the missing -thread or -vmthread switch
ocamlfind ocamlopt -linkpkg -g -package react -package uuidm -package unix -package ocplib-endian -package lwt.unix valet_core.cmx valet_react.cmx test_lib.cmx test_lwt.cmx -o test_lwt.native
+ ocamlfind ocamlopt -linkpkg -g -package react -package uuidm -package unix -package ocplib-endian -package lwt.unix valet_core.cmx valet_react.cmx test_lib.cmx test_lwt.cmx -o test_lwt.native
ocamlfind: [WARNING] Package `threads': Linking problems may arise because of the missing -thread or -vmthread switch
File "_none_", line 1:
Error: No implementations provided for the following modules:
         Mutex referenced from /home/louis/.opam/4.03.1+bench/lib/lwt/unix/lwt_unix.cmxa(Lwt_main)
Command exited with code 2.
Makefile:6: recipe for target 'all' failed
make: *** [all] Error 10
make: Leaving directory '/home/louis/.opam/4.03.1+bench/.opam-switch/build/valet-bench.1.0/valet'
Close

Error on topkg.1.0.1 (4.08.0+trunk+bench)

Command:

~/.opam/4.08.0+trunk+bench/bin/ocaml pkg/pkg.ml build --pkg-name topkg --dev-pkg false

Output

File "src/topkg_log.ml", line 7, characters 5-17:
7 | open Topkg_result
         ^^^^^^^^^^^^
Error: Unbound module Topkg_result
File "src/topkg_fpath.ml", line 10, characters 2-24:
10 |   Topkg_string.is_prefix Filename.dir_sep s ||
       ^^^^^^^^^^^^^^^^^^^^^^
Error: Unbound module Topkg_string
File "src/topkg_os.ml", line 7, characters 5-17:
7 | open Topkg_result
         ^^^^^^^^^^^^
Error: Unbound module Topkg_result
File "src/topkg_vcs.ml", line 7, characters 5-17:
7 | open Topkg_result
         ^^^^^^^^^^^^
Error: Unbound module Topkg_result
File "src/topkg_codec.ml", line 7, characters 5-17:
7 | open Topkg_result
         ^^^^^^^^^^^^
Error: Unbound module Topkg_result
File "src/topkg_conf.ml", line 7, characters 5-17:
7 | open Topkg_result
         ^^^^^^^^^^^^
Error: Unbound module Topkg_result
File "src/topkg_fexts.ml", line 22, characters 16-40:
22 |   let ext_obj = Topkg_conf.OCaml.ext_obj c in
                     ^^^^^^^^^^^^^^^^^^^^^^^^
Error: Unbound module Topkg_conf
File "src/topkg_opam.ml", line 7, characters 5-17:
7 | open Topkg_result
         ^^^^^^^^^^^^
Error: Unbound module Topkg_result
File "src/topkg_test.ml", line 8, characters 11-24:
8 |   { exec : Topkg_fpath.t;
               ^^^^^^^^^^^^^
Error: Unbound module Topkg_fpath
File "src/topkg_install.ml", line 7, characters 5-17:
7 | open Topkg_result
         ^^^^^^^^^^^^
Error: Unbound module Topkg_result
File "src/topkg_build.ml", line 7, characters 5-17:
7 | open Topkg_result
         ^^^^^^^^^^^^
Error: Unbound module Topkg_result
File "src/topkg_distrib.ml", line 7, characters 5-17:
7 | open Topkg_result
         ^^^^^^^^^^^^
Error: Unbound module Topkg_result
File "src/topkg_publish.ml", line 7, characters 5-17:
7 | open Topkg_result
         ^^^^^^^^^^^^
Error: Unbound module Topkg_result
File "src/topkg_pkg.ml", line 7, characters 5-17:
7 | open Topkg_result
         ^^^^^^^^^^^^
Error: Unbound module Topkg_result
File "src/topkg_ipc.ml", line 7, characters 5-17:
7 | open Topkg_result
         ^^^^^^^^^^^^
Error: Unbound module Topkg_result
File "src/topkg_main.ml", line 7, characters 5-17:
7 | open Topkg_result
         ^^^^^^^^^^^^
Error: Unbound module Topkg_result
File "src/topkg.ml", line 9, characters 8-20:
9 | include Topkg_result
            ^^^^^^^^^^^^
Error: Unbound module Topkg_result
File "./pkg/pkg.ml", line 27, characters 5-10:
27 | open Topkg
          ^^^^^
Error: Unbound module Topkg
Close

Error on thread-bench.1.0 (4.07.1+oclassic+bench)

Command:

/usr/bin/make -C thread

Output

make: Entering directory '/home/louis/.opam/4.07.1+oclassic+bench/.opam-switch/build/thread-bench.1.0/thread'
ocamlfind ocamlopt -package lwt.unix -linkpkg -o thread_sleep_lwt thread_sleep_lwt.ml
ocamlfind: [WARNING] Package `threads': Linking problems may arise because of the missing -thread or -vmthread switch
File "thread_sleep_lwt.ml", line 1:
Error: No implementations provided for the following modules:
         Mutex referenced from /home/louis/.opam/4.07.1+oclassic+bench/lib/lwt/unix/lwt_unix.cmxa(Lwt_main)
Makefile:7: recipe for target 'thread_sleep_lwt' failed
make: *** [thread_sleep_lwt] Error 2
make: Leaving directory '/home/louis/.opam/4.07.1+oclassic+bench/.opam-switch/build/thread-bench.1.0/thread'
Close

Error on thread-bench.1.0 (4.03.1+bench)

Command:

/usr/bin/make -C thread

Output

make: Entering directory '/home/louis/.opam/4.03.1+bench/.opam-switch/build/thread-bench.1.0/thread'
ocamlfind ocamlopt -package lwt.unix -linkpkg -o thread_sleep_lwt thread_sleep_lwt.ml
ocamlfind: [WARNING] Package `threads': Linking problems may arise because of the missing -thread or -vmthread switch
File "thread_sleep_lwt.ml", line 1:
Error: No implementations provided for the following modules:
         Mutex referenced from /home/louis/.opam/4.03.1+bench/lib/lwt/unix/lwt_unix.cmxa(Lwt_main)
Makefile:7: recipe for target 'thread_sleep_lwt' failed
make: *** [thread_sleep_lwt] Error 2
make: Leaving directory '/home/louis/.opam/4.03.1+bench/.opam-switch/build/thread-bench.1.0/thread'
Close

Error on ocaml-variants.4.08.0+trunk+flambda+opt (4.08.0+trunk+flambda+opt+bench)

Command:

~/.opam/4.08.0+trunk+flambda+opt+bench/.opam-switch/build/ocaml-variants.4.08.0+trunk+flambda+opt/./configure -prefix /home/louis/.opam/4.08.0+trunk+flambda+opt+bench -flambda -with-debug-runtime

Output

configure: error: unrecognized option: `-flambda'
Try `/home/louis/.opam/4.08.0+trunk+flambda+opt+bench/.opam-switch/build/ocaml-variants.4.08.0+trunk+flambda+opt/./configure --help' for more information
Close

Error on ocaml-variants.4.08.0+trunk+flambda+oclassic (4.08.0+trunk+flambda+oclassic+bench)

Command:

~/.opam/4.08.0+trunk+flambda+oclassic+bench/.opam-switch/build/ocaml-variants.4.08.0+trunk+flambda+oclassic/./configure -prefix /home/louis/.opam/4.08.0+trunk+flambda+oclassic+bench -flambda -with-debug-runtime

Output

configure: error: unrecognized option: `-flambda'
Try `/home/louis/.opam/4.08.0+trunk+flambda+oclassic+bench/.opam-switch/build/ocaml-variants.4.08.0+trunk+flambda+oclassic/./configure --help' for more information
Close

Error on ocaml-migrate-parsetree.1.6.0 (4.08.0+trunk+bench)

Command:

~/.opam/4.08.0+trunk+bench/bin/dune build -p ocaml-migrate-parsetree -j 7

Output

       ocaml src/ast-version,src/compiler-functions-file (exit 1)
(cd _build/default/src && /home/louis/.opam/4.08.0+trunk+bench/bin/ocaml config/gen.ml 4.11.0+dev0-2019-10-18)
Unkown OCaml version 4.11.0+dev0-2019-10-18
Close

Error on numerical-analysis-bench.1.0 (4.08.0+trunk+bench)

Command:

/usr/bin/make

Output

ulimit -s 98304; ocamlopt.opt  -I simple_access `ocamldep.opt -sort simple_access/*.ml` main_nogcstats.ml -o simple_access.opt
ulimit -s 98304; ocamlopt.opt  -I lu-decomposition `ocamldep.opt -sort lu-decomposition/*.ml` main_nogcstats.ml -o lu-decomposition.opt
ulimit -s 98304; ocamlopt.opt  -I fft `ocamldep.opt -sort fft/*.ml` main_nogcstats.ml -o fft.opt
ulimit -s 98304; ocamlopt.opt  -I rnd_access `ocamldep.opt -sort rnd_access/*.ml` main_nogcstats.ml -o rnd_access.opt
ulimit -s 98304; ocamlopt.opt  -I k-means `ocamldep.opt -sort k-means/*.ml` main_nogcstats.ml -o k-means.opt
Fatal error: exception Stack overflow
Makefile:20: recipe for target 'k-means.opt' failed
make: *** [k-means.opt] Error 2
Close

Error on dune.2.4.0 (4.08.0+mutmatch+bench)

Command:

~/.opam/4.08.0+mutmatch+bench/bin/ocaml bootstrap.ml -j 7

Output

ocamlc -custom -w -24 -g -o .duneboot.exe -I boot unix.cma boot/libs.ml boot/duneboot.ml
./.duneboot.exe -j 7
cd _boot && /home/louis/.opam/4.08.0+mutmatch+bench/bin/ocamldep.opt -modules -map main__.ml -map build_info__.ml -map dune.ml -map dune_action_plugin__.ml -map jbuild_support.ml -map dune_glob__.ml -map dune_re__.ml -map cache_daemon__.ml -map cache__.ml -map dune_util.ml -map memo__.ml -map dag__.ml -map incremental_cycles__.ml -map dune_lang__.ml -map stdune__.ml -args source_files
File "src/stdune/result.ml", line 63, characters 8-11:
Error: Syntax error: operator expected.
File "src/stdune/daemonize.ml", line 83, characters 11-13:
Error: Syntax error: operator expected.
File "src/stdune/loc.ml", line 51, characters 7-8:
Error: Syntax error
File "src/stdune/applicative.ml", line 5, characters 10-13:
Error: Syntax error: operator expected.
File "src/stdune/applicative_intf.ml", line 17, characters 10-13:
Error: Syntax error: operator expected.
File "src/stdune/csexp.ml", line 93, characters 5-6:
Error: Syntax error
File "src/stdune/option.mli", line 12, characters 8-11:
Error: Syntax error: operator expected.
File "src/stdune/result.mli", line 29, characters 8-11:
Error: Syntax error: operator expected.
File "src/stdune/option.ml", line 16, characters 8-11:
Error: Syntax error: operator expected.
File "src/dune_lang/syntax.ml", line 156, characters 9-16:
Error: Syntax error
File "src/dune_lang/decoder.mli", line 235, characters 6-9:
Error: Syntax error: operator expected.
File "src/dune_lang/versioned_file.ml", line 107, characters 7-8:
Error: Syntax error
File "src/dune_lang/decoder.ml", line 98, characters 6-9:
Error: Syntax error: operator expected.
File "src/fiber/fiber.ml", line 198, characters 8-11:
Error: Syntax error: operator expected.
File "src/fiber/fiber.mli", line 37, characters 8-11:
Error: Syntax error: operator expected.
File "src/memo/memo.ml", line 121, characters 13-16:
Error: Syntax error: operator expected.
File "src/cache/local.ml", line 123, characters 11-16:
Error: Syntax error
File "src/cache/client.ml", line 23, characters 5-6:
Error: Syntax error
File "src/cache/messages.ml", line 97, characters 13-18:
Error: Syntax error
File "src/cache_daemon/cache_daemon.ml", line 135, characters 9-10:
Error: Syntax error
File "src/ocaml-config/ocaml_config.ml", line 307, characters 7-8:
Error: Syntax error
File "otherlibs/action-plugin/src/dune_action_plugin.ml", line 189, characters 10-13:
Error: Syntax error: operator expected.
File "otherlibs/action-plugin/src/protocol.ml", line 106, characters 11-12:
Error: Syntax error
File "otherlibs/action-plugin/src/dune_action_plugin.mli", line 52, characters 10-13:
Error: Syntax error: operator expected.
File "otherlibs/action-plugin/src/serializable_intf.ml", line 40, characters 7-8:
Error: Syntax error
File "src/dune/stringlike.ml", line 49, characters 13-14:
Error: Syntax error: operator expected.
File "src/dune/dep_conf.ml", line 28, characters 7-8:
Error: Syntax error
File "src/dune/dune_init.ml", line 86, characters 9-10:
Error: Syntax error: operator expected.
File "src/dune/obj_dir.ml", line 64, characters 12-23:
Error: Syntax error: operator expected.
File "src/dune/ocamldep.ml", line 106, characters 11-16:
Error: Syntax error
File "src/dune/ordered_set_lang.ml", line 90, characters 13-22:
Error: Syntax error
File "src/dune/super_context.ml", line 86, characters 7-8:
Error: Syntax error
File "src/dune/module.ml", line 274, characters 10-14:
Error: Syntax error: operator expected.
File "src/dune/lib_info.ml", line 25, characters 12-15:
Error: Syntax error: operator expected.
File "src/dune/vcs.ml", line 47, characters 12-16:
Error: Syntax error: operator expected.
File "src/dune/dialect.ml", line 42, characters 9-12:
Error: Syntax error
File "src/dune/sub_system.ml", line 40, characters 7-8:
Error: Syntax error
File "src/dune/simple_rules.ml", line 200, characters 17-18:
Error: Syntax error: operator expected.
File "src/dune/findlib/findlib.ml", line 427, characters 11-12:
Error: Syntax error: operator expected.
File "src/dune/format_config.ml", line 54, characters 9-17:
Error: Syntax error
File "src/dune/dune_load.ml", line 183, characters 11-12:
Error: Syntax error: operator expected.
File "src/dune/predicate_lang.ml", line 38, characters 9-10:
Error: Syntax error
File "src/dune/ocaml_stdlib.ml", line 21, characters 10-31:
Error: Syntax error: operator expected.
File "src/dune/stats.ml", line 62, characters 9-15:
Error: Syntax error
File "src/dune/lib.ml", line 379, characters 9-13:
Error: Syntax error: operator expected.
File "src/dune/context.ml", line 201, characters 7-8:
Error: Syntax error
File "src/dune/file_tree.ml", line 442, characters 9-10:
Error: Syntax error
File "src/dune/dep_graph.ml", line 25, characters 7-17:
Error: Syntax error
File "src/dune/expander.ml", line 136, characters 9-22:
Error: Syntax error: operator expected.
File "src/dune/case_lang.ml", line 12, characters 10-11:
Error: Syntax error: operator expected.
File "src/dune/module_compilation.ml", line 27, characters 7-11:
Error: Syntax error
File "src/dune/mode.ml", line 129, characters 14-18:
Error: Syntax error: operator expected.
File "src/dune/install_rules.ml", line 232, characters 13-14:
Error: Syntax error: operator expected.
File "src/dune/artifact_substitution.ml", line 333, characters 11-12:
Error: Syntax error: operator expected.
File "src/dune/dune_file.ml", line 33, characters 8-9:
Error: Syntax error: operator expected.
File "src/dune/lib_kind.ml", line 17, characters 9-10:
Error: Syntax error
File "src/dune/pform.ml", line 382, characters 7-8:
Error: Syntax error
File "src/dune/action_exec.ml", line 138, characters 7-8:
Error: Syntax error
File "src/dune/workspace.ml", line 88, characters 11-14:
Error: Syntax error
File "src/dune/string_with_vars.ml", line 40, characters 7-21:
Error: Syntax error
File "src/dune/wrapped.ml", line 14, characters 17-18:
Error: Syntax error: operator expected.
File "src/dune/foreign.ml", line 94, characters 5-6:
Error: Syntax error
File "src/dune/build.mli", line 36, characters 10-13:
Error: Syntax error: operator expected.
File "src/dune/preprocessing.ml", line 150, characters 16-19:
Error: Syntax error: operator expected.
File "src/dune/process.ml", line 451, characters 5-6:
Error: Syntax error
File "src/dune/config.ml", line 248, characters 7-14:
Error: Syntax error
File "src/dune/gen_rules.ml", line 236, characters 11-18:
Error: Syntax error
File "src/dune/file_binding.ml", line 65, characters 13-20:
Error: Syntax error
File "src/dune/odoc.ml", line 157, characters 10-14:
Error: Syntax error: operator expected.
File "src/dune/dpath.ml", line 153, characters 9-18:
Error: Syntax error
File "src/dune/dune_env.ml", line 13, characters 9-10:
Error: Syntax error
File "src/dune/dune_package.ml", line 111, characters 10-11:
Error: Syntax error: operator expected.
File "src/dune/modules.ml", line 48, characters 12-28:
Error: Syntax error: operator expected.
File "src/dune/foreign_rules.ml", line 166, characters 16-17:
Error: Syntax error: operator expected.
File "src/dune/sub_dirs.ml", line 145, characters 11-12:
Error: Syntax error
File "src/dune/cinaps.ml", line 26, characters 10-13:
Error: Syntax error: operator expected.
File "src/dune/diff.ml", line 22, characters 7-12:
Error: Syntax error
File "src/dune/alias.ml", line 68, characters 7-8:
Error: Syntax error
File "src/dune/opam_create.ml", line 157, characters 10-18:
Error: Syntax error: operator expected.
File "src/dune/dune_project.ml", line 367, characters 11-12:
Error: Syntax error
File "src/dune/print_diff.ml", line 45, characters 7-8:
Error: Syntax error
File "src/dune/mdx.ml", line 27, characters 9-10:
Error: Syntax error
File "src/dune/ml_sources.ml", line 257, characters 13-14:
Error: Syntax error: operator expected.
File "src/dune/merlin.ml", line 140, characters 9-10:
Error: Syntax error: operator expected.
File "src/dune/utop.ml", line 26, characters 5-6:
Error: Syntax error: operator expected.
File "src/dune/link_time_code_gen.ml", line 174, characters 7-15:
Error: Syntax error
File "src/dune/dep_rules.ml", line 29, characters 12-13:
Error: Syntax error: operator expected.
File "src/dune/bindings.ml", line 40, characters 7-8:
Error: Syntax error
File "src/dune/build.ml", line 50, characters 8-11:
Error: Syntax error: operator expected.
File "src/dune/format_rules.ml", line 49, characters 11-12:
Error: Syntax error
File "src/dune/scheduler.ml", line 618, characters 7-8:
Error: Syntax error
File "src/dune/lib_dep.ml", line 14, characters 12-13:
Error: Syntax error: operator expected.
File "src/dune/module_name.ml", line 95, characters 9-10:
Error: Syntax error
File "src/dune/action_ast.ml", line 57, characters 19-23:
Error: Syntax error: operator expected.
File "src/dune/package.ml", line 44, characters 7-8:
Error: Syntax error
File "src/dune/main.ml", line 62, characters 7-15:
Error: Syntax error
File "src/dune/foreign_sources.ml", line 91, characters 13-14:
Error: Syntax error: operator expected.
File "src/dune/artifacts.ml", line 63, characters 9-12:
Error: Syntax error
File "src/dune/watermarks.ml", line 167, characters 15-18:
Error: Syntax error
File "src/dune/ocaml_flags.ml", line 81, characters 9-15:
Error: Syntax error
File "src/dune/exe_rules.ml", line 99, characters 9-14:
Error: Syntax error
File "src/dune/blang.ml", line 77, characters 15-16:
Error: Syntax error: operator expected.
File "src/dune/build_system.ml", line 125, characters 11-19:
Error: Syntax error
File "src/dune/inline_tests.ml", line 34, characters 16-19:
Error: Syntax error: operator expected.
File "bin/external_lib_deps.ml", line 117, characters 7-13:
Error: Syntax error
File "bin/install_uninstall.ml", line 18, characters 7-8:
Error: Syntax error
File "bin/format_dune_file.ml", line 19, characters 7-15:
Error: Syntax error
File "bin/init.ml", line 41, characters 5-6:
Error: Syntax error
File "bin/help.ml", line 109, characters 10-20:
Error: Syntax error
File "bin/installed_libraries.ml", line 9, characters 7-13:
Error: Syntax error
File "bin/printenv.ml", line 16, characters 7-10:
Error: Syntax error
File "bin/describe.ml", line 149, characters 12-13:
Error: Syntax error
File "bin/common.ml", line 11, characters 8-11:
Error: Syntax error: operator expected.
File "bin/exec.ml", line 36, characters 7-13:
Error: Syntax error
File "bin/subst.ml", line 61, characters 7-8:
Error: Syntax error
File "bin/compute.ml", line 19, characters 10-16:
Error: Syntax error
File "bin/caching.ml", line 59, characters 7-8:
Error: Syntax error
File "bin/utop.ml", line 17, characters 7-13:
Error: Syntax error
File "bin/print_rules.ml", line 77, characters 9-17:
Error: Syntax error
File "bin/import.ml", line 83, characters 7-8:
Error: Syntax error
File "bin/upgrade.ml", line 17, characters 7-13:
Error: Syntax error
File "bin/main.ml", line 7, characters 7-8:
Error: Syntax error
File "bin/common.mli", line 69, characters 8-11:
Error: Syntax error: operator expected.


Close

Error on core-micro-bench.1.0 (4.07.1+oclassic+bench)

Command:

/usr/bin/make -C core_micro

Output

make: Entering directory '/home/louis/.opam/4.07.1+oclassic+bench/.opam-switch/build/core-micro-bench.1.0/core_micro'
ocamlbuild -use-ocamlfind runner.native
ocamlfind ocamldep -package str -package core -package core_bench.inline_benchmarks -modules runner.ml > runner.ml.depends
ocamlfind ocamlc -c -thread -package str -package core -package core_bench.inline_benchmarks -o runner.cmo runner.ml
+ ocamlfind ocamlc -c -thread -package str -package core -package core_bench.inline_benchmarks -o runner.cmo runner.ml
File "runner.ml", line 1, characters 5-13:
Error: Unbound module Core.Std
Command exited with code 2.
Makefile:4: recipe for target 'all' failed
make: *** [all] Error 10
make: Leaving directory '/home/louis/.opam/4.07.1+oclassic+bench/.opam-switch/build/core-micro-bench.1.0/core_micro'
Close

Error on core-micro-bench.1.0 (4.03.1+bench)

Command:

/usr/bin/make -C core_micro

Output

make: Entering directory '/home/louis/.opam/4.03.1+bench/.opam-switch/build/core-micro-bench.1.0/core_micro'
ocamlbuild -use-ocamlfind runner.native
ocamlfind ocamldep -package str -package core -package core_bench.inline_benchmarks -modules runner.ml > runner.ml.depends
ocamlfind ocamlc -c -thread -package str -package core -package core_bench.inline_benchmarks -o runner.cmo runner.ml
+ ocamlfind ocamlc -c -thread -package str -package core -package core_bench.inline_benchmarks -o runner.cmo runner.ml
File "runner.ml", line 1, characters 5-13:
Warning 3: deprecated: module Core.Std
[since 2017-02] Use Core. The Std sub-module is no longer needed
File "runner.ml", line 3, characters 15-55:
Error: Unbound module Pa_bench_lib
Command exited with code 2.
Makefile:4: recipe for target 'all' failed
make: *** [all] Error 10
make: Leaving directory '/home/louis/.opam/4.03.1+bench/.opam-switch/build/core-micro-bench.1.0/core_micro'
Close

Error on conf-graphviz.0.1 (4.07.1+oclassic+bench)

Command:

/usr/bin/which dot

Output


Close

Error on conf-graphviz.0.1 (4.03.1+bench)

Command:

/usr/bin/which dot

Output


Close

Error on cohttp-bench.1.0 (4.07.1+oclassic+bench)

Command:

/usr/bin/make -C cohttp

Output

make: Entering directory '/home/louis/.opam/4.07.1+oclassic+bench/.opam-switch/build/cohttp-bench.1.0/cohttp'
ocamlbuild -use-ocamlfind cohttp_lwt_bench.native cohttp_async_bench.native
ocamlfind ocamldep -package lwt.unix -package cohttp.lwt -modules cohttp_lwt_bench.ml > cohttp_lwt_bench.ml.depends
+ ocamlfind ocamldep -package lwt.unix -package cohttp.lwt -modules cohttp_lwt_bench.ml > cohttp_lwt_bench.ml.depends
ocamlfind: Package `cohttp.lwt' not found
Command exited with code 2.
Makefile:6: recipe for target 'all' failed
make: *** [all] Error 10
make: Leaving directory '/home/louis/.opam/4.07.1+oclassic+bench/.opam-switch/build/cohttp-bench.1.0/cohttp'
Close

Error on cohttp-bench.1.0 (4.03.1+bench)

Command:

/usr/bin/make -C cohttp

Output

make: Entering directory '/home/louis/.opam/4.03.1+bench/.opam-switch/build/cohttp-bench.1.0/cohttp'
ocamlbuild -use-ocamlfind cohttp_lwt_bench.native cohttp_async_bench.native
ocamlfind ocamldep -package lwt.unix -package cohttp.lwt -modules cohttp_lwt_bench.ml > cohttp_lwt_bench.ml.depends
+ ocamlfind ocamldep -package lwt.unix -package cohttp.lwt -modules cohttp_lwt_bench.ml > cohttp_lwt_bench.ml.depends
ocamlfind: Package `cohttp-lwt-unix' not found - required by `cohttp.lwt'
Command exited with code 2.
Makefile:6: recipe for target 'all' failed
make: *** [all] Error 10
make: Leaving directory '/home/louis/.opam/4.03.1+bench/.opam-switch/build/cohttp-bench.1.0/cohttp'
Close

Error on chameneos-bench.1.0 (4.07.1+oclassic+bench)

Command:

/usr/bin/make -C chameneos-redux

Output

make: Entering directory '/home/louis/.opam/4.07.1+oclassic+bench/.opam-switch/build/chameneos-bench.1.0/chameneos-redux'
ocamlopt -bin-annot -thread unix.cmxa threads.cmxa chameneos_redux_th.ml -o chameneos_redux_th
ocamlopt -bin-annot -thread unix.cmxa threads.cmxa chameneos_redux_evtchn.ml -o chameneos_redux_evtchn
ocamlfind ocamlopt -bin-annot -package lwt.unix -linkpkg chameneos_redux_lwt.ml -o chameneos_redux_lwt
ocamlfind: [WARNING] Package `threads': Linking problems may arise because of the missing -thread or -vmthread switch
File "chameneos_redux_lwt.ml", line 1:
Error: No implementations provided for the following modules:
         Mutex referenced from /home/louis/.opam/4.07.1+oclassic+bench/lib/lwt/unix/lwt_unix.cmxa(Lwt_main)
Makefile:6: recipe for target 'chameneos_redux_lwt' failed
make: *** [chameneos_redux_lwt] Error 2
make: Leaving directory '/home/louis/.opam/4.07.1+oclassic+bench/.opam-switch/build/chameneos-bench.1.0/chameneos-redux'
Close

Error on chameneos-bench.1.0 (4.03.1+bench)

Command:

/usr/bin/make -C chameneos-redux

Output

make: Entering directory '/home/louis/.opam/4.03.1+bench/.opam-switch/build/chameneos-bench.1.0/chameneos-redux'
ocamlopt -bin-annot -thread unix.cmxa threads.cmxa chameneos_redux_th.ml -o chameneos_redux_th
ocamlopt -bin-annot -thread unix.cmxa threads.cmxa chameneos_redux_evtchn.ml -o chameneos_redux_evtchn
ocamlfind ocamlopt -bin-annot -package lwt.unix -linkpkg chameneos_redux_lwt.ml -o chameneos_redux_lwt
ocamlfind: [WARNING] Package `threads': Linking problems may arise because of the missing -thread or -vmthread switch
File "chameneos_redux_lwt.ml", line 1:
Error: No implementations provided for the following modules:
         Mutex referenced from /home/louis/.opam/4.03.1+bench/lib/lwt/unix/lwt_unix.cmxa(Lwt_main)
Makefile:6: recipe for target 'chameneos_redux_lwt' failed
make: *** [chameneos_redux_lwt] Error 2
make: Leaving directory '/home/louis/.opam/4.03.1+bench/.opam-switch/build/chameneos-bench.1.0/chameneos-redux'
Close

Error on async-rpc-bench.1.0 (4.07.1+oclassic+bench)

Command:

/usr/bin/make -C async_rpc

Output

make: Entering directory '/home/louis/.opam/4.07.1+oclassic+bench/.opam-switch/build/async-rpc-bench.1.0/async_rpc'
ocamlfind ocamlopt -thread -syntax camlp4o -package async -package bin_prot.syntax -package core -c rpc_common.ml
ocamlfind: Package `bin_prot.syntax' not found
Makefile:12: recipe for target 'rpc_common.cmx' failed
make: *** [rpc_common.cmx] Error 2
make: Leaving directory '/home/louis/.opam/4.07.1+oclassic+bench/.opam-switch/build/async-rpc-bench.1.0/async_rpc'
Close

Error on async-rpc-bench.1.0 (4.03.1+bench)

Command:

/usr/bin/make -C async_rpc

Output

make: Entering directory '/home/louis/.opam/4.03.1+bench/.opam-switch/build/async-rpc-bench.1.0/async_rpc'
ocamlfind ocamlopt -thread -syntax camlp4o -package async -package bin_prot.syntax -package core -c rpc_common.ml
ocamlfind: Package `bin_prot.syntax' not found
Makefile:12: recipe for target 'rpc_common.cmx' failed
make: *** [rpc_common.cmx] Error 2
make: Leaving directory '/home/louis/.opam/4.03.1+bench/.opam-switch/build/async-rpc-bench.1.0/async_rpc'
Close

Error on async-echo-bench.1.0 (4.07.1+oclassic+bench)

Command:

/usr/bin/make -C async_echo

Output

make: Entering directory '/home/louis/.opam/4.07.1+oclassic+bench/.opam-switch/build/async-echo-bench.1.0/async_echo'
ocamlfind ocamlopt -thread -syntax camlp4o -package async -package bin_prot.syntax -package core -c echo_common.ml
ocamlfind: Package `bin_prot.syntax' not found
Makefile:20: recipe for target 'echo_common.cmx' failed
make: *** [echo_common.cmx] Error 2
make: Leaving directory '/home/louis/.opam/4.07.1+oclassic+bench/.opam-switch/build/async-echo-bench.1.0/async_echo'
Close

Error on async-echo-bench.1.0 (4.03.1+bench)

Command:

/usr/bin/make -C async_echo

Output

make: Entering directory '/home/louis/.opam/4.03.1+bench/.opam-switch/build/async-echo-bench.1.0/async_echo'
ocamlfind ocamlopt -thread -syntax camlp4o -package async -package bin_prot.syntax -package core -c echo_common.ml
ocamlfind: Package `bin_prot.syntax' not found
Makefile:20: recipe for target 'echo_common.cmx' failed
make: *** [echo_common.cmx] Error 2
make: Leaving directory '/home/louis/.opam/4.03.1+bench/.opam-switch/build/async-echo-bench.1.0/async_echo'