Package4.03.1+bench4.05.0+flambda+opt+bench4.06.1+flambda+bench4.06.1+flambda+opt+bench4.07.1+clambda+bench4.07.1+flambda+bench4.07.1+oclassic+bench4.08.0+gpr2165+bench4.08.0+mutmatch+bench4.08.0+trunk+bench4.08.0+trunk+flambda+bench4.08.0+trunk+flambda+oclassic+bench4.08.0+trunk+flambda+opt+bench4.03.1+bench time (s)4.05.0+flambda+opt+bench time (s)4.06.1+flambda+bench time (s)4.06.1+flambda+opt+bench time (s)4.07.1+clambda+bench time (s)4.07.1+flambda+bench time (s)4.07.1+oclassic+bench time (s)4.08.0+gpr2165+bench time (s)4.08.0+mutmatch+bench time (s)4.08.0+trunk+bench time (s)4.08.0+trunk+flambda+bench time (s)4.08.0+trunk+flambda+oclassic+bench time (s)4.08.0+trunk+flambda+opt+bench time (s)
almabench-bench.1.0----------Aborted------------0.000--
alt-ergo.2.3.2-----OKOK---Aborted-------3.7412.780---0.000--
alt-ergo-lib.2.3.2-----OKOK---Aborted-------53.44149.133---0.000--
alt-ergo-parsers.2.3.2-----OKOK---Aborted-------9.4988.823---0.000--
async.v0.12.0-----OKOK-----------3.5223.104------
async.v0.13.0---------AbortedAborted-----------0.0000.000--
async-echo-bench.1.0-----Failure (2)Failure (2)--AbortedAborted-------0.6031.990--0.0000.000--
async-rpc-bench.1.0-----Failure (2)Failure (2)--AbortedAborted-------0.5291.917--0.0000.000--
async_extra.v0.12.0-----OKOK-----------5.0435.190------
async_kernel.v0.12.0-----OKOK-----------19.71815.851------
async_kernel.v0.13.0---------AbortedAborted-----------0.0000.000--
async_rpc_kernel.v0.12.0-----OKOK-----------13.79610.493------
async_rpc_kernel.v0.13.0---------AbortedAborted-----------0.0000.000--
async_unix.v0.12.0-----OKOK-----------20.30814.601------
async_unix.v0.13.0---------AbortedAborted-----------0.0000.000--
base.v0.12.2-----OKOK-----------13.92013.008------
base.v0.13.1---------OKAborted-----------11.1560.000--
base-bytes.base----------Aborted------------0.000--
base64.3.4.0-----OKOK--OKAborted-------6.1966.025--2.9460.000--
base_bigstring.v0.12.0-----OKOK-----------1.6444.341------
base_bigstring.v0.13.0---------AbortedAborted-----------0.0000.000--
base_quickcheck.v0.12.1-----OKOK-----------5.9397.704------
base_quickcheck.v0.13.0---------AbortedAborted-----------0.0000.000--
bdd-bench.1.0----------Aborted------------0.000--
bin_prot.v0.12.0-----OKOK-----------10.6129.430------
bin_prot.v0.13.0---------AbortedAborted-----------0.0000.000--
biniou.1.2.1-----OKOK--OKAborted-------29.12428.042--21.6220.000--
camlimages.5.0.1----------Aborted------------0.000--
camlpdf.2.3----------Aborted------------0.000--
camlzip.1.10----------Aborted------------0.000--
chameneos-bench.1.0-----Failure (2)Failure (2)--AbortedAborted-------0.5091.843--0.0000.000--
cohttp.2.4.0-----OKOK-----------9.0727.365------
cohttp.2.5.1---------AbortedAborted-----------0.0000.000--
cohttp-bench.1.0-----Failure (2)Failure (2)--AbortedAborted-------0.3141.717--0.0000.000--
conf-graphviz.0.1-----Failure (1)Failure (1)-----------0.1860.174------
configurator.v0.11.0-----OKOK--OKAborted-------2.4892.349--2.7080.000--
core.v0.12.4-----OKOK-----------35.00228.909------
core.v0.13.0---------AbortedAborted-----------0.0000.000--
core-micro-bench.1.0-----Failure (2)Failure (2)--AbortedAborted-------6.6121.539--0.0000.000--
core-sequence-bench.1.0-----OKOK--AbortedAborted-------0.0790.062--0.0000.000--
core_bench.v0.12.0-----OKOK-----------5.3579.726------
core_bench.v0.13.0---------AbortedAborted-----------0.0000.000--
core_extended.v0.12.0-----OKOK-----------7.0517.022------
core_kernel.v0.12.3-----OKOK-----------72.91842.391------
core_kernel.v0.13.1---------AbortedAborted-----------0.0000.000--
cpdf.2.3----------Aborted------------0.000--
cpdf-bench.1.0----------Aborted------------0.000--
cppo.1.6.6-----OKOK--OKAborted-------1.5601.376--1.2200.000--
dune.2.5.1-----OKOK--OKAborted-------20.32315.959--12.7740.000--
dune-configurator.2.5.1-----OKOK--OKAborted-------13.35913.289--9.3020.000--
dune-private-libs.2.5.1-----OKOK--OKAborted-------14.83314.387--5.8700.000--
easy-format.1.3.2-----OKOK--OKAborted-------0.3990.403--0.3660.000--
expect_test_helpers.v0.12.0-----OKOK-----------2.2312.212------
expect_test_helpers_kernel.v0.12.0-----OKOK-----------9.0699.956------
fieldslib.v0.12.0-----OKOK-----------0.7959.107------
fieldslib.v0.13.0---------OKAborted-----------0.2720.000--
frama-c.19.1-----OKOK-----------175.102111.721------
frama-c-bench.1.0-----OKOK-----------0.3550.395------
jane-street-headers.v0.12.0-----OKOK-----------0.2930.270------
jane-street-headers.v0.13.0---------OKAborted-----------0.2480.000--
jbuilder.1.0+beta20.2----------Aborted------------0.000--
json-bench-data.1.0----------Aborted------------0.000--
jsonm.1.0.1----------Aborted------------0.000--
jsonm-bench.1.0----------Aborted------------0.000--
jst-config.v0.12.0-----OKOK-----------12.34910.036------
jst-config.v0.13.0---------AbortedAborted-----------0.0000.000--
kb-bench.1.0----------Aborted------------0.000--
lexifi-g2pp-bench.1.0----------Aborted------------0.000--
lwt.5.3.0-----OKOK--OKAborted-------41.36336.713--8.5270.000--
menhir.20200211-----OKOK--OKAborted-------28.25926.769--20.8650.000--
menhir-bench.1.0-----OKOK--OKAborted-------0.2950.328--0.2270.000--
menhirLib.20200211-----OKOK--OKAborted-------1.5841.506--1.1760.000--
menhirSdk.20200211-----OKOK--OKAborted-------1.0470.599--0.7420.000--
minilight.1.6----------Aborted------------0.000--
minilight-bench.1.0----------Aborted------------0.000--
mmap.1.1.0-----OKOK--OKAborted-------0.6320.369--0.4160.000--
nbcodec.1.0----------Aborted------------0.000--
nbcodec-bench.1.0----------Aborted------------0.000--
num.1.3----------Aborted------------0.000--
numerical-analysis-bench.1.0---------Failure (2)Aborted-----------8.1960.000--
ocaml.4.08.0----------Aborted------------0.000--
ocaml-compiler-libs.v0.12.1-----OKOK--OKAborted-------2.1411.934--2.4490.000--
ocaml-migrate-parsetree.1.7.2-----OKOK--Failure (1)Aborted-------20.74519.860--5.5600.000--
ocaml-syntax-shims.1.0.0-----OKOK-----------2.1471.973------
ocaml-variants.4.08.0+trunk+flambda----------Failure (1)------------0.397--
ocamlbuild.0.14.0----------Aborted------------0.000--
ocamlfind.1.8.1----------Aborted------------0.000--
ocplib-endian.1.1-----OKOK--OKAborted-------29.22927.617--22.0840.000--
ocplib-simplex.0.4----------Aborted------------0.000--
octavius.1.2.2-----OKOK--OKAborted-------3.1802.691--3.4700.000--
parsexp.v0.12.0-----OKOK-----------13.6669.064------
parsexp.v0.13.0---------OKAborted-----------1.6860.000--
patdiff.v0.12.1-----OKOK-----------6.9665.964------
patdiff.v0.13.0---------AbortedAborted-----------0.0000.000--
patdiff-bench.1.0-----OKOK--AbortedAborted-------0.1830.187--0.0000.000--
patience_diff.v0.12.0-----OKOK-----------7.1137.044------
patience_diff.v0.13.0---------AbortedAborted-----------0.0000.000--
pcre.7.4.1-----OKOK-----------13.5449.027------
pcre.7.4.3---------OKAborted-----------2.5110.000--
ppx_assert.v0.12.0-----OKOK-----------13.07711.811------
ppx_assert.v0.13.0---------AbortedAborted-----------0.0000.000--
ppx_base.v0.12.0-----OKOK-----------14.69713.198------
ppx_base.v0.13.0---------AbortedAborted-----------0.0000.000--
ppx_bench.v0.12.0-----OKOK-----------9.63710.253------
ppx_bench.v0.13.0---------AbortedAborted-----------0.0000.000--
ppx_bin_prot.v0.12.1-----OKOK-----------6.0946.163------
ppx_bin_prot.v0.13.0---------AbortedAborted-----------0.0000.000--
ppx_cold.v0.13.0---------AbortedAborted-----------0.0000.000--
ppx_compare.v0.12.0-----OKOK-----------4.9195.292------
ppx_compare.v0.13.0---------AbortedAborted-----------0.0000.000--
ppx_custom_printf.v0.12.1-----OKOK-----------15.10413.402------
ppx_custom_printf.v0.13.0---------AbortedAborted-----------0.0000.000--
ppx_derivers.1.2.1-----OKOK--OKAborted-------0.5770.679--0.4870.000--
ppx_enumerate.v0.12.0-----OKOK-----------4.1055.076------
ppx_enumerate.v0.13.0---------AbortedAborted-----------0.0000.000--
ppx_expect.v0.12.0-----OKOK-----------12.72611.778------
ppx_expect.v0.13.0---------AbortedAborted-----------0.0000.000--
ppx_fail.v0.12.0-----OKOK-----------13.15812.882------
ppx_fail.v0.13.0---------AbortedAborted-----------0.0000.000--
ppx_fields_conv.v0.12.0-----OKOK-----------4.1264.928------
ppx_fields_conv.v0.13.0---------AbortedAborted-----------0.0000.000--
ppx_hash.v0.12.0-----OKOK-----------17.08615.023------
ppx_hash.v0.13.0---------AbortedAborted-----------0.0000.000--
ppx_here.v0.12.0-----OKOK-----------2.4934.785------
ppx_here.v0.13.0---------AbortedAborted-----------0.0000.000--
ppx_inline_test.v0.12.0-----OKOK-----------5.8597.001------
ppx_inline_test.v0.13.1---------AbortedAborted-----------0.0000.000--
ppx_jane.v0.12.0-----OKOK-----------2.1092.909------
ppx_jane.v0.13.0---------AbortedAborted-----------0.0000.000--
ppx_js_style.v0.12.0-----OKOK-----------6.1217.136------
ppx_js_style.v0.13.0---------AbortedAborted-----------0.0000.000--
ppx_let.v0.12.0-----OKOK-----------4.0483.656------
ppx_let.v0.13.0---------AbortedAborted-----------0.0000.000--
ppx_module_timer.v0.12.0-----OKOK-----------4.9338.728------
ppx_module_timer.v0.13.0---------AbortedAborted-----------0.0000.000--
ppx_optcomp.v0.12.0-----OKOK-----------2.3542.629------
ppx_optcomp.v0.13.0---------AbortedAborted-----------0.0000.000--
ppx_optional.v0.12.0-----OKOK-----------2.8693.972------
ppx_optional.v0.13.0---------AbortedAborted-----------0.0000.000--
ppx_pipebang.v0.12.0-----OKOK-----------7.31911.453------
ppx_pipebang.v0.13.0---------AbortedAborted-----------0.0000.000--
ppx_sexp_conv.v0.12.0-----OKOK-----------9.83512.335------
ppx_sexp_conv.v0.13.0---------AbortedAborted-----------0.0000.000--
ppx_sexp_message.v0.12.0-----OKOK-----------17.06014.951------
ppx_sexp_message.v0.13.0---------AbortedAborted-----------0.0000.000--
ppx_sexp_value.v0.12.0-----OKOK-----------19.23617.068------
ppx_sexp_value.v0.13.0---------AbortedAborted-----------0.0000.000--
ppx_stable.v0.12.0-----OKOK-----------18.66721.841------
ppx_stable.v0.13.0---------AbortedAborted-----------0.0000.000--
ppx_typerep_conv.v0.12.0-----OKOK-----------18.59321.593------
ppx_typerep_conv.v0.13.0---------AbortedAborted-----------0.0000.000--
ppx_variants_conv.v0.12.0-----OKOK-----------18.57620.831------
ppx_variants_conv.v0.13.0---------AbortedAborted-----------0.0000.000--
ppxlib.0.13.0---------AbortedAborted-----------0.0000.000--
ppxlib.0.8.1-----OKOK-----------13.63913.442------
protocol_version_header.v0.12.0-----OKOK-----------4.96812.191------
protocol_version_header.v0.13.0---------AbortedAborted-----------0.0000.000--
psmt2-frontend.0.2-----OKOK---Aborted-------50.50345.731---0.000--
re.1.9.0-----OKOK--OKAborted-------4.8835.197--17.5880.000--
re2.v0.12.1-----OKOK-----------67.43568.391------
result.1.5-----OKOK--OKAborted-------0.6620.700--0.6310.000--
sauvola-bench.1.0----------Aborted------------0.000--
seq.base----------Aborted------------0.000--
sequence-bench.1.0----------Aborted------------0.000--
sexp_pretty.v0.12.0-----OKOK-----------5.4055.340------
sexplib.v0.12.0-----OKOK-----------3.9154.164------
sexplib.v0.13.0---------OKAborted-----------2.1900.000--
sexplib0.v0.12.0-----OKOK-----------1.4342.233------
sexplib0.v0.13.0---------OKAborted-----------1.1250.000--
shell.v0.12.0-----OKOK-----------4.9103.961------
spawn.v0.13.0-----OKOK--OKAborted-------27.89926.936--0.8950.000--
splittable_random.v0.12.0-----OKOK-----------13.23912.630------
splittable_random.v0.13.0---------AbortedAborted-----------0.0000.000--
stdio.v0.12.0-----OKOK-----------13.4708.995------
stdio.v0.13.0---------OKAborted-----------0.8510.000--
stdlib-shims.0.1.0-----OKOK--OKAborted-------0.3310.734--20.9400.000--
stringext.1.6.0-----OKOK--OKAborted-------29.45528.029--22.3280.000--
textutils.v0.12.0-----OKOK-----------9.9549.635------
textutils.v0.13.0---------AbortedAborted-----------0.0000.000--
textutils_kernel.v0.12.0-----OKOK-----------5.1194.204------
thread-bench.1.0-----Failure (2)Failure (2)--AbortedAborted-------0.2121.582--0.0000.000--
time_now.v0.12.0-----OKOK-----------4.7863.916------
time_now.v0.13.0---------AbortedAborted-----------0.0000.000--
topkg.1.0.1----------Aborted------------0.000--
typerep.v0.12.0-----OKOK-----------13.3968.964------
typerep.v0.13.0---------OKAborted-----------2.8850.000--
uchar.0.0.2----------Aborted------------0.000--
uri.3.1.0-----OKOK--OKAborted-------11.77712.029--3.4050.000--
uri-sexp.3.1.0-----OKOK--AbortedAborted-------4.5454.676--0.0000.000--
uutf.1.0.2----------Aborted------------0.000--
variantslib.v0.12.0-----OKOK-----------13.2308.934------
variantslib.v0.13.0---------OKAborted-----------3.9550.000--
why3.1.3.1-----OKOK-----------63.68145.632------
yojson.1.7.0-----OKOK--OKAborted-------9.7459.836--2.7130.000--
yojson-bench.1.0-----Failure (2)Failure (2)--Failure (2)Aborted-------1.1000.940--0.1840.000--
zarith.1.9.1----------Aborted------------0.000--
Close

Error on yojson-bench.1.0 (4.08.0+trunk+bench)

Command:

/usr/bin/make -C yojson

Output

make: Entering directory '/home/louis/.opam/4.08.0+trunk+bench/.opam-switch/build/yojson-bench.1.0/yojson'
ocamlfind ocamlopt -I `ocamlfind query yojson` -o ydump_bench -package easy-format,biniou -linkpkg yojson.cmx yojson_biniou.cmx ydump.ml
gcc: error: /home/louis/.opam/4.08.0+trunk+bench/lib/yojson/yojson_biniou.o: No such file or directory
gcc: error: /home/louis/.opam/4.08.0+trunk+bench/lib/yojson/yojson.o: No such file or directory
File "caml_startup", line 1:
Error: Error during linking (exit code 1)
Makefile:6: recipe for target 'all' failed
make: *** [all] Error 2
make: Leaving directory '/home/louis/.opam/4.08.0+trunk+bench/.opam-switch/build/yojson-bench.1.0/yojson'
Close

Error on yojson-bench.1.0 (4.07.1+oclassic+bench)

Command:

/usr/bin/make -C yojson

Output

make: Entering directory '/home/louis/.opam/4.07.1+oclassic+bench/.opam-switch/build/yojson-bench.1.0/yojson'
ocamlfind ocamlopt -I `ocamlfind query yojson` -o ydump_bench -package easy-format,biniou -linkpkg yojson.cmx yojson_biniou.cmx ydump.ml
gcc: error: /home/louis/.opam/4.07.1+oclassic+bench/lib/yojson/yojson_biniou.o: No such file or directory
gcc: error: /home/louis/.opam/4.07.1+oclassic+bench/lib/yojson/yojson.o: No such file or directory
File "caml_startup", line 1:
Error: Error during linking
Makefile:6: recipe for target 'all' failed
make: *** [all] Error 2
make: Leaving directory '/home/louis/.opam/4.07.1+oclassic+bench/.opam-switch/build/yojson-bench.1.0/yojson'
Close

Error on yojson-bench.1.0 (4.07.1+flambda+bench)

Command:

/usr/bin/make -C yojson

Output

make: Entering directory '/home/louis/.opam/4.07.1+flambda+bench/.opam-switch/build/yojson-bench.1.0/yojson'
ocamlfind ocamlopt -I `ocamlfind query yojson` -o ydump_bench -package easy-format,biniou -linkpkg yojson.cmx yojson_biniou.cmx ydump.ml
gcc: error: /home/louis/.opam/4.07.1+flambda+bench/lib/yojson/yojson_biniou.o: No such file or directory
gcc: error: /home/louis/.opam/4.07.1+flambda+bench/lib/yojson/yojson.o: No such file or directory
File "caml_startup", line 1:
Error: Error during linking
Makefile:6: recipe for target 'all' failed
make: *** [all] Error 2
make: Leaving directory '/home/louis/.opam/4.07.1+flambda+bench/.opam-switch/build/yojson-bench.1.0/yojson'
Close

Error on thread-bench.1.0 (4.07.1+oclassic+bench)

Command:

/usr/bin/make -C thread

Output

make: Entering directory '/home/louis/.opam/4.07.1+oclassic+bench/.opam-switch/build/thread-bench.1.0/thread'
ocamlfind ocamlopt -package lwt.unix -linkpkg -o thread_sleep_lwt thread_sleep_lwt.ml
ocamlfind: [WARNING] Package `threads': Linking problems may arise because of the missing -thread or -vmthread switch
File "thread_sleep_lwt.ml", line 1:
Error: No implementations provided for the following modules:
         Mutex referenced from /home/louis/.opam/4.07.1+oclassic+bench/lib/lwt/unix/lwt_unix.cmxa(Lwt_main)
Makefile:7: recipe for target 'thread_sleep_lwt' failed
make: *** [thread_sleep_lwt] Error 2
make: Leaving directory '/home/louis/.opam/4.07.1+oclassic+bench/.opam-switch/build/thread-bench.1.0/thread'
Close

Error on thread-bench.1.0 (4.07.1+flambda+bench)

Command:

/usr/bin/make -C thread

Output

make: Entering directory '/home/louis/.opam/4.07.1+flambda+bench/.opam-switch/build/thread-bench.1.0/thread'
ocamlfind ocamlopt -package lwt.unix -linkpkg -o thread_sleep_lwt thread_sleep_lwt.ml
ocamlfind: [WARNING] Package `threads': Linking problems may arise because of the missing -thread or -vmthread switch
File "thread_sleep_lwt.ml", line 1:
Error: No implementations provided for the following modules:
         Mutex referenced from /home/louis/.opam/4.07.1+flambda+bench/lib/lwt/unix/lwt_unix.cmxa(Lwt_main)
Makefile:7: recipe for target 'thread_sleep_lwt' failed
make: *** [thread_sleep_lwt] Error 2
make: Leaving directory '/home/louis/.opam/4.07.1+flambda+bench/.opam-switch/build/thread-bench.1.0/thread'
Close

Error on ocaml-variants.4.08.0+trunk+flambda (4.08.0+trunk+flambda+bench)

Command:

~/.opam/4.08.0+trunk+flambda+bench/.opam-switch/build/ocaml-variants.4.08.0+trunk+flambda/./configure -prefix /home/louis/.opam/4.08.0+trunk+flambda+bench -flambda -with-debug-runtime

Output

configure: error: unrecognized option: `-flambda'
Try `/home/louis/.opam/4.08.0+trunk+flambda+bench/.opam-switch/build/ocaml-variants.4.08.0+trunk+flambda/./configure --help' for more information
Close

Error on ocaml-migrate-parsetree.1.7.2 (4.08.0+trunk+bench)

Command:

~/.opam/4.08.0+trunk+bench/bin/dune build -p ocaml-migrate-parsetree -j 7

Output

       ocaml src/ast-version,src/compiler-functions-file (exit 1)
(cd _build/default/src && /home/louis/.opam/4.08.0+trunk+bench/bin/ocaml config/gen.ml 4.12.0+dev0-2020-04-22)
Unkown OCaml version 4.12.0+dev0-2020-04-22
Close

Error on numerical-analysis-bench.1.0 (4.08.0+trunk+bench)

Command:

/usr/bin/make

Output

ulimit -s 98304; ocamlopt.opt  -I simple_access `ocamldep.opt -sort simple_access/*.ml` main_nogcstats.ml -o simple_access.opt
ulimit -s 98304; ocamlopt.opt  -I lu-decomposition `ocamldep.opt -sort lu-decomposition/*.ml` main_nogcstats.ml -o lu-decomposition.opt
ulimit -s 98304; ocamlopt.opt  -I fft `ocamldep.opt -sort fft/*.ml` main_nogcstats.ml -o fft.opt
ulimit -s 98304; ocamlopt.opt  -I rnd_access `ocamldep.opt -sort rnd_access/*.ml` main_nogcstats.ml -o rnd_access.opt
ulimit -s 98304; ocamlopt.opt  -I k-means `ocamldep.opt -sort k-means/*.ml` main_nogcstats.ml -o k-means.opt
Fatal error: exception Stack overflow
Makefile:20: recipe for target 'k-means.opt' failed
make: *** [k-means.opt] Error 2
Close

Error on core-micro-bench.1.0 (4.07.1+oclassic+bench)

Command:

/usr/bin/make -C core_micro

Output

make: Entering directory '/home/louis/.opam/4.07.1+oclassic+bench/.opam-switch/build/core-micro-bench.1.0/core_micro'
ocamlbuild -use-ocamlfind runner.native
ocamlfind ocamldep -package str -package core -package core_bench.inline_benchmarks -modules runner.ml > runner.ml.depends
ocamlfind ocamlc -c -thread -package str -package core -package core_bench.inline_benchmarks -o runner.cmo runner.ml
+ ocamlfind ocamlc -c -thread -package str -package core -package core_bench.inline_benchmarks -o runner.cmo runner.ml
File "runner.ml", line 1, characters 5-13:
Error: Unbound module Core.Std
Command exited with code 2.
Makefile:4: recipe for target 'all' failed
make: *** [all] Error 10
make: Leaving directory '/home/louis/.opam/4.07.1+oclassic+bench/.opam-switch/build/core-micro-bench.1.0/core_micro'
Close

Error on core-micro-bench.1.0 (4.07.1+flambda+bench)

Command:

/usr/bin/make -C core_micro

Output

make: Entering directory '/home/louis/.opam/4.07.1+flambda+bench/.opam-switch/build/core-micro-bench.1.0/core_micro'
ocamlbuild -use-ocamlfind runner.native
ocamlfind ocamldep -package str -package core -package core_bench.inline_benchmarks -modules runner.ml > runner.ml.depends
ocamlfind ocamlc -c -thread -package str -package core -package core_bench.inline_benchmarks -o runner.cmo runner.ml
+ ocamlfind ocamlc -c -thread -package str -package core -package core_bench.inline_benchmarks -o runner.cmo runner.ml
File "runner.ml", line 1, characters 5-13:
Error: Unbound module Core.Std
Command exited with code 2.
Makefile:4: recipe for target 'all' failed
make: *** [all] Error 10
make: Leaving directory '/home/louis/.opam/4.07.1+flambda+bench/.opam-switch/build/core-micro-bench.1.0/core_micro'
Close

Error on conf-graphviz.0.1 (4.07.1+oclassic+bench)

Command:

/usr/bin/which dot

Output


Close

Error on conf-graphviz.0.1 (4.07.1+flambda+bench)

Command:

/usr/bin/which dot

Output


Close

Error on cohttp-bench.1.0 (4.07.1+oclassic+bench)

Command:

/usr/bin/make -C cohttp

Output

make: Entering directory '/home/louis/.opam/4.07.1+oclassic+bench/.opam-switch/build/cohttp-bench.1.0/cohttp'
ocamlbuild -use-ocamlfind cohttp_lwt_bench.native cohttp_async_bench.native
ocamlfind ocamldep -package lwt.unix -package cohttp.lwt -modules cohttp_lwt_bench.ml > cohttp_lwt_bench.ml.depends
+ ocamlfind ocamldep -package lwt.unix -package cohttp.lwt -modules cohttp_lwt_bench.ml > cohttp_lwt_bench.ml.depends
ocamlfind: Package `cohttp.lwt' not found
Command exited with code 2.
Makefile:6: recipe for target 'all' failed
make: *** [all] Error 10
make: Leaving directory '/home/louis/.opam/4.07.1+oclassic+bench/.opam-switch/build/cohttp-bench.1.0/cohttp'
Close

Error on cohttp-bench.1.0 (4.07.1+flambda+bench)

Command:

/usr/bin/make -C cohttp

Output

make: Entering directory '/home/louis/.opam/4.07.1+flambda+bench/.opam-switch/build/cohttp-bench.1.0/cohttp'
ocamlbuild -use-ocamlfind cohttp_lwt_bench.native cohttp_async_bench.native
ocamlfind ocamldep -package lwt.unix -package cohttp.lwt -modules cohttp_lwt_bench.ml > cohttp_lwt_bench.ml.depends
+ ocamlfind ocamldep -package lwt.unix -package cohttp.lwt -modules cohttp_lwt_bench.ml > cohttp_lwt_bench.ml.depends
ocamlfind: Package `cohttp.lwt' not found
Command exited with code 2.
Makefile:6: recipe for target 'all' failed
make: *** [all] Error 10
make: Leaving directory '/home/louis/.opam/4.07.1+flambda+bench/.opam-switch/build/cohttp-bench.1.0/cohttp'
Close

Error on chameneos-bench.1.0 (4.07.1+oclassic+bench)

Command:

/usr/bin/make -C chameneos-redux

Output

make: Entering directory '/home/louis/.opam/4.07.1+oclassic+bench/.opam-switch/build/chameneos-bench.1.0/chameneos-redux'
ocamlopt -bin-annot -thread unix.cmxa threads.cmxa chameneos_redux_th.ml -o chameneos_redux_th
ocamlopt -bin-annot -thread unix.cmxa threads.cmxa chameneos_redux_evtchn.ml -o chameneos_redux_evtchn
ocamlfind ocamlopt -bin-annot -package lwt.unix -linkpkg chameneos_redux_lwt.ml -o chameneos_redux_lwt
ocamlfind: [WARNING] Package `threads': Linking problems may arise because of the missing -thread or -vmthread switch
File "chameneos_redux_lwt.ml", line 1:
Error: No implementations provided for the following modules:
         Mutex referenced from /home/louis/.opam/4.07.1+oclassic+bench/lib/lwt/unix/lwt_unix.cmxa(Lwt_main)
Makefile:6: recipe for target 'chameneos_redux_lwt' failed
make: *** [chameneos_redux_lwt] Error 2
make: Leaving directory '/home/louis/.opam/4.07.1+oclassic+bench/.opam-switch/build/chameneos-bench.1.0/chameneos-redux'
Close

Error on chameneos-bench.1.0 (4.07.1+flambda+bench)

Command:

/usr/bin/make -C chameneos-redux

Output

make: Entering directory '/home/louis/.opam/4.07.1+flambda+bench/.opam-switch/build/chameneos-bench.1.0/chameneos-redux'
ocamlopt -bin-annot -thread unix.cmxa threads.cmxa chameneos_redux_th.ml -o chameneos_redux_th
ocamlopt -bin-annot -thread unix.cmxa threads.cmxa chameneos_redux_evtchn.ml -o chameneos_redux_evtchn
ocamlfind ocamlopt -bin-annot -package lwt.unix -linkpkg chameneos_redux_lwt.ml -o chameneos_redux_lwt
ocamlfind: [WARNING] Package `threads': Linking problems may arise because of the missing -thread or -vmthread switch
File "chameneos_redux_lwt.ml", line 1:
Error: No implementations provided for the following modules:
         Mutex referenced from /home/louis/.opam/4.07.1+flambda+bench/lib/lwt/unix/lwt_unix.cmxa(Lwt_main)
Makefile:6: recipe for target 'chameneos_redux_lwt' failed
make: *** [chameneos_redux_lwt] Error 2
make: Leaving directory '/home/louis/.opam/4.07.1+flambda+bench/.opam-switch/build/chameneos-bench.1.0/chameneos-redux'
Close

Error on async-rpc-bench.1.0 (4.07.1+oclassic+bench)

Command:

/usr/bin/make -C async_rpc

Output

make: Entering directory '/home/louis/.opam/4.07.1+oclassic+bench/.opam-switch/build/async-rpc-bench.1.0/async_rpc'
ocamlfind ocamlopt -thread -syntax camlp4o -package async -package bin_prot.syntax -package core -c rpc_common.ml
ocamlfind: Package `bin_prot.syntax' not found
Makefile:12: recipe for target 'rpc_common.cmx' failed
make: *** [rpc_common.cmx] Error 2
make: Leaving directory '/home/louis/.opam/4.07.1+oclassic+bench/.opam-switch/build/async-rpc-bench.1.0/async_rpc'
Close

Error on async-rpc-bench.1.0 (4.07.1+flambda+bench)

Command:

/usr/bin/make -C async_rpc

Output

make: Entering directory '/home/louis/.opam/4.07.1+flambda+bench/.opam-switch/build/async-rpc-bench.1.0/async_rpc'
ocamlfind ocamlopt -thread -syntax camlp4o -package async -package bin_prot.syntax -package core -c rpc_common.ml
ocamlfind: Package `bin_prot.syntax' not found
Makefile:12: recipe for target 'rpc_common.cmx' failed
make: *** [rpc_common.cmx] Error 2
make: Leaving directory '/home/louis/.opam/4.07.1+flambda+bench/.opam-switch/build/async-rpc-bench.1.0/async_rpc'
Close

Error on async-echo-bench.1.0 (4.07.1+oclassic+bench)

Command:

/usr/bin/make -C async_echo

Output

make: Entering directory '/home/louis/.opam/4.07.1+oclassic+bench/.opam-switch/build/async-echo-bench.1.0/async_echo'
ocamlfind ocamlopt -thread -syntax camlp4o -package async -package bin_prot.syntax -package core -c echo_common.ml
ocamlfind: Package `bin_prot.syntax' not found
Makefile:20: recipe for target 'echo_common.cmx' failed
make: *** [echo_common.cmx] Error 2
make: Leaving directory '/home/louis/.opam/4.07.1+oclassic+bench/.opam-switch/build/async-echo-bench.1.0/async_echo'
Close

Error on async-echo-bench.1.0 (4.07.1+flambda+bench)

Command:

/usr/bin/make -C async_echo

Output

make: Entering directory '/home/louis/.opam/4.07.1+flambda+bench/.opam-switch/build/async-echo-bench.1.0/async_echo'
ocamlfind ocamlopt -thread -syntax camlp4o -package async -package bin_prot.syntax -package core -c echo_common.ml
ocamlfind: Package `bin_prot.syntax' not found
Makefile:20: recipe for target 'echo_common.cmx' failed
make: *** [echo_common.cmx] Error 2
make: Leaving directory '/home/louis/.opam/4.07.1+flambda+bench/.opam-switch/build/async-echo-bench.1.0/async_echo'