Package4.03.1+bench4.05.0+flambda+opt+bench4.06.1+flambda+bench4.06.1+flambda+opt+bench4.07.1+clambda+bench4.07.1+flambda+bench4.07.1+oclassic+bench4.08.0+gpr2165+bench4.08.0+mutmatch+bench4.08.0+trunk+bench4.08.0+trunk+flambda+bench4.08.0+trunk+flambda+oclassic+bench4.08.0+trunk+flambda+opt+bench4.03.1+bench time (s)4.05.0+flambda+opt+bench time (s)4.06.1+flambda+bench time (s)4.06.1+flambda+opt+bench time (s)4.07.1+clambda+bench time (s)4.07.1+flambda+bench time (s)4.07.1+oclassic+bench time (s)4.08.0+gpr2165+bench time (s)4.08.0+mutmatch+bench time (s)4.08.0+trunk+bench time (s)4.08.0+trunk+flambda+bench time (s)4.08.0+trunk+flambda+oclassic+bench time (s)4.08.0+trunk+flambda+opt+bench time (s)
almabench-bench.1.0---------OK--Aborted---------0.721--0.000
alt-ergo.2.3.2------------Aborted------------0.000
alt-ergo-lib.2.3.2------------Aborted------------0.000
alt-ergo-parsers.2.3.2------------Aborted------------0.000
async.v0.13.0-------AbortedAbortedAborted--Aborted-------0.0000.0000.000--0.000
async.v0.9.0OK------------0.899------------
async-echo-bench.1.0Failure (2)------AbortedAbortedAborted--Aborted0.683------0.0000.0000.000--0.000
async-rpc-bench.1.0Failure (2)------AbortedAbortedAborted--Aborted0.594------0.0000.0000.000--0.000
async_extra.v0.9.0OK------------7.645------------
async_kernel.v0.13.0-------AbortedAbortedAborted--Aborted-------0.0000.0000.000--0.000
async_kernel.v0.9.0OK------------12.346------------
async_rpc_kernel.v0.13.0-------AbortedAbortedAborted--Aborted-------0.0000.0000.000--0.000
async_rpc_kernel.v0.9.0OK------------10.016------------
async_unix.v0.13.0-------AbortedAbortedAborted--Aborted-------0.0000.0000.000--0.000
async_unix.v0.9.0OK------------11.430------------
base.v0.13.2-------AbortedAbortedOK--Aborted-------0.0000.00011.596--0.000
base-bytes.base---------OK--Aborted---------0.000--0.000
base64.2.3.0OK------------0.614------------
base64.3.4.0-------AbortedAbortedOK--Aborted-------0.0000.0004.408--0.000
base_bigstring.v0.13.0-------AbortedAbortedAborted--Aborted-------0.0000.0000.000--0.000
base_quickcheck.v0.13.0-------AbortedAbortedAborted--Aborted-------0.0000.0000.000--0.000
bdd-bench.1.0---------OK--Aborted---------0.881--0.000
bin_prot.v0.13.0-------AbortedAbortedAborted--Aborted-------0.0000.0000.000--0.000
bin_prot.v0.9.1OK------------6.166------------
biniou.1.2.1OK------AbortedAbortedOK--Aborted14.515------0.0000.0002.193--0.000
camlimages.5.0.1-------AbortedAbortedOK--Aborted-------0.0000.0003.090--0.000
camlpdf.2.3---------OK--Aborted---------15.049--0.000
camlzip.1.10------------Aborted------------0.000
chameneos-bench.1.0Failure (2)------AbortedAbortedAborted--Aborted0.637------0.0000.0000.000--0.000
cohttp.1.1.1OK------------2.607------------
cohttp.2.5.1-------AbortedAbortedAborted--Aborted-------0.0000.0000.000--0.000
cohttp-bench.1.0Failure (2)------AbortedAbortedAborted--Aborted0.380------0.0000.0000.000--0.000
conf-graphviz.0.1Failure (1)------------0.160------------
configurator.v0.11.0-------AbortedAbortedOK--Aborted-------0.0000.0003.127--0.000
configurator.v0.9.1OK------------13.575------------
core.v0.13.0-------AbortedAbortedAborted--Aborted-------0.0000.0000.000--0.000
core.v0.9.1OK------------28.521------------
core-micro-bench.1.0Failure (2)------AbortedAbortedAborted--Aborted1.539------0.0000.0000.000--0.000
core-sequence-bench.1.0OK------AbortedAbortedAborted--Aborted0.057------0.0000.0000.000--0.000
core_bench.v0.13.0-------AbortedAbortedAborted--Aborted-------0.0000.0000.000--0.000
core_bench.v0.9.0OK------------3.571------------
core_extended.v0.9.0OK------------20.504------------
core_kernel.v0.13.1-------AbortedAbortedAborted--Aborted-------0.0000.0000.000--0.000
core_kernel.v0.9.0OK------------30.859------------
cpdf.2.3---------OK--Aborted---------24.380--0.000
cpdf-bench.1.0---------OK--Aborted---------0.166--0.000
cppo.1.6.6OK------AbortedAbortedOK--Aborted0.823------0.0000.0001.620--0.000
dune.2.2.0OK------------9.861------------
dune.2.5.1-------Failure (2)Failure (2)OK--Aborted-------0.4420.93217.109--0.000
dune-configurator.1.11.4OK------------4.056------------
dune-configurator.2.5.1-------AbortedAbortedOK--Aborted-------0.0000.0008.896--0.000
dune-private-libs.2.5.1-------AbortedAbortedOK--Aborted-------0.0000.0006.788--0.000
easy-format.1.3.2OK------AbortedAbortedOK--Aborted0.239------0.0000.0000.562--0.000
fieldslib.v0.13.0-------AbortedAbortedOK--Aborted-------0.0000.0000.307--0.000
fieldslib.v0.9.0OK------------1.527------------
frama-c.19.1OK------------81.755------------
frama-c-bench.1.0OK------------0.237------------
jane-street-headers.v0.13.0-------AbortedAbortedOK--Aborted-------0.0000.0000.319--0.000
jbuilder.1.0+beta20.2---------OK--Aborted---------13.995--0.000
json-bench-data.1.0---------OK--Aborted---------0.040--0.000
jsonm.1.0.1---------OK--Aborted---------2.107--0.000
jsonm-bench.1.0---------OK--Aborted---------0.034--0.000
jst-config.v0.13.0-------AbortedAbortedAborted--Aborted-------0.0000.0000.000--0.000
kb-bench.1.0---------OK--Aborted---------0.610--0.000
lexifi-g2pp-bench.1.0---------OK--Aborted---------0.579--0.000
lwt.5.3.0OK------AbortedAbortedOK--Aborted4.297------0.0000.0008.985--0.000
menhir.20200211OK------AbortedAbortedOK--Aborted16.275------0.0000.00024.019--0.000
menhir-bench.1.0OK------AbortedAbortedOK--Aborted0.322------0.0000.0000.258--0.000
menhirLib.20200211OK------AbortedAbortedOK--Aborted0.847------0.0000.0001.320--0.000
menhirSdk.20200211OK------AbortedAbortedOK--Aborted0.499------0.0000.0000.672--0.000
minilight.1.6---------OK--Aborted---------0.715--0.000
minilight-bench.1.0---------OK--Aborted---------0.204--0.000
mmap.1.1.0OK------AbortedAbortedOK--Aborted0.350------0.0000.0000.373--0.000
nbcodec.1.0---------OK--Aborted---------0.917--0.000
nbcodec-bench.1.0---------OK--Aborted---------0.175--0.000
num.1.3---------OK--Aborted---------2.074--0.000
numerical-analysis-bench.1.0-------Failure (2)-Failure (2)--Aborted-------7.068-13.625--0.000
ocaml.4.08.0---------OK--Aborted---------0.127--0.000
ocaml-compiler-libs.v0.12.1-------AbortedAbortedOK--Aborted-------0.0000.0002.024--0.000
ocaml-migrate-parsetree.1.7.3OK------AbortedAbortedFailure (1)--Aborted8.832------0.0000.0003.353--0.000
ocaml-syntax-shims.1.0.0OK------------1.454------------
ocaml-variants.4.08.0+trunk---------OK------------384.940---
ocaml-variants.4.08.0+trunk+flambda+opt------------Failure (1)------------0.256
ocamlbuild.0.14.0---------OK--Aborted---------12.424--0.000
ocamlfind.1.8.1---------OK--Aborted---------8.270--0.000
ocplib-endian.0.8OK------------28.972------------
ocplib-endian.1.1-------AbortedAbortedOK--Aborted-------0.0000.0003.220--0.000
ocplib-simplex.0.4------------Aborted------------0.000
octavius.1.2.2OK------AbortedAbortedOK--Aborted2.014------0.0000.0002.728--0.000
parsexp.v0.13.0-------AbortedAbortedOK--Aborted-------0.0000.0001.871--0.000
patdiff.v0.13.0-------AbortedAbortedAborted--Aborted-------0.0000.0000.000--0.000
patdiff.v0.9.0OK------------6.213------------
patdiff-bench.1.0OK------AbortedAbortedAborted--Aborted0.186------0.0000.0000.000--0.000
patience_diff.v0.13.0-------AbortedAbortedAborted--Aborted-------0.0000.0000.000--0.000
patience_diff.v0.9.0OK------------4.515------------
pcre.7.4.3-------AbortedAbortedOK--Aborted-------0.0000.0002.769--0.000
ppx_assert.v0.13.0-------AbortedAbortedAborted--Aborted-------0.0000.0000.000--0.000
ppx_assert.v0.9.0OK------------3.867------------
ppx_ast.v0.9.1OK------------2.952------------
ppx_base.v0.13.0-------AbortedAbortedAborted--Aborted-------0.0000.0000.000--0.000
ppx_base.v0.9.0OK------------3.819------------
ppx_bench.v0.13.0-------AbortedAbortedAborted--Aborted-------0.0000.0000.000--0.000
ppx_bench.v0.9.1OK------------4.246------------
ppx_bin_prot.v0.13.0-------AbortedAbortedAborted--Aborted-------0.0000.0000.000--0.000
ppx_bin_prot.v0.9.0OK------------6.320------------
ppx_cold.v0.13.0-------AbortedAbortedAborted--Aborted-------0.0000.0000.000--0.000
ppx_compare.v0.13.0-------AbortedAbortedAborted--Aborted-------0.0000.0000.000--0.000
ppx_compare.v0.9.0OK------------7.163------------
ppx_core.v0.9.0OK------------4.200------------
ppx_custom_printf.v0.13.0-------AbortedAbortedAborted--Aborted-------0.0000.0000.000--0.000
ppx_custom_printf.v0.9.0OK------------5.085------------
ppx_derivers.1.2.1OK------AbortedAbortedOK--Aborted0.313------0.0000.0000.432--0.000
ppx_driver.v0.9.1OK------------1.573------------
ppx_enumerate.v0.13.0-------AbortedAbortedAborted--Aborted-------0.0000.0000.000--0.000
ppx_enumerate.v0.9.0OK------------2.497------------
ppx_expect.v0.13.1-------AbortedAbortedAborted--Aborted-------0.0000.0000.000--0.000
ppx_expect.v0.9.0OK------------9.158------------
ppx_fail.v0.13.0-------AbortedAbortedAborted--Aborted-------0.0000.0000.000--0.000
ppx_fail.v0.9.0OK------------5.309------------
ppx_fields_conv.v0.13.0-------AbortedAbortedAborted--Aborted-------0.0000.0000.000--0.000
ppx_fields_conv.v0.9.0OK------------8.342------------
ppx_hash.v0.13.0-------AbortedAbortedAborted--Aborted-------0.0000.0000.000--0.000
ppx_hash.v0.9.0OK------------2.408------------
ppx_here.v0.13.0-------AbortedAbortedAborted--Aborted-------0.0000.0000.000--0.000
ppx_here.v0.9.1OK------------2.335------------
ppx_inline_test.v0.13.1-------AbortedAbortedAborted--Aborted-------0.0000.0000.000--0.000
ppx_inline_test.v0.9.2OK------------6.191------------
ppx_jane.v0.13.0-------AbortedAbortedAborted--Aborted-------0.0000.0000.000--0.000
ppx_jane.v0.9.0OK------------1.572------------
ppx_js_style.v0.13.0-------AbortedAbortedAborted--Aborted-------0.0000.0000.000--0.000
ppx_js_style.v0.9.0OK------------9.699------------
ppx_let.v0.13.0-------AbortedAbortedAborted--Aborted-------0.0000.0000.000--0.000
ppx_let.v0.9.0OK------------3.477------------
ppx_metaquot.v0.9.0OK------------4.256------------
ppx_module_timer.v0.13.0-------AbortedAbortedAborted--Aborted-------0.0000.0000.000--0.000
ppx_optcomp.v0.13.0-------AbortedAbortedAborted--Aborted-------0.0000.0000.000--0.000
ppx_optcomp.v0.9.0OK------------0.961------------
ppx_optional.v0.13.0-------AbortedAbortedAborted--Aborted-------0.0000.0000.000--0.000
ppx_optional.v0.9.0OK------------2.517------------
ppx_pipebang.v0.13.0-------AbortedAbortedAborted--Aborted-------0.0000.0000.000--0.000
ppx_pipebang.v0.9.0OK------------10.482------------
ppx_sexp_conv.v0.13.0-------AbortedAbortedAborted--Aborted-------0.0000.0000.000--0.000
ppx_sexp_conv.v0.9.0OK------------8.690------------
ppx_sexp_message.v0.13.0-------AbortedAbortedAborted--Aborted-------0.0000.0000.000--0.000
ppx_sexp_message.v0.9.0OK------------4.585------------
ppx_sexp_value.v0.13.0-------AbortedAbortedAborted--Aborted-------0.0000.0000.000--0.000
ppx_sexp_value.v0.9.0OK------------5.147------------
ppx_stable.v0.13.0-------AbortedAbortedAborted--Aborted-------0.0000.0000.000--0.000
ppx_traverse.v0.9.0OK------------9.518------------
ppx_type_conv.v0.9.1OK------------11.287------------
ppx_typerep_conv.v0.13.0-------AbortedAbortedAborted--Aborted-------0.0000.0000.000--0.000
ppx_typerep_conv.v0.9.0OK------------2.962------------
ppx_variants_conv.v0.13.0-------AbortedAbortedAborted--Aborted-------0.0000.0000.000--0.000
ppx_variants_conv.v0.9.0OK------------7.457------------
ppxlib.0.13.0-------AbortedAbortedAborted--Aborted-------0.0000.0000.000--0.000
protocol_version_header.v0.13.0-------AbortedAbortedAborted--Aborted-------0.0000.0000.000--0.000
psmt2-frontend.0.2--------Aborted---Aborted--------0.000---0.000
re.1.9.0OK------AbortedAbortedOK--Aborted6.067------0.0000.0003.166--0.000
re2.v0.9.0OK------------63.974------------
result.1.5OK------AbortedAbortedOK--Aborted14.507------0.0000.0000.686--0.000
sauvola-bench.1.0-------AbortedAbortedOK--Aborted-------0.0000.0000.661--0.000
seq.0.2.2OK------------14.773------------
seq.base---------OK--Aborted---------0.071--0.000
sequence-bench.1.0---------OK--Aborted---------2.654--0.000
sexplib.v0.13.0-------AbortedAbortedOK--Aborted-------0.0000.0002.548--0.000
sexplib0.v0.13.0-------AbortedAbortedOK--Aborted-------0.0000.0001.040--0.000
spawn.v0.13.0-------AbortedAbortedOK--Aborted-------0.0000.0000.766--0.000
splittable_random.v0.13.0-------AbortedAbortedAborted--Aborted-------0.0000.0000.000--0.000
stdio.v0.13.0-------AbortedAbortedOK--Aborted-------0.0000.0000.957--0.000
stdlib-shims.0.1.0-------AbortedAbortedOK--Aborted-------0.0000.0004.089--0.000
stringext.1.6.0OK------AbortedAbortedOK--Aborted15.028------0.0000.0003.996--0.000
textutils.v0.13.0-------AbortedAbortedAborted--Aborted-------0.0000.0000.000--0.000
textutils.v0.9.0OK------------5.756------------
thread-bench.1.0Failure (2)------AbortedAbortedAborted--Aborted0.275------0.0000.0000.000--0.000
time_now.v0.13.0-------AbortedAbortedAborted--Aborted-------0.0000.0000.000--0.000
topkg.1.0.1---------OK--Aborted---------4.211--0.000
typerep.v0.13.0-------AbortedAbortedOK--Aborted-------0.0000.0003.295--0.000
uchar.0.0.2---------OK--Aborted---------1.153--0.000
uri.1.9.7OK------------5.477------------
uri.3.1.0-------AbortedAbortedOK--Aborted-------0.0000.0004.770--0.000
uri-sexp.3.1.0-------AbortedAbortedAborted--Aborted-------0.0000.0000.000--0.000
uutf.1.0.2---------OK--Aborted---------1.144--0.000
valet-bench.1.0Failure (2)------------0.842------------
variantslib.v0.13.0-------AbortedAbortedOK--Aborted-------0.0000.0004.483--0.000
variantslib.v0.9.0OK------------5.974------------
yojson.1.7.0OK------AbortedAbortedOK--Aborted10.757------0.0000.00022.174--0.000
yojson-bench.1.0Failure (2)------AbortedAbortedFailure (2)--Aborted0.169------0.0000.0001.976--0.000
zarith.1.9.1------------Aborted------------0.000
Close

Error on yojson-bench.1.0 (4.08.0+trunk+bench)

Command:

/usr/bin/make -C yojson

Output

make: Entering directory '/home/louis/.opam/4.08.0+trunk+bench/.opam-switch/build/yojson-bench.1.0/yojson'
ocamlfind ocamlopt -I `ocamlfind query yojson` -o ydump_bench -package easy-format,biniou -linkpkg yojson.cmx yojson_biniou.cmx ydump.ml
gcc: error: /home/louis/.opam/4.08.0+trunk+bench/lib/yojson/yojson_biniou.o: No such file or directory
gcc: error: /home/louis/.opam/4.08.0+trunk+bench/lib/yojson/yojson.o: No such file or directory
File "caml_startup", line 1:
Error: Error during linking (exit code 1)
Makefile:6: recipe for target 'all' failed
make: *** [all] Error 2
make: Leaving directory '/home/louis/.opam/4.08.0+trunk+bench/.opam-switch/build/yojson-bench.1.0/yojson'
Close

Error on yojson-bench.1.0 (4.03.1+bench)

Command:

/usr/bin/make -C yojson

Output

make: Entering directory '/home/louis/.opam/4.03.1+bench/.opam-switch/build/yojson-bench.1.0/yojson'
ocamlfind ocamlopt -I `ocamlfind query yojson` -o ydump_bench -package easy-format,biniou -linkpkg yojson.cmx yojson_biniou.cmx ydump.ml
gcc: error: /home/louis/.opam/4.03.1+bench/lib/yojson/yojson_biniou.o: No such file or directory
gcc: error: /home/louis/.opam/4.03.1+bench/lib/yojson/yojson.o: No such file or directory
File "caml_startup", line 1:
Error: Error during linking
Makefile:6: recipe for target 'all' failed
make: *** [all] Error 2
make: Leaving directory '/home/louis/.opam/4.03.1+bench/.opam-switch/build/yojson-bench.1.0/yojson'
Close

Error on valet-bench.1.0 (4.03.1+bench)

Command:

/usr/bin/make -C valet

Output

make: Entering directory '/home/louis/.opam/4.03.1+bench/.opam-switch/build/valet-bench.1.0/valet'
ocamlbuild -use-ocamlfind test_lwt.native test_async.native
ocamlfind ocamldep -package react -package uuidm -package unix -package ocplib-endian -package lwt.unix -modules test_lwt.ml > test_lwt.ml.depends
ocamlfind ocamldep -package react -package uuidm -package ocplib-endian -modules test_lib.ml > test_lib.ml.depends
ocamlfind ocamldep -package uuidm -package unix -package ocplib-endian -modules valet_core.ml > valet_core.ml.depends
ocamlfind ocamldep -package react -package uuidm -package ocplib-endian -modules valet_react.ml > valet_react.ml.depends
ocamlfind ocamlc -c -g -bin-annot -package uuidm -package unix -package ocplib-endian -o valet_core.cmo valet_core.ml
ocamlfind ocamlc -c -g -bin-annot -package react -package uuidm -package ocplib-endian -o valet_react.cmo valet_react.ml
ocamlfind ocamlc -c -g -bin-annot -package react -package uuidm -package ocplib-endian -o test_lib.cmo test_lib.ml
ocamlfind ocamlc -c -g -bin-annot -package react -package uuidm -package unix -package ocplib-endian -package lwt.unix -o test_lwt.cmo test_lwt.ml
+ ocamlfind ocamlc -c -g -bin-annot -package react -package uuidm -package unix -package ocplib-endian -package lwt.unix -o test_lwt.cmo test_lwt.ml
ocamlfind: [WARNING] Package `threads': Linking problems may arise because of the missing -thread or -vmthread switch
ocamlfind ocamlopt -c -g -bin-annot -package uuidm -package unix -package ocplib-endian -o valet_core.cmx valet_core.ml
ocamlfind ocamlopt -c -g -bin-annot -package react -package uuidm -package ocplib-endian -o valet_react.cmx valet_react.ml
ocamlfind ocamlopt -c -g -bin-annot -package react -package uuidm -package ocplib-endian -o test_lib.cmx test_lib.ml
ocamlfind ocamlopt -c -g -bin-annot -package react -package uuidm -package unix -package ocplib-endian -package lwt.unix -o test_lwt.cmx test_lwt.ml
+ ocamlfind ocamlopt -c -g -bin-annot -package react -package uuidm -package unix -package ocplib-endian -package lwt.unix -o test_lwt.cmx test_lwt.ml
ocamlfind: [WARNING] Package `threads': Linking problems may arise because of the missing -thread or -vmthread switch
ocamlfind ocamlopt -linkpkg -g -package react -package uuidm -package unix -package ocplib-endian -package lwt.unix valet_core.cmx valet_react.cmx test_lib.cmx test_lwt.cmx -o test_lwt.native
+ ocamlfind ocamlopt -linkpkg -g -package react -package uuidm -package unix -package ocplib-endian -package lwt.unix valet_core.cmx valet_react.cmx test_lib.cmx test_lwt.cmx -o test_lwt.native
ocamlfind: [WARNING] Package `threads': Linking problems may arise because of the missing -thread or -vmthread switch
File "_none_", line 1:
Error: No implementations provided for the following modules:
         Mutex referenced from /home/louis/.opam/4.03.1+bench/lib/lwt/unix/lwt_unix.cmxa(Lwt_main)
Command exited with code 2.
Makefile:6: recipe for target 'all' failed
make: *** [all] Error 10
make: Leaving directory '/home/louis/.opam/4.03.1+bench/.opam-switch/build/valet-bench.1.0/valet'
Close

Error on thread-bench.1.0 (4.03.1+bench)

Command:

/usr/bin/make -C thread

Output

make: Entering directory '/home/louis/.opam/4.03.1+bench/.opam-switch/build/thread-bench.1.0/thread'
ocamlfind ocamlopt -package lwt.unix -linkpkg -o thread_sleep_lwt thread_sleep_lwt.ml
ocamlfind: [WARNING] Package `threads': Linking problems may arise because of the missing -thread or -vmthread switch
File "thread_sleep_lwt.ml", line 1:
Error: No implementations provided for the following modules:
         Mutex referenced from /home/louis/.opam/4.03.1+bench/lib/lwt/unix/lwt_unix.cmxa(Lwt_main)
Makefile:7: recipe for target 'thread_sleep_lwt' failed
make: *** [thread_sleep_lwt] Error 2
make: Leaving directory '/home/louis/.opam/4.03.1+bench/.opam-switch/build/thread-bench.1.0/thread'
Close

Error on ocaml-variants.4.08.0+trunk+flambda+opt (4.08.0+trunk+flambda+opt+bench)

Command:

~/.opam/4.08.0+trunk+flambda+opt+bench/.opam-switch/build/ocaml-variants.4.08.0+trunk+flambda+opt/./configure -prefix /home/louis/.opam/4.08.0+trunk+flambda+opt+bench -flambda -with-debug-runtime

Output

configure: error: unrecognized option: `-flambda'
Try `/home/louis/.opam/4.08.0+trunk+flambda+opt+bench/.opam-switch/build/ocaml-variants.4.08.0+trunk+flambda+opt/./configure --help' for more information
Close

Error on ocaml-migrate-parsetree.1.7.3 (4.08.0+trunk+bench)

Command:

~/.opam/4.08.0+trunk+bench/bin/dune build -p ocaml-migrate-parsetree -j 7

Output

       ocaml src/ast-version,src/compiler-functions-file (exit 1)
(cd _build/default/src && /home/louis/.opam/4.08.0+trunk+bench/bin/ocaml config/gen.ml 4.12.0+dev0-2020-04-22)
Unkown OCaml version 4.12.0+dev0-2020-04-22
Close

Error on numerical-analysis-bench.1.0 (4.08.0+trunk+bench)

Command:

/usr/bin/make

Output

ulimit -s 98304; ocamlopt.opt  -I simple_access `ocamldep.opt -sort simple_access/*.ml` main_nogcstats.ml -o simple_access.opt
ulimit -s 98304; ocamlopt.opt  -I lu-decomposition `ocamldep.opt -sort lu-decomposition/*.ml` main_nogcstats.ml -o lu-decomposition.opt
ulimit -s 98304; ocamlopt.opt  -I fft `ocamldep.opt -sort fft/*.ml` main_nogcstats.ml -o fft.opt
ulimit -s 98304; ocamlopt.opt  -I rnd_access `ocamldep.opt -sort rnd_access/*.ml` main_nogcstats.ml -o rnd_access.opt
ulimit -s 98304; ocamlopt.opt  -I k-means `ocamldep.opt -sort k-means/*.ml` main_nogcstats.ml -o k-means.opt
Fatal error: exception Stack overflow
Makefile:20: recipe for target 'k-means.opt' failed
make: *** [k-means.opt] Error 2
Close

Error on numerical-analysis-bench.1.0 (4.08.0+gpr2165+bench)

Command:

/usr/bin/make

Output

ulimit -s 98304; ocamlopt.opt  -I simple_access `ocamldep.opt -sort simple_access/*.ml` main_nogcstats.ml -o simple_access.opt
ulimit -s 98304; ocamlopt.opt  -I lu-decomposition `ocamldep.opt -sort lu-decomposition/*.ml` main_nogcstats.ml -o lu-decomposition.opt
ulimit -s 98304; ocamlopt.opt  -I fft `ocamldep.opt -sort fft/*.ml` main_nogcstats.ml -o fft.opt
ulimit -s 98304; ocamlopt.opt  -I rnd_access `ocamldep.opt -sort rnd_access/*.ml` main_nogcstats.ml -o rnd_access.opt
ulimit -s 98304; ocamlopt.opt  -I k-means `ocamldep.opt -sort k-means/*.ml` main_nogcstats.ml -o k-means.opt
Fatal error: exception Stack overflow
Makefile:20: recipe for target 'k-means.opt' failed
make: *** [k-means.opt] Error 2
Close

Error on dune.2.5.1 (4.08.0+mutmatch+bench)

Command:

~/.opam/4.08.0+mutmatch+bench/bin/ocaml bootstrap.ml -j 7

Output

ocamlc -custom -w -24 -g -o .duneboot.exe -I boot unix.cma boot/libs.ml boot/duneboot.ml
./.duneboot.exe -j 7
cd _boot && /home/louis/.opam/4.08.0+mutmatch+bench/bin/ocamldep.opt -modules -map main__.ml -map build_info__.ml -map dune.ml -map dune_action_plugin__.ml -map jbuild_support.ml -map dune_glob__.ml -map dune_re__.ml -map cache_daemon__.ml -map cache__.ml -map dune_util.ml -map memo__.ml -map dag__.ml -map incremental_cycles__.ml -map dune_lang__.ml -map stdune__.ml -map dune_csexp.ml -args source_files
File "src/stdune/result.ml", line 67, characters 8-11:
Error: Syntax error: operator expected.
File "src/stdune/daemonize.ml", line 90, characters 11-13:
Error: Syntax error: operator expected.
File "src/stdune/loc.ml", line 75, characters 7-8:
Error: Syntax error
File "src/stdune/applicative.ml", line 5, characters 10-13:
Error: Syntax error: operator expected.
File "src/stdune/monad.ml", line 5, characters 10-13:
Error: Syntax error: operator expected.
File "src/stdune/monad_intf.ml", line 13, characters 10-13:
Error: Syntax error: operator expected.
File "src/stdune/applicative_intf.ml", line 17, characters 10-13:
Error: Syntax error: operator expected.
File "src/stdune/option.mli", line 12, characters 8-11:
Error: Syntax error: operator expected.
File "src/stdune/result.mli", line 31, characters 8-11:
Error: Syntax error: operator expected.
File "src/stdune/option.ml", line 16, characters 8-11:
Error: Syntax error: operator expected.
File "src/dune_lang/syntax.ml", line 97, characters 9-10:
Error: Syntax error
File "src/dune_lang/decoder.mli", line 239, characters 6-9:
Error: Syntax error: operator expected.
File "src/dune_lang/versioned_file.ml", line 110, characters 7-8:
Error: Syntax error
File "src/dune_lang/decoder.ml", line 98, characters 6-9:
Error: Syntax error: operator expected.
File "src/fiber/fiber.ml", line 198, characters 8-11:
Error: Syntax error: operator expected.
File "src/fiber/fiber.mli", line 37, characters 8-11:
Error: Syntax error: operator expected.
File "src/memo/memo.ml", line 117, characters 13-16:
Error: Syntax error: operator expected.
File "src/cache/local.ml", line 146, characters 11-16:
Error: Syntax error
File "src/cache/client.ml", line 24, characters 5-6:
Error: Syntax error
File "src/cache/messages.ml", line 98, characters 13-18:
Error: Syntax error
File "src/cache_daemon/cache_daemon.ml", line 135, characters 9-10:
Error: Syntax error
File "src/ocaml-config/ocaml_config.ml", line 307, characters 7-8:
Error: Syntax error
File "otherlibs/action-plugin/src/dune_action_plugin.ml", line 189, characters 10-13:
Error: Syntax error: operator expected.
File "otherlibs/action-plugin/src/protocol.ml", line 106, characters 11-12:
Error: Syntax error
File "otherlibs/action-plugin/src/dune_action_plugin.mli", line 52, characters 10-13:
Error: Syntax error: operator expected.
File "otherlibs/action-plugin/src/serializable_intf.ml", line 40, characters 7-8:
Error: Syntax error
File "src/dune/coq_rules.ml", line 138, characters 9-10:
Error: Syntax error
File "src/dune/stringlike.ml", line 49, characters 13-14:
Error: Syntax error: operator expected.
File "src/dune/dep_conf.ml", line 28, characters 7-8:
Error: Syntax error
File "src/dune/dune_init.ml", line 86, characters 9-10:
Error: Syntax error: operator expected.
File "src/dune/obj_dir.ml", line 64, characters 12-23:
Error: Syntax error: operator expected.
File "src/dune/ocamldep.ml", line 106, characters 11-16:
Error: Syntax error
File "src/dune/ordered_set_lang.ml", line 90, characters 13-22:
Error: Syntax error
File "src/dune/super_context.ml", line 86, characters 7-8:
Error: Syntax error
File "src/dune/module.ml", line 274, characters 10-14:
Error: Syntax error: operator expected.
File "src/dune/lib_info.ml", line 25, characters 12-15:
Error: Syntax error: operator expected.
File "src/dune/vcs.ml", line 47, characters 12-16:
Error: Syntax error: operator expected.
File "src/dune/dialect.ml", line 42, characters 9-12:
Error: Syntax error
File "src/dune/sub_system.ml", line 40, characters 7-8:
Error: Syntax error
File "src/dune/simple_rules.ml", line 202, characters 17-18:
Error: Syntax error: operator expected.
File "src/dune/findlib/findlib.ml", line 427, characters 11-12:
Error: Syntax error: operator expected.
File "src/dune/format_config.ml", line 58, characters 9-17:
Error: Syntax error
File "src/dune/dune_load.ml", line 193, characters 11-12:
Error: Syntax error: operator expected.
File "src/dune/predicate_lang.ml", line 38, characters 9-10:
Error: Syntax error
File "src/dune/ocaml_stdlib.ml", line 21, characters 10-31:
Error: Syntax error: operator expected.
File "src/dune/stats.ml", line 62, characters 9-15:
Error: Syntax error
File "src/dune/lib.ml", line 416, characters 9-13:
Error: Syntax error: operator expected.
File "src/dune/context.ml", line 198, characters 7-8:
Error: Syntax error
File "src/dune/file_tree.ml", line 487, characters 9-10:
Error: Syntax error
File "src/dune/dep_graph.ml", line 25, characters 7-17:
Error: Syntax error
File "src/dune/expander.ml", line 136, characters 9-22:
Error: Syntax error: operator expected.
File "src/dune/case_lang.ml", line 12, characters 10-11:
Error: Syntax error: operator expected.
File "src/dune/module_compilation.ml", line 27, characters 7-11:
Error: Syntax error
File "src/dune/mode.ml", line 129, characters 14-18:
Error: Syntax error: operator expected.
File "src/dune/install_rules.ml", line 240, characters 13-14:
Error: Syntax error: operator expected.
File "src/dune/artifact_substitution.ml", line 357, characters 11-12:
Error: Syntax error: operator expected.
File "src/dune/dune_file.ml", line 35, characters 8-9:
Error: Syntax error: operator expected.
File "src/dune/lib_kind.ml", line 17, characters 9-10:
Error: Syntax error
File "src/dune/pform.ml", line 382, characters 7-8:
Error: Syntax error
File "src/dune/action_exec.ml", line 138, characters 7-8:
Error: Syntax error
File "src/dune/workspace.ml", line 25, characters 11-23:
Error: Syntax error
File "src/dune/stanza_common.ml", line 84, characters 9-10:
Error: Syntax error
File "src/dune/string_with_vars.ml", line 40, characters 7-21:
Error: Syntax error
File "src/dune/coq_lib.ml", line 137, characters 7-8:
Error: Syntax error
File "src/dune/coq_stanza.ml", line 13, characters 12-19:
Error: Syntax error: operator expected.
File "src/dune/wrapped.ml", line 14, characters 17-18:
Error: Syntax error: operator expected.
File "src/dune/foreign.ml", line 94, characters 5-6:
Error: Syntax error
File "src/dune/build.mli", line 40, characters 10-13:
Error: Syntax error: operator expected.
File "src/dune/preprocessing.ml", line 150, characters 16-19:
Error: Syntax error: operator expected.
File "src/dune/process.ml", line 448, characters 5-6:
Error: Syntax error
File "src/dune/config.ml", line 248, characters 7-14:
Error: Syntax error
File "src/dune/targets.ml", line 44, characters 7-21:
Error: Syntax error
File "src/dune/gen_rules.ml", line 236, characters 11-18:
Error: Syntax error
File "src/dune/action_dune_lang.ml", line 96, characters 8-11:
Error: Syntax error: operator expected.
File "src/dune/file_binding.ml", line 65, characters 13-20:
Error: Syntax error
File "src/dune/odoc.ml", line 157, characters 10-14:
Error: Syntax error: operator expected.
File "src/dune/dpath.ml", line 153, characters 9-18:
Error: Syntax error
File "src/dune/dune_env.ml", line 13, characters 9-10:
Error: Syntax error
File "src/dune/dune_package.ml", line 111, characters 10-11:
Error: Syntax error: operator expected.
File "src/dune/action_unexpanded.ml", line 613, characters 14-20:
Error: Syntax error: operator expected.
File "src/dune/modules.ml", line 48, characters 12-28:
Error: Syntax error: operator expected.
File "src/dune/foreign_rules.ml", line 166, characters 16-17:
Error: Syntax error: operator expected.
File "src/dune/sub_dirs.ml", line 224, characters 7-12:
Error: Syntax error
File "src/dune/cinaps.ml", line 27, characters 10-13:
Error: Syntax error: operator expected.
File "src/dune/diff.ml", line 22, characters 7-12:
Error: Syntax error
File "src/dune/alias.ml", line 68, characters 7-8:
Error: Syntax error
File "src/dune/opam_create.ml", line 157, characters 10-18:
Error: Syntax error: operator expected.
File "src/dune/dune_project.ml", line 369, characters 11-12:
Error: Syntax error
File "src/dune/print_diff.ml", line 45, characters 7-8:
Error: Syntax error
File "src/dune/mdx.ml", line 27, characters 9-10:
Error: Syntax error
File "src/dune/ml_sources.ml", line 257, characters 13-14:
Error: Syntax error: operator expected.
File "src/dune/merlin.ml", line 140, characters 9-10:
Error: Syntax error: operator expected.
File "src/dune/utop.ml", line 26, characters 5-6:
Error: Syntax error: operator expected.
File "src/dune/link_time_code_gen.ml", line 174, characters 7-15:
Error: Syntax error
File "src/dune/dep_rules.ml", line 29, characters 12-13:
Error: Syntax error: operator expected.
File "src/dune/bindings.ml", line 40, characters 7-8:
Error: Syntax error
File "src/dune/build.ml", line 50, characters 8-11:
Error: Syntax error: operator expected.
File "src/dune/format_rules.ml", line 49, characters 11-12:
Error: Syntax error
File "src/dune/scheduler.ml", line 618, characters 7-8:
Error: Syntax error
File "src/dune/lib_dep.ml", line 14, characters 12-13:
Error: Syntax error: operator expected.
File "src/dune/module_name.ml", line 95, characters 9-10:
Error: Syntax error
File "src/dune/action_ast.ml", line 57, characters 19-23:
Error: Syntax error: operator expected.
File "src/dune/package.ml", line 44, characters 7-8:
Error: Syntax error
File "src/dune/main.ml", line 62, characters 7-15:
Error: Syntax error
File "src/dune/foreign_sources.ml", line 91, characters 13-14:
Error: Syntax error: operator expected.
File "src/dune/artifacts.ml", line 63, characters 9-12:
Error: Syntax error
File "src/dune/watermarks.ml", line 167, characters 15-18:
Error: Syntax error
File "src/dune/ocaml_flags.ml", line 81, characters 9-15:
Error: Syntax error
File "src/dune/exe_rules.ml", line 99, characters 9-14:
Error: Syntax error
File "src/dune/blang.ml", line 77, characters 15-16:
Error: Syntax error: operator expected.
File "src/dune/build_system.ml", line 125, characters 11-19:
Error: Syntax error
File "src/dune/inline_tests.ml", line 34, characters 16-19:
Error: Syntax error: operator expected.
File "bin/external_lib_deps.ml", line 117, characters 7-13:
Error: Syntax error
File "bin/install_uninstall.ml", line 18, characters 7-8:
Error: Syntax error
File "bin/format_dune_file.ml", line 19, characters 7-15:
Error: Syntax error
File "bin/init.ml", line 41, characters 5-6:
Error: Syntax error
File "bin/help.ml", line 109, characters 10-20:
Error: Syntax error
File "bin/installed_libraries.ml", line 9, characters 7-13:
Error: Syntax error
File "bin/printenv.ml", line 16, characters 7-10:
Error: Syntax error
File "bin/describe.ml", line 149, characters 12-13:
Error: Syntax error
File "bin/common.ml", line 11, characters 8-11:
Error: Syntax error: operator expected.
File "bin/exec.ml", line 36, characters 7-13:
Error: Syntax error
File "bin/subst.ml", line 61, characters 7-8:
Error: Syntax error
File "bin/compute.ml", line 19, characters 10-16:
Error: Syntax error
File "bin/caching.ml", line 61, characters 7-8:
Error: Syntax error
File "bin/utop.ml", line 17, characters 7-13:
Error: Syntax error
File "bin/print_rules.ml", line 77, characters 9-17:
Error: Syntax error
File "bin/import.ml", line 84, characters 7-8:
Error: Syntax error
File "bin/upgrade.ml", line 17, characters 7-13:
Error: Syntax error
File "bin/main.ml", line 7, characters 7-8:
Error: Syntax error
File "bin/common.mli", line 69, characters 8-11:
Error: Syntax error: operator expected.
File "bin/top.ml", line 25, characters 7-13:
Error: Syntax error


Close

Error on dune.2.5.1 (4.08.0+gpr2165+bench)

Command:

~/.opam/4.08.0+gpr2165+bench/bin/ocaml bootstrap.ml -j 7

Output

ocamlc -output-complete-exe -w -24 -g -o .duneboot.exe -I boot unix.cma boot/libs.ml boot/duneboot.ml
ocamlc: unknown option '-output-complete-exe'.
Usage: ocamlc <options> <files>
Options are:
  -a  Build a library
  -alert <list>  Enable or disable alerts according to <list>:
        +<alertname>  enable alert <alertname>
        -<alertname>  disable alert <alertname>
        ++<alertname> treat <alertname> as fatal error
        --<alertname> treat <alertname> as non-fatal
        @<alertname>  enable <alertname> and treat it as fatal error
    <alertname> can be 'all' to refer to all alert names
  -absname  Show absolute filenames in error messages
  -annot  Save information in <filename>.annot
  -bin-annot  Save typedtree in <filename>.cmt
  -c  Compile only (do not link)
  -cc <command>  Use <command> as the C compiler and linker
  -cclib <opt>  Pass option <opt> to the C linker
  -ccopt <opt>  Pass option <opt> to the C compiler and linker
  -color {auto|always|never}  Enable or disable colors in compiler messages
    The following settings are supported:
      auto    use heuristics to enable colors only if supported
      always  enable colors
      never   disable colors
    The default setting is 'auto', and the current heuristic
    checks that the TERM environment variable exists and is
    not empty or "dumb", and that isatty(stderr) holds.
  If the option is not specified, these setting can alternatively
  be set through the OCAML_COLOR environment variable.
  -error-style {contextual|short}  Control the way error messages and warnings are printed
    The following settings are supported:
      short       only print the error and its location
      contextual  like "short", but also display the source code
                  snippet corresponding to the location of the error
    The default setting is 'contextual'.
  If the option is not specified, these setting can alternatively
  be set through the OCAML_ERROR_STYLE environment variable.
  -compat-32  Check that generated bytecode can run on 32-bit platforms
  -config  Print configuration values and exit
  -config-var  Print the value of a configuration variable, a newline, and exit
    (print nothing and exit with error value if the variable does not exist)
  -custom  Link in custom mode
  -dllib <lib>  Use the dynamically-loaded library <lib>
  -dllpath <dir>  Add <dir> to the run-time search path for shared libraries
  -dtypes  (deprecated) same as -annot
  -for-pack <ident>  Generate code that can later be `packed' with
     ocamlc -pack -o <ident>.cmo
  -g  Save debugging information
  -stop-after {parsing|typing} Stop after the given compilation pass.
  -i  Print inferred interface
  -I <dir>  Add <dir> to the list of include directories
  -impl <file>  Compile <file> as a .ml file
  -intf <file>  Compile <file> as a .mli file
  -intf-suffix <string>  Suffix for interface files (default: .mli)
  -intf_suffix <string>  (deprecated) same as -intf-suffix
  -keep-docs  Keep documentation strings in .cmi files
  -no-keep-docs  Do not keep documentation strings in .cmi files (default)
  -keep-locs  Keep locations in .cmi files (default)
  -no-keep-locs  Do not keep locations in .cmi files
  -labels  Use commuting label mode
  -linkall  Link all modules, even unused ones
  -make-runtime  Build a runtime system with given C objects and libraries
  -make_runtime  (deprecated) same as -make-runtime
  -modern  (deprecated) same as -labels
  -alias-deps  Do record dependencies for module aliases
  -no-alias-deps  Do not record dependencies for module aliases
  -app-funct  Activate applicative functors
  -no-app-funct  Deactivate applicative functors
  -no-check-prims  Do not check runtime for primitives
  -noassert  Do not compile assertion checks
  -noautolink  Do not automatically link C libraries specified in .cma files
  -nolabels  Ignore non-optional labels in types
  -nostdlib  Do not add default directory to the list of include directories
  -nopervasives  (undocumented)
  -o <file>  Set output file name to <file>
  -opaque  Does not generate cross-module optimization information
     (reduces necessary recompilation on module change)
  -open <module>  Opens the module <module> before typing
  -output-obj  Output an object file instead of an executable
  -output-complete-obj  Output an object file, including runtime, instead of an executable
  -pack  Package the given .cmo files into one .cmo
  -pp <command>  Pipe sources through preprocessor <command>
  -ppx <command>  Pipe abstract syntax trees through preprocessor <command>
  -plugin <plugin>  (no longer supported)
  -principal  Check principality of type inference
  -no-principal  Do not check principality of type inference (default)
  -rectypes  Allow arbitrary recursive types
  -no-rectypes  Do not allow arbitrary recursive types (default)
  -runtime-variant <str>  Use the <str> variant of the run-time system
  -with-runtime Include the runtime system in the generated program (default)
  -without-runtime Do not include the runtime system in the generated program.
  -safe-string  Make strings immutable (default)
  -short-paths  Shorten paths in types
  -strict-sequence  Left-hand part of a sequence must have type unit
  -no-strict-sequence  Left-hand part of a sequence need not have type unit (default)
  -strict-formats  Reject invalid formats accepted by legacy implementations
     (Warning: Invalid formats may behave differently from
      previous OCaml versions, and will become always-rejected
      in future OCaml versions. You should always use this flag
      to detect invalid formats so you can fix them.)
  -no-strict-formats  Accept invalid formats accepted by legacy implementations (default)
     (Warning: Invalid formats may behave differently from
      previous OCaml versions, and will become always-rejected
      in future OCaml versions. You should never use this flag
      and instead fix invalid formats.)
  -thread  (deprecated) same as -I +threads
  -unboxed-types  unannotated unboxable types will be unboxed
  -no-unboxed-types  unannotated unboxable types will not be unboxed (default)
  -unsafe  Do not compile bounds checking on array and string access
  -unsafe-string  Make strings mutable
  -use-runtime <file>  Generate bytecode for the given runtime system
  -use_runtime <file>  (deprecated) same as -use-runtime
  -v  Print compiler version and location of standard library and exit
  -verbose  Print calls to external commands
  -version  Print version and exit
  --version  Print version and exit
  -vmthread   (no longer supported)
  -vnum  Print version number and exit
  -w <list>  Enable or disable warnings according to <list>:
        +<spec>   enable warnings in <spec>
        -<spec>   disable warnings in <spec>
        @<spec>   enable warnings in <spec> and treat them as errors
     <spec> can be:
        <num>             a single warning number
        <num1>..<num2>    a range of consecutive warning numbers
        <letter>          a predefined set
     default setting is "+a-4-6-7-9-27-29-32..42-44-45-48-50-60-66"
  -warn-error <list>  Enable or disable error status for warnings according
     to <list>.  See option -w for the syntax of <list>.
     Default setting is "-a+31"
  -warn-help  Show description of warning numbers
  -where  Print location of standard library and exit
  - <file>  Treat <file> as a file name (even if it starts with `-')
  -match-context-rows <n>  (advanced, see manual section 9.2.)
  -use-prims <file>  (undocumented)
  -dno-unique-ids  (undocumented)
  -dunique-ids  (undocumented)
  -dsource  (undocumented)
  -dparsetree  (undocumented)
  -dtypedtree  (undocumented)
  -drawlambda  (undocumented)
  -dlambda  (undocumented)
  -dinstr  (undocumented)
  -dcamlprimc  (undocumented)
  -dtimings  Print timings information for each pass
  -dprofile  Print performance information for each pass
    The columns are: time alloc top-heap absolute-top-heap.
  -dump-into-file  dump output like -dlambda into <target>.dump
  -args <file> Read additional newline-terminated command line arguments
      from <file>
  -args0 <file> Read additional null character terminated command line arguments
from <file>
  -depend <options> Compute dependencies (use 'ocamlc -depend -help' for details)
  -help  Display this list of options
  --help  Display this list of options
Close

Error on core-micro-bench.1.0 (4.03.1+bench)

Command:

/usr/bin/make -C core_micro

Output

make: Entering directory '/home/louis/.opam/4.03.1+bench/.opam-switch/build/core-micro-bench.1.0/core_micro'
ocamlbuild -use-ocamlfind runner.native
ocamlfind ocamldep -package str -package core -package core_bench.inline_benchmarks -modules runner.ml > runner.ml.depends
ocamlfind ocamlc -c -thread -package str -package core -package core_bench.inline_benchmarks -o runner.cmo runner.ml
+ ocamlfind ocamlc -c -thread -package str -package core -package core_bench.inline_benchmarks -o runner.cmo runner.ml
File "runner.ml", line 1, characters 5-13:
Warning 3: deprecated: module Core.Std
[since 2017-02] Use Core. The Std sub-module is no longer needed
File "runner.ml", line 3, characters 15-55:
Error: Unbound module Pa_bench_lib
Command exited with code 2.
Makefile:4: recipe for target 'all' failed
make: *** [all] Error 10
make: Leaving directory '/home/louis/.opam/4.03.1+bench/.opam-switch/build/core-micro-bench.1.0/core_micro'
Close

Error on conf-graphviz.0.1 (4.03.1+bench)

Command:

/usr/bin/which dot

Output


Close

Error on cohttp-bench.1.0 (4.03.1+bench)

Command:

/usr/bin/make -C cohttp

Output

make: Entering directory '/home/louis/.opam/4.03.1+bench/.opam-switch/build/cohttp-bench.1.0/cohttp'
ocamlbuild -use-ocamlfind cohttp_lwt_bench.native cohttp_async_bench.native
ocamlfind ocamldep -package lwt.unix -package cohttp.lwt -modules cohttp_lwt_bench.ml > cohttp_lwt_bench.ml.depends
+ ocamlfind ocamldep -package lwt.unix -package cohttp.lwt -modules cohttp_lwt_bench.ml > cohttp_lwt_bench.ml.depends
ocamlfind: Package `cohttp-lwt-unix' not found - required by `cohttp.lwt'
Command exited with code 2.
Makefile:6: recipe for target 'all' failed
make: *** [all] Error 10
make: Leaving directory '/home/louis/.opam/4.03.1+bench/.opam-switch/build/cohttp-bench.1.0/cohttp'
Close

Error on chameneos-bench.1.0 (4.03.1+bench)

Command:

/usr/bin/make -C chameneos-redux

Output

make: Entering directory '/home/louis/.opam/4.03.1+bench/.opam-switch/build/chameneos-bench.1.0/chameneos-redux'
ocamlopt -bin-annot -thread unix.cmxa threads.cmxa chameneos_redux_th.ml -o chameneos_redux_th
ocamlopt -bin-annot -thread unix.cmxa threads.cmxa chameneos_redux_evtchn.ml -o chameneos_redux_evtchn
ocamlfind ocamlopt -bin-annot -package lwt.unix -linkpkg chameneos_redux_lwt.ml -o chameneos_redux_lwt
ocamlfind: [WARNING] Package `threads': Linking problems may arise because of the missing -thread or -vmthread switch
File "chameneos_redux_lwt.ml", line 1:
Error: No implementations provided for the following modules:
         Mutex referenced from /home/louis/.opam/4.03.1+bench/lib/lwt/unix/lwt_unix.cmxa(Lwt_main)
Makefile:6: recipe for target 'chameneos_redux_lwt' failed
make: *** [chameneos_redux_lwt] Error 2
make: Leaving directory '/home/louis/.opam/4.03.1+bench/.opam-switch/build/chameneos-bench.1.0/chameneos-redux'
Close

Error on async-rpc-bench.1.0 (4.03.1+bench)

Command:

/usr/bin/make -C async_rpc

Output

make: Entering directory '/home/louis/.opam/4.03.1+bench/.opam-switch/build/async-rpc-bench.1.0/async_rpc'
ocamlfind ocamlopt -thread -syntax camlp4o -package async -package bin_prot.syntax -package core -c rpc_common.ml
ocamlfind: Package `bin_prot.syntax' not found
Makefile:12: recipe for target 'rpc_common.cmx' failed
make: *** [rpc_common.cmx] Error 2
make: Leaving directory '/home/louis/.opam/4.03.1+bench/.opam-switch/build/async-rpc-bench.1.0/async_rpc'
Close

Error on async-echo-bench.1.0 (4.03.1+bench)

Command:

/usr/bin/make -C async_echo

Output

make: Entering directory '/home/louis/.opam/4.03.1+bench/.opam-switch/build/async-echo-bench.1.0/async_echo'
ocamlfind ocamlopt -thread -syntax camlp4o -package async -package bin_prot.syntax -package core -c echo_common.ml
ocamlfind: Package `bin_prot.syntax' not found
Makefile:20: recipe for target 'echo_common.cmx' failed
make: *** [echo_common.cmx] Error 2
make: Leaving directory '/home/louis/.opam/4.03.1+bench/.opam-switch/build/async-echo-bench.1.0/async_echo'