Package4.03.1+bench4.05.0+flambda+opt+bench4.06.1+flambda+bench4.06.1+flambda+opt+bench4.07.1+clambda+bench4.07.1+flambda+bench4.07.1+oclassic+bench4.08.0+gpr2165+bench4.08.0+mutmatch+bench4.08.0+trunk+bench4.08.0+trunk+flambda+bench4.08.0+trunk+flambda+oclassic+bench4.08.0+trunk+flambda+opt+bench4.03.1+bench time (s)4.05.0+flambda+opt+bench time (s)4.06.1+flambda+bench time (s)4.06.1+flambda+opt+bench time (s)4.07.1+clambda+bench time (s)4.07.1+flambda+bench time (s)4.07.1+oclassic+bench time (s)4.08.0+gpr2165+bench time (s)4.08.0+mutmatch+bench time (s)4.08.0+trunk+bench time (s)4.08.0+trunk+flambda+bench time (s)4.08.0+trunk+flambda+oclassic+bench time (s)4.08.0+trunk+flambda+opt+bench time (s)
almabench-bench.1.0----------Aborted------------0.000--
alt-ergo.2.3.2----OKOK----Aborted------16.1313.777----0.000--
alt-ergo-lib.2.3.2----OKOK----Aborted------43.52359.851----0.000--
alt-ergo-parsers.2.3.2----OKOK----Aborted------9.3868.964----0.000--
async.v0.12.0----OKOK-----------2.3153.669-------
async.v0.13.0--------AbortedAbortedAborted----------0.0000.0000.000--
async-echo-bench.1.0----Failure (2)Failure (2)--AbortedAbortedAborted------2.2110.591--0.0000.0000.000--
async-rpc-bench.1.0----Failure (2)Failure (2)--AbortedAbortedAborted------2.1220.497--0.0000.0000.000--
async_extra.v0.12.0----OKOK-----------4.9664.928-------
async_kernel.v0.12.0----OKOK-----------17.46820.356-------
async_kernel.v0.13.0--------AbortedAbortedAborted----------0.0000.0000.000--
async_rpc_kernel.v0.12.0----OKOK-----------9.35915.960-------
async_rpc_kernel.v0.13.0--------AbortedAbortedAborted----------0.0000.0000.000--
async_unix.v0.12.0----OKOK-----------13.32719.544-------
async_unix.v0.13.0--------AbortedAbortedAborted----------0.0000.0000.000--
base.v0.12.2----OKOK-----------14.20524.612-------
base.v0.13.2--------AbortedOKAborted----------0.00010.8000.000--
base-bytes.base----------Aborted------------0.000--
base64.3.4.0----OKOK--AbortedOKAborted------38.3805.253--0.0002.4730.000--
base_bigstring.v0.12.0----OKOK-----------1.8713.920-------
base_bigstring.v0.13.0--------AbortedAbortedAborted----------0.0000.0000.000--
base_quickcheck.v0.12.1----OKOK-----------4.3415.122-------
base_quickcheck.v0.13.0--------AbortedAbortedAborted----------0.0000.0000.000--
bdd-bench.1.0----------Aborted------------0.000--
bin_prot.v0.12.0----OKOK-----------7.25412.379-------
bin_prot.v0.13.0--------AbortedAbortedAborted----------0.0000.0000.000--
biniou.1.2.1----OKOK--AbortedOKAborted------25.87229.929--0.00022.4950.000--
camlimages.5.0.1--------Aborted-Aborted----------0.000-0.000--
camlpdf.2.3----------Aborted------------0.000--
camlzip.1.10----------Aborted------------0.000--
chameneos-bench.1.0----Failure (2)Failure (2)--AbortedAbortedAborted------2.0390.493--0.0000.0000.000--
cohttp.2.4.0----OKOK-----------5.5669.805-------
cohttp.2.5.1--------AbortedAbortedAborted----------0.0000.0000.000--
cohttp-bench.1.0----Failure (2)Failure (2)--AbortedAbortedAborted------1.8990.288--0.0000.0000.000--
conf-graphviz.0.1----Failure (1)Failure (1)-----------0.1950.188-------
configurator.v0.11.0----OKOK--AbortedOKAborted------6.6482.539--0.0003.4590.000--
core.v0.12.4----OKOK-----------27.41437.345-------
core.v0.13.0--------AbortedAbortedAborted----------0.0000.0000.000--
core-micro-bench.1.0----Failure (2)Failure (2)--AbortedAbortedAborted------1.5970.310--0.0000.0000.000--
core-sequence-bench.1.0----OKOK--AbortedAbortedAborted------0.0600.052--0.0000.0000.000--
core_bench.v0.12.0----OKOK-----------9.3586.717-------
core_bench.v0.13.0--------AbortedAbortedAborted----------0.0000.0000.000--
core_extended.v0.12.0----OKOK-----------5.9097.559-------
core_kernel.v0.12.3----OKOK-----------57.31268.834-------
core_kernel.v0.13.1--------AbortedAbortedAborted----------0.0000.0000.000--
cpdf.2.3----------Aborted------------0.000--
cpdf-bench.1.0----------Aborted------------0.000--
cppo.1.6.6----OKOK--AbortedOKAborted------0.8501.624--0.0001.4360.000--
dune.2.5.1----OKOK--Failure (2)OKAborted------13.13319.117--0.91312.3360.000--
dune-configurator.2.5.1----OKOK--AbortedOKAborted------13.62013.679--0.0009.1890.000--
dune-private-libs.2.5.1----OKOK--AbortedOKAborted------5.59615.082--0.0005.8760.000--
easy-format.1.3.2----OKOK--AbortedOKAborted------0.3170.432--0.0000.5150.000--
expect_test_helpers.v0.12.0----OKOK-----------2.3272.323-------
expect_test_helpers_kernel.v0.12.0----OKOK-----------7.9869.782-------
fieldslib.v0.12.0----OKOK-----------0.3018.067-------
fieldslib.v0.13.0--------AbortedOKAborted----------0.0000.3050.000--
frama-c.19.1----OKOK-----------109.843175.725-------
frama-c-bench.1.0----OKOK-----------0.4310.316-------
jane-street-headers.v0.12.0----OKOK-----------0.3360.279-------
jane-street-headers.v0.13.0--------AbortedOKAborted----------0.0000.3310.000--
jbuilder.1.0+beta20.2----------Aborted------------0.000--
json-bench-data.1.0----------Aborted------------0.000--
jsonm.1.0.1----------Aborted------------0.000--
jsonm-bench.1.0----------Aborted------------0.000--
jst-config.v0.12.0----OKOK-----------7.87714.056-------
jst-config.v0.13.0--------AbortedAbortedAborted----------0.0000.0000.000--
kb-bench.1.0----------Aborted------------0.000--
lexifi-g2pp-bench.1.0----------Aborted------------0.000--
lwt.5.3.0----OKOK--AbortedOKAborted------49.37413.970--0.0008.1990.000--
menhir.20200211----OKOK--AbortedOKAborted------25.51729.191--0.00021.6700.000--
menhir-bench.1.0----OKOK--AbortedOKAborted------0.3600.409--0.0000.2410.000--
menhirLib.20200211----OKOK--AbortedOKAborted------0.9921.490--0.0001.2790.000--
menhirSdk.20200211----OKOK--AbortedOKAborted------0.7120.782--0.0000.5380.000--
minilight.1.6----------Aborted------------0.000--
minilight-bench.1.0----------Aborted------------0.000--
mmap.1.1.0----OKOK--AbortedOKAborted------0.5030.409--0.0000.4170.000--
nbcodec.1.0----------Aborted------------0.000--
nbcodec-bench.1.0----------Aborted------------0.000--
num.1.3----------Aborted------------0.000--
numerical-analysis-bench.1.0---------Failure (2)Aborted-----------8.6250.000--
ocaml.4.08.0----------Aborted------------0.000--
ocaml-compiler-libs.v0.12.1----OKOK--AbortedOKAborted------1.7542.261--0.0002.4480.000--
ocaml-migrate-parsetree.1.7.3----OKOK--AbortedFailure (1)Aborted------8.78921.595--0.0005.0270.000--
ocaml-syntax-shims.1.0.0----OKOK-----------1.2601.943-------
ocaml-variants.4.08.0+trunk+flambda----------Failure (1)------------0.312--
ocamlbuild.0.14.0----------Aborted------------0.000--
ocamlfind.1.8.1----------Aborted------------0.000--
ocplib-endian.1.1----OKOK--AbortedOKAborted------24.74530.002--0.00022.7100.000--
ocplib-simplex.0.4----------Aborted------------0.000--
octavius.1.2.2----OKOK--AbortedOKAborted------2.0293.493--0.0003.1880.000--
parsexp.v0.12.0----OKOK-----------12.1868.031-------
parsexp.v0.13.0--------AbortedOKAborted----------0.0001.7240.000--
patdiff.v0.12.1----OKOK-----------4.8857.923-------
patdiff.v0.13.0--------AbortedAbortedAborted----------0.0000.0000.000--
patdiff-bench.1.0----OKOK--AbortedAbortedAborted------0.1870.191--0.0000.0000.000--
patience_diff.v0.12.0----OKOK-----------4.5906.763-------
patience_diff.v0.13.0--------AbortedAbortedAborted----------0.0000.0000.000--
pcre.7.4.1----OKOK-----------18.0797.995-------
pcre.7.4.3--------AbortedOKAborted----------0.0002.6040.000--
ppx_assert.v0.12.0----OKOK-----------5.52412.745-------
ppx_assert.v0.13.0--------AbortedAbortedAborted----------0.0000.0000.000--
ppx_base.v0.12.0----OKOK-----------10.01916.317-------
ppx_base.v0.13.0--------AbortedAbortedAborted----------0.0000.0000.000--
ppx_bench.v0.12.0----OKOK-----------3.4889.126-------
ppx_bench.v0.13.0--------AbortedAbortedAborted----------0.0000.0000.000--
ppx_bin_prot.v0.12.1----OKOK-----------3.9347.474-------
ppx_bin_prot.v0.13.0--------AbortedAbortedAborted----------0.0000.0000.000--
ppx_cold.v0.13.0--------AbortedAbortedAborted----------0.0000.0000.000--
ppx_compare.v0.12.0----OKOK-----------2.6294.196-------
ppx_compare.v0.13.0--------AbortedAbortedAborted----------0.0000.0000.000--
ppx_custom_printf.v0.12.1----OKOK-----------6.23614.815-------
ppx_custom_printf.v0.13.0--------AbortedAbortedAborted----------0.0000.0000.000--
ppx_derivers.1.2.1----OKOK--AbortedOKAborted------0.5250.550--0.0000.4050.000--
ppx_enumerate.v0.12.0----OKOK-----------2.2204.226-------
ppx_enumerate.v0.13.0--------AbortedAbortedAborted----------0.0000.0000.000--
ppx_expect.v0.12.0----OKOK-----------9.07014.356-------
ppx_expect.v0.13.1--------AbortedAbortedAborted----------0.0000.0000.000--
ppx_fail.v0.12.0----OKOK-----------5.00113.183-------
ppx_fail.v0.13.0--------AbortedAbortedAborted----------0.0000.0000.000--
ppx_fields_conv.v0.12.0----OKOK-----------2.4013.894-------
ppx_fields_conv.v0.13.0--------AbortedAbortedAborted----------0.0000.0000.000--
ppx_hash.v0.12.0----OKOK-----------7.18016.776-------
ppx_hash.v0.13.0--------AbortedAbortedAborted----------0.0000.0000.000--
ppx_here.v0.12.0----OKOK-----------1.9733.487-------
ppx_here.v0.13.0--------AbortedAbortedAborted----------0.0000.0000.000--
ppx_inline_test.v0.12.0----OKOK-----------3.1105.429-------
ppx_inline_test.v0.13.1--------AbortedAbortedAborted----------0.0000.0000.000--
ppx_jane.v0.12.0----OKOK-----------2.9131.891-------
ppx_jane.v0.13.0--------AbortedAbortedAborted----------0.0000.0000.000--
ppx_js_style.v0.12.0----OKOK-----------2.9955.325-------
ppx_js_style.v0.13.0--------AbortedAbortedAborted----------0.0000.0000.000--
ppx_let.v0.12.0----OKOK-----------2.1342.453-------
ppx_let.v0.13.0--------AbortedAbortedAborted----------0.0000.0000.000--
ppx_module_timer.v0.12.0----OKOK-----------4.5443.628-------
ppx_module_timer.v0.13.0--------AbortedAbortedAborted----------0.0000.0000.000--
ppx_optcomp.v0.12.0----OKOK-----------1.6391.804-------
ppx_optcomp.v0.13.0--------AbortedAbortedAborted----------0.0000.0000.000--
ppx_optional.v0.12.0----OKOK-----------3.6582.745-------
ppx_optional.v0.13.0--------AbortedAbortedAborted----------0.0000.0000.000--
ppx_pipebang.v0.12.0----OKOK-----------5.6846.449-------
ppx_pipebang.v0.13.0--------AbortedAbortedAborted----------0.0000.0000.000--
ppx_sexp_conv.v0.12.0----OKOK-----------7.1399.411-------
ppx_sexp_conv.v0.13.0--------AbortedAbortedAborted----------0.0000.0000.000--
ppx_sexp_message.v0.12.0----OKOK-----------7.18516.755-------
ppx_sexp_message.v0.13.0--------AbortedAbortedAborted----------0.0000.0000.000--
ppx_sexp_value.v0.12.0----OKOK-----------9.70319.835-------
ppx_sexp_value.v0.13.0--------AbortedAbortedAborted----------0.0000.0000.000--
ppx_stable.v0.12.0----OKOK-----------10.24317.906-------
ppx_stable.v0.13.0--------AbortedAbortedAborted----------0.0000.0000.000--
ppx_typerep_conv.v0.12.0----OKOK-----------9.73317.809-------
ppx_typerep_conv.v0.13.0--------AbortedAbortedAborted----------0.0000.0000.000--
ppx_variants_conv.v0.12.0----OKOK-----------9.69017.655-------
ppx_variants_conv.v0.13.0--------AbortedAbortedAborted----------0.0000.0000.000--
ppxlib.0.13.0--------AbortedAbortedAborted----------0.0000.0000.000--
ppxlib.0.8.1----OKOK-----------12.27313.696-------
protocol_version_header.v0.12.0----OKOK-----------4.4435.009-------
protocol_version_header.v0.13.0--------AbortedAbortedAborted----------0.0000.0000.000--
psmt2-frontend.0.2----OKOK--Aborted-Aborted------56.85456.510--0.000-0.000--
re.1.9.0----OKOK--AbortedOKAborted------2.5824.845--0.00018.6410.000--
re2.v0.12.1----OKOK-----------65.81171.418-------
result.1.5----OKOK--AbortedOKAborted------0.8000.968--0.0000.8860.000--
sauvola-bench.1.0--------Aborted-Aborted----------0.000-0.000--
seq.base----------Aborted------------0.000--
sequence-bench.1.0----------Aborted------------0.000--
sexp_pretty.v0.12.0----OKOK-----------1.6964.827-------
sexplib.v0.12.0----OKOK-----------0.8093.770-------
sexplib.v0.13.0--------AbortedOKAborted----------0.0002.7830.000--
sexplib0.v0.12.0----OKOK-----------17.2461.312-------
sexplib0.v0.13.0--------AbortedOKAborted----------0.00022.7490.000--
shell.v0.12.0----OKOK-----------3.0573.858-------
spawn.v0.13.0----OKOK--AbortedOKAborted------22.2720.952--0.0000.9090.000--
splittable_random.v0.12.0----OKOK-----------8.62415.940-------
splittable_random.v0.13.0--------AbortedAbortedAborted----------0.0000.0000.000--
stdio.v0.12.0----OKOK-----------0.9167.960-------
stdio.v0.13.0--------AbortedOKAborted----------0.0000.9260.000--
stdlib-shims.0.1.0----OKOK--AbortedOKAborted------0.40028.829--0.0000.5180.000--
stringext.1.6.0----OKOK--AbortedOKAborted------24.31930.281--0.00022.9200.000--
textutils.v0.12.0----OKOK-----------8.7505.491-------
textutils.v0.13.0--------AbortedAbortedAborted----------0.0000.0000.000--
textutils_kernel.v0.12.0----OKOK-----------4.1285.330-------
thread-bench.1.0----Failure (2)Failure (2)--AbortedAbortedAborted------1.7490.200--0.0000.0000.000--
time_now.v0.12.0----OKOK-----------3.1973.113-------
time_now.v0.13.0--------AbortedAbortedAborted----------0.0000.0000.000--
topkg.1.0.1----------Aborted------------0.000--
typerep.v0.12.0----OKOK-----------18.5447.906-------
typerep.v0.13.0--------AbortedOKAborted----------0.0003.0010.000--
uchar.0.0.2----------Aborted------------0.000--
uri.3.1.0----OKOK--AbortedOKAborted------5.43912.316--0.0003.5150.000--
uri-sexp.3.1.0----OKOK--AbortedAbortedAborted------2.2484.276--0.0000.0000.000--
uutf.1.0.2----------Aborted------------0.000--
variantslib.v0.12.0----OKOK-----------17.7167.859-------
variantslib.v0.13.0--------AbortedOKAborted----------0.0004.7330.000--
why3.1.3.1----OKOK-----------38.18656.389-------
yojson.1.7.0----OKOK--AbortedOKAborted------1.89110.188--0.0002.6370.000--
yojson-bench.1.0----Failure (2)Failure (2)--AbortedFailure (2)Aborted------23.1960.516--0.0000.1780.000--
zarith.1.9.1----------Aborted------------0.000--
Close

Error on yojson-bench.1.0 (4.08.0+trunk+bench)

Command:

/usr/bin/make -C yojson

Output

make: Entering directory '/home/louis/.opam/4.08.0+trunk+bench/.opam-switch/build/yojson-bench.1.0/yojson'
ocamlfind ocamlopt -I `ocamlfind query yojson` -o ydump_bench -package easy-format,biniou -linkpkg yojson.cmx yojson_biniou.cmx ydump.ml
gcc: error: /home/louis/.opam/4.08.0+trunk+bench/lib/yojson/yojson_biniou.o: No such file or directory
gcc: error: /home/louis/.opam/4.08.0+trunk+bench/lib/yojson/yojson.o: No such file or directory
File "caml_startup", line 1:
Error: Error during linking (exit code 1)
Makefile:6: recipe for target 'all' failed
make: *** [all] Error 2
make: Leaving directory '/home/louis/.opam/4.08.0+trunk+bench/.opam-switch/build/yojson-bench.1.0/yojson'
Close

Error on yojson-bench.1.0 (4.07.1+flambda+bench)

Command:

/usr/bin/make -C yojson

Output

make: Entering directory '/home/louis/.opam/4.07.1+flambda+bench/.opam-switch/build/yojson-bench.1.0/yojson'
ocamlfind ocamlopt -I `ocamlfind query yojson` -o ydump_bench -package easy-format,biniou -linkpkg yojson.cmx yojson_biniou.cmx ydump.ml
gcc: error: /home/louis/.opam/4.07.1+flambda+bench/lib/yojson/yojson_biniou.o: No such file or directory
gcc: error: /home/louis/.opam/4.07.1+flambda+bench/lib/yojson/yojson.o: No such file or directory
File "caml_startup", line 1:
Error: Error during linking
Makefile:6: recipe for target 'all' failed
make: *** [all] Error 2
make: Leaving directory '/home/louis/.opam/4.07.1+flambda+bench/.opam-switch/build/yojson-bench.1.0/yojson'
Close

Error on yojson-bench.1.0 (4.07.1+clambda+bench)

Command:

/usr/bin/make -C yojson

Output

make: Entering directory '/home/louis/.opam/4.07.1+clambda+bench/.opam-switch/build/yojson-bench.1.0/yojson'
ocamlfind ocamlopt -I `ocamlfind query yojson` -o ydump_bench -package easy-format,biniou -linkpkg yojson.cmx yojson_biniou.cmx ydump.ml
gcc: error: /home/louis/.opam/4.07.1+clambda+bench/lib/yojson/yojson_biniou.o: No such file or directory
gcc: error: /home/louis/.opam/4.07.1+clambda+bench/lib/yojson/yojson.o: No such file or directory
File "caml_startup", line 1:
Error: Error during linking
Makefile:6: recipe for target 'all' failed
make: *** [all] Error 2
make: Leaving directory '/home/louis/.opam/4.07.1+clambda+bench/.opam-switch/build/yojson-bench.1.0/yojson'
Close

Error on thread-bench.1.0 (4.07.1+flambda+bench)

Command:

/usr/bin/make -C thread

Output

make: Entering directory '/home/louis/.opam/4.07.1+flambda+bench/.opam-switch/build/thread-bench.1.0/thread'
ocamlfind ocamlopt -package lwt.unix -linkpkg -o thread_sleep_lwt thread_sleep_lwt.ml
ocamlfind: [WARNING] Package `threads': Linking problems may arise because of the missing -thread or -vmthread switch
File "thread_sleep_lwt.ml", line 1:
Error: No implementations provided for the following modules:
         Mutex referenced from /home/louis/.opam/4.07.1+flambda+bench/lib/lwt/unix/lwt_unix.cmxa(Lwt_main)
Makefile:7: recipe for target 'thread_sleep_lwt' failed
make: *** [thread_sleep_lwt] Error 2
make: Leaving directory '/home/louis/.opam/4.07.1+flambda+bench/.opam-switch/build/thread-bench.1.0/thread'
Close

Error on thread-bench.1.0 (4.07.1+clambda+bench)

Command:

/usr/bin/make -C thread

Output

make: Entering directory '/home/louis/.opam/4.07.1+clambda+bench/.opam-switch/build/thread-bench.1.0/thread'
ocamlfind ocamlopt -package lwt.unix -linkpkg -o thread_sleep_lwt thread_sleep_lwt.ml
ocamlfind: [WARNING] Package `threads': Linking problems may arise because of the missing -thread or -vmthread switch
File "thread_sleep_lwt.ml", line 1:
Error: No implementations provided for the following modules:
         Mutex referenced from /home/louis/.opam/4.07.1+clambda+bench/lib/lwt/unix/lwt_unix.cmxa(Lwt_main)
Makefile:7: recipe for target 'thread_sleep_lwt' failed
make: *** [thread_sleep_lwt] Error 2
make: Leaving directory '/home/louis/.opam/4.07.1+clambda+bench/.opam-switch/build/thread-bench.1.0/thread'
Close

Error on ocaml-variants.4.08.0+trunk+flambda (4.08.0+trunk+flambda+bench)

Command:

~/.opam/4.08.0+trunk+flambda+bench/.opam-switch/build/ocaml-variants.4.08.0+trunk+flambda/./configure -prefix /home/louis/.opam/4.08.0+trunk+flambda+bench -flambda -with-debug-runtime

Output

configure: error: unrecognized option: `-flambda'
Try `/home/louis/.opam/4.08.0+trunk+flambda+bench/.opam-switch/build/ocaml-variants.4.08.0+trunk+flambda/./configure --help' for more information
Close

Error on ocaml-migrate-parsetree.1.7.3 (4.08.0+trunk+bench)

Command:

~/.opam/4.08.0+trunk+bench/bin/dune build -p ocaml-migrate-parsetree -j 7

Output

       ocaml src/ast-version,src/compiler-functions-file (exit 1)
(cd _build/default/src && /home/louis/.opam/4.08.0+trunk+bench/bin/ocaml config/gen.ml 4.12.0+dev0-2020-04-22)
Unkown OCaml version 4.12.0+dev0-2020-04-22
Close

Error on numerical-analysis-bench.1.0 (4.08.0+trunk+bench)

Command:

/usr/bin/make

Output

ulimit -s 98304; ocamlopt.opt  -I simple_access `ocamldep.opt -sort simple_access/*.ml` main_nogcstats.ml -o simple_access.opt
ulimit -s 98304; ocamlopt.opt  -I lu-decomposition `ocamldep.opt -sort lu-decomposition/*.ml` main_nogcstats.ml -o lu-decomposition.opt
ulimit -s 98304; ocamlopt.opt  -I fft `ocamldep.opt -sort fft/*.ml` main_nogcstats.ml -o fft.opt
ulimit -s 98304; ocamlopt.opt  -I rnd_access `ocamldep.opt -sort rnd_access/*.ml` main_nogcstats.ml -o rnd_access.opt
ulimit -s 98304; ocamlopt.opt  -I k-means `ocamldep.opt -sort k-means/*.ml` main_nogcstats.ml -o k-means.opt
Fatal error: exception Stack overflow
Makefile:20: recipe for target 'k-means.opt' failed
make: *** [k-means.opt] Error 2
Close

Error on dune.2.5.1 (4.08.0+mutmatch+bench)

Command:

~/.opam/4.08.0+mutmatch+bench/bin/ocaml bootstrap.ml -j 7

Output

ocamlc -custom -w -24 -g -o .duneboot.exe -I boot unix.cma boot/libs.ml boot/duneboot.ml
./.duneboot.exe -j 7
cd _boot && /home/louis/.opam/4.08.0+mutmatch+bench/bin/ocamldep.opt -modules -map main__.ml -map build_info__.ml -map dune.ml -map dune_action_plugin__.ml -map jbuild_support.ml -map dune_glob__.ml -map dune_re__.ml -map cache_daemon__.ml -map cache__.ml -map dune_util.ml -map memo__.ml -map dag__.ml -map incremental_cycles__.ml -map dune_lang__.ml -map stdune__.ml -map dune_csexp.ml -args source_files
File "src/stdune/result.ml", line 67, characters 8-11:
Error: Syntax error: operator expected.
File "src/stdune/daemonize.ml", line 90, characters 11-13:
Error: Syntax error: operator expected.
File "src/stdune/loc.ml", line 75, characters 7-8:
Error: Syntax error
File "src/stdune/applicative.ml", line 5, characters 10-13:
Error: Syntax error: operator expected.
File "src/stdune/monad.ml", line 5, characters 10-13:
Error: Syntax error: operator expected.
File "src/stdune/monad_intf.ml", line 13, characters 10-13:
Error: Syntax error: operator expected.
File "src/stdune/applicative_intf.ml", line 17, characters 10-13:
Error: Syntax error: operator expected.
File "src/stdune/option.mli", line 12, characters 8-11:
Error: Syntax error: operator expected.
File "src/stdune/result.mli", line 31, characters 8-11:
Error: Syntax error: operator expected.
File "src/stdune/option.ml", line 16, characters 8-11:
Error: Syntax error: operator expected.
File "src/dune_lang/syntax.ml", line 97, characters 9-10:
Error: Syntax error
File "src/dune_lang/decoder.mli", line 239, characters 6-9:
Error: Syntax error: operator expected.
File "src/dune_lang/versioned_file.ml", line 110, characters 7-8:
Error: Syntax error
File "src/dune_lang/decoder.ml", line 98, characters 6-9:
Error: Syntax error: operator expected.
File "src/fiber/fiber.ml", line 198, characters 8-11:
Error: Syntax error: operator expected.
File "src/fiber/fiber.mli", line 37, characters 8-11:
Error: Syntax error: operator expected.
File "src/memo/memo.ml", line 117, characters 13-16:
Error: Syntax error: operator expected.
File "src/cache/local.ml", line 146, characters 11-16:
Error: Syntax error
File "src/cache/client.ml", line 24, characters 5-6:
Error: Syntax error
File "src/cache/messages.ml", line 98, characters 13-18:
Error: Syntax error
File "src/cache_daemon/cache_daemon.ml", line 135, characters 9-10:
Error: Syntax error
File "src/ocaml-config/ocaml_config.ml", line 307, characters 7-8:
Error: Syntax error
File "otherlibs/action-plugin/src/dune_action_plugin.ml", line 189, characters 10-13:
Error: Syntax error: operator expected.
File "otherlibs/action-plugin/src/protocol.ml", line 106, characters 11-12:
Error: Syntax error
File "otherlibs/action-plugin/src/dune_action_plugin.mli", line 52, characters 10-13:
Error: Syntax error: operator expected.
File "otherlibs/action-plugin/src/serializable_intf.ml", line 40, characters 7-8:
Error: Syntax error
File "src/dune/coq_rules.ml", line 138, characters 9-10:
Error: Syntax error
File "src/dune/stringlike.ml", line 49, characters 13-14:
Error: Syntax error: operator expected.
File "src/dune/dep_conf.ml", line 28, characters 7-8:
Error: Syntax error
File "src/dune/dune_init.ml", line 86, characters 9-10:
Error: Syntax error: operator expected.
File "src/dune/obj_dir.ml", line 64, characters 12-23:
Error: Syntax error: operator expected.
File "src/dune/ocamldep.ml", line 106, characters 11-16:
Error: Syntax error
File "src/dune/ordered_set_lang.ml", line 90, characters 13-22:
Error: Syntax error
File "src/dune/super_context.ml", line 86, characters 7-8:
Error: Syntax error
File "src/dune/module.ml", line 274, characters 10-14:
Error: Syntax error: operator expected.
File "src/dune/lib_info.ml", line 25, characters 12-15:
Error: Syntax error: operator expected.
File "src/dune/vcs.ml", line 47, characters 12-16:
Error: Syntax error: operator expected.
File "src/dune/dialect.ml", line 42, characters 9-12:
Error: Syntax error
File "src/dune/sub_system.ml", line 40, characters 7-8:
Error: Syntax error
File "src/dune/simple_rules.ml", line 202, characters 17-18:
Error: Syntax error: operator expected.
File "src/dune/findlib/findlib.ml", line 427, characters 11-12:
Error: Syntax error: operator expected.
File "src/dune/format_config.ml", line 58, characters 9-17:
Error: Syntax error
File "src/dune/dune_load.ml", line 193, characters 11-12:
Error: Syntax error: operator expected.
File "src/dune/predicate_lang.ml", line 38, characters 9-10:
Error: Syntax error
File "src/dune/ocaml_stdlib.ml", line 21, characters 10-31:
Error: Syntax error: operator expected.
File "src/dune/stats.ml", line 62, characters 9-15:
Error: Syntax error
File "src/dune/lib.ml", line 416, characters 9-13:
Error: Syntax error: operator expected.
File "src/dune/context.ml", line 198, characters 7-8:
Error: Syntax error
File "src/dune/file_tree.ml", line 487, characters 9-10:
Error: Syntax error
File "src/dune/dep_graph.ml", line 25, characters 7-17:
Error: Syntax error
File "src/dune/expander.ml", line 136, characters 9-22:
Error: Syntax error: operator expected.
File "src/dune/case_lang.ml", line 12, characters 10-11:
Error: Syntax error: operator expected.
File "src/dune/module_compilation.ml", line 27, characters 7-11:
Error: Syntax error
File "src/dune/mode.ml", line 129, characters 14-18:
Error: Syntax error: operator expected.
File "src/dune/install_rules.ml", line 240, characters 13-14:
Error: Syntax error: operator expected.
File "src/dune/artifact_substitution.ml", line 357, characters 11-12:
Error: Syntax error: operator expected.
File "src/dune/dune_file.ml", line 35, characters 8-9:
Error: Syntax error: operator expected.
File "src/dune/lib_kind.ml", line 17, characters 9-10:
Error: Syntax error
File "src/dune/pform.ml", line 382, characters 7-8:
Error: Syntax error
File "src/dune/action_exec.ml", line 138, characters 7-8:
Error: Syntax error
File "src/dune/workspace.ml", line 25, characters 11-23:
Error: Syntax error
File "src/dune/stanza_common.ml", line 84, characters 9-10:
Error: Syntax error
File "src/dune/string_with_vars.ml", line 40, characters 7-21:
Error: Syntax error
File "src/dune/coq_lib.ml", line 137, characters 7-8:
Error: Syntax error
File "src/dune/coq_stanza.ml", line 13, characters 12-19:
Error: Syntax error: operator expected.
File "src/dune/wrapped.ml", line 14, characters 17-18:
Error: Syntax error: operator expected.
File "src/dune/foreign.ml", line 94, characters 5-6:
Error: Syntax error
File "src/dune/build.mli", line 40, characters 10-13:
Error: Syntax error: operator expected.
File "src/dune/preprocessing.ml", line 150, characters 16-19:
Error: Syntax error: operator expected.
File "src/dune/process.ml", line 448, characters 5-6:
Error: Syntax error
File "src/dune/config.ml", line 248, characters 7-14:
Error: Syntax error
File "src/dune/targets.ml", line 44, characters 7-21:
Error: Syntax error
File "src/dune/gen_rules.ml", line 236, characters 11-18:
Error: Syntax error
File "src/dune/action_dune_lang.ml", line 96, characters 8-11:
Error: Syntax error: operator expected.
File "src/dune/file_binding.ml", line 65, characters 13-20:
Error: Syntax error
File "src/dune/odoc.ml", line 157, characters 10-14:
Error: Syntax error: operator expected.
File "src/dune/dpath.ml", line 153, characters 9-18:
Error: Syntax error
File "src/dune/dune_env.ml", line 13, characters 9-10:
Error: Syntax error
File "src/dune/dune_package.ml", line 111, characters 10-11:
Error: Syntax error: operator expected.
File "src/dune/action_unexpanded.ml", line 613, characters 14-20:
Error: Syntax error: operator expected.
File "src/dune/modules.ml", line 48, characters 12-28:
Error: Syntax error: operator expected.
File "src/dune/foreign_rules.ml", line 166, characters 16-17:
Error: Syntax error: operator expected.
File "src/dune/sub_dirs.ml", line 224, characters 7-12:
Error: Syntax error
File "src/dune/cinaps.ml", line 27, characters 10-13:
Error: Syntax error: operator expected.
File "src/dune/diff.ml", line 22, characters 7-12:
Error: Syntax error
File "src/dune/alias.ml", line 68, characters 7-8:
Error: Syntax error
File "src/dune/opam_create.ml", line 157, characters 10-18:
Error: Syntax error: operator expected.
File "src/dune/dune_project.ml", line 369, characters 11-12:
Error: Syntax error
File "src/dune/print_diff.ml", line 45, characters 7-8:
Error: Syntax error
File "src/dune/mdx.ml", line 27, characters 9-10:
Error: Syntax error
File "src/dune/ml_sources.ml", line 257, characters 13-14:
Error: Syntax error: operator expected.
File "src/dune/merlin.ml", line 140, characters 9-10:
Error: Syntax error: operator expected.
File "src/dune/utop.ml", line 26, characters 5-6:
Error: Syntax error: operator expected.
File "src/dune/link_time_code_gen.ml", line 174, characters 7-15:
Error: Syntax error
File "src/dune/dep_rules.ml", line 29, characters 12-13:
Error: Syntax error: operator expected.
File "src/dune/bindings.ml", line 40, characters 7-8:
Error: Syntax error
File "src/dune/build.ml", line 50, characters 8-11:
Error: Syntax error: operator expected.
File "src/dune/format_rules.ml", line 49, characters 11-12:
Error: Syntax error
File "src/dune/scheduler.ml", line 618, characters 7-8:
Error: Syntax error
File "src/dune/lib_dep.ml", line 14, characters 12-13:
Error: Syntax error: operator expected.
File "src/dune/module_name.ml", line 95, characters 9-10:
Error: Syntax error
File "src/dune/action_ast.ml", line 57, characters 19-23:
Error: Syntax error: operator expected.
File "src/dune/package.ml", line 44, characters 7-8:
Error: Syntax error
File "src/dune/main.ml", line 62, characters 7-15:
Error: Syntax error
File "src/dune/foreign_sources.ml", line 91, characters 13-14:
Error: Syntax error: operator expected.
File "src/dune/artifacts.ml", line 63, characters 9-12:
Error: Syntax error
File "src/dune/watermarks.ml", line 167, characters 15-18:
Error: Syntax error
File "src/dune/ocaml_flags.ml", line 81, characters 9-15:
Error: Syntax error
File "src/dune/exe_rules.ml", line 99, characters 9-14:
Error: Syntax error
File "src/dune/blang.ml", line 77, characters 15-16:
Error: Syntax error: operator expected.
File "src/dune/build_system.ml", line 125, characters 11-19:
Error: Syntax error
File "src/dune/inline_tests.ml", line 34, characters 16-19:
Error: Syntax error: operator expected.
File "bin/external_lib_deps.ml", line 117, characters 7-13:
Error: Syntax error
File "bin/install_uninstall.ml", line 18, characters 7-8:
Error: Syntax error
File "bin/format_dune_file.ml", line 19, characters 7-15:
Error: Syntax error
File "bin/init.ml", line 41, characters 5-6:
Error: Syntax error
File "bin/help.ml", line 109, characters 10-20:
Error: Syntax error
File "bin/installed_libraries.ml", line 9, characters 7-13:
Error: Syntax error
File "bin/printenv.ml", line 16, characters 7-10:
Error: Syntax error
File "bin/describe.ml", line 149, characters 12-13:
Error: Syntax error
File "bin/common.ml", line 11, characters 8-11:
Error: Syntax error: operator expected.
File "bin/exec.ml", line 36, characters 7-13:
Error: Syntax error
File "bin/subst.ml", line 61, characters 7-8:
Error: Syntax error
File "bin/compute.ml", line 19, characters 10-16:
Error: Syntax error
File "bin/caching.ml", line 61, characters 7-8:
Error: Syntax error
File "bin/utop.ml", line 17, characters 7-13:
Error: Syntax error
File "bin/print_rules.ml", line 77, characters 9-17:
Error: Syntax error
File "bin/import.ml", line 84, characters 7-8:
Error: Syntax error
File "bin/upgrade.ml", line 17, characters 7-13:
Error: Syntax error
File "bin/main.ml", line 7, characters 7-8:
Error: Syntax error
File "bin/common.mli", line 69, characters 8-11:
Error: Syntax error: operator expected.
File "bin/top.ml", line 25, characters 7-13:
Error: Syntax error


Close

Error on core-micro-bench.1.0 (4.07.1+flambda+bench)

Command:

/usr/bin/make -C core_micro

Output

make: Entering directory '/home/louis/.opam/4.07.1+flambda+bench/.opam-switch/build/core-micro-bench.1.0/core_micro'
ocamlbuild -use-ocamlfind runner.native
ocamlfind ocamldep -package str -package core -package core_bench.inline_benchmarks -modules runner.ml > runner.ml.depends
ocamlfind ocamlc -c -thread -package str -package core -package core_bench.inline_benchmarks -o runner.cmo runner.ml
+ ocamlfind ocamlc -c -thread -package str -package core -package core_bench.inline_benchmarks -o runner.cmo runner.ml
File "runner.ml", line 1, characters 5-13:
Error: Unbound module Core.Std
Command exited with code 2.
Makefile:4: recipe for target 'all' failed
make: *** [all] Error 10
make: Leaving directory '/home/louis/.opam/4.07.1+flambda+bench/.opam-switch/build/core-micro-bench.1.0/core_micro'
Close

Error on core-micro-bench.1.0 (4.07.1+clambda+bench)

Command:

/usr/bin/make -C core_micro

Output

make: Entering directory '/home/louis/.opam/4.07.1+clambda+bench/.opam-switch/build/core-micro-bench.1.0/core_micro'
ocamlbuild -use-ocamlfind runner.native
ocamlfind ocamldep -package str -package core -package core_bench.inline_benchmarks -modules runner.ml > runner.ml.depends
ocamlfind ocamlc -c -thread -package str -package core -package core_bench.inline_benchmarks -o runner.cmo runner.ml
+ ocamlfind ocamlc -c -thread -package str -package core -package core_bench.inline_benchmarks -o runner.cmo runner.ml
File "runner.ml", line 1, characters 5-13:
Error: Unbound module Core.Std
Command exited with code 2.
Makefile:4: recipe for target 'all' failed
make: *** [all] Error 10
make: Leaving directory '/home/louis/.opam/4.07.1+clambda+bench/.opam-switch/build/core-micro-bench.1.0/core_micro'
Close

Error on conf-graphviz.0.1 (4.07.1+flambda+bench)

Command:

/usr/bin/which dot

Output


Close

Error on conf-graphviz.0.1 (4.07.1+clambda+bench)

Command:

/usr/bin/which dot

Output


Close

Error on cohttp-bench.1.0 (4.07.1+flambda+bench)

Command:

/usr/bin/make -C cohttp

Output

make: Entering directory '/home/louis/.opam/4.07.1+flambda+bench/.opam-switch/build/cohttp-bench.1.0/cohttp'
ocamlbuild -use-ocamlfind cohttp_lwt_bench.native cohttp_async_bench.native
ocamlfind ocamldep -package lwt.unix -package cohttp.lwt -modules cohttp_lwt_bench.ml > cohttp_lwt_bench.ml.depends
+ ocamlfind ocamldep -package lwt.unix -package cohttp.lwt -modules cohttp_lwt_bench.ml > cohttp_lwt_bench.ml.depends
ocamlfind: Package `cohttp.lwt' not found
Command exited with code 2.
Makefile:6: recipe for target 'all' failed
make: *** [all] Error 10
make: Leaving directory '/home/louis/.opam/4.07.1+flambda+bench/.opam-switch/build/cohttp-bench.1.0/cohttp'
Close

Error on cohttp-bench.1.0 (4.07.1+clambda+bench)

Command:

/usr/bin/make -C cohttp

Output

make: Entering directory '/home/louis/.opam/4.07.1+clambda+bench/.opam-switch/build/cohttp-bench.1.0/cohttp'
ocamlbuild -use-ocamlfind cohttp_lwt_bench.native cohttp_async_bench.native
ocamlfind ocamldep -package lwt.unix -package cohttp.lwt -modules cohttp_lwt_bench.ml > cohttp_lwt_bench.ml.depends
+ ocamlfind ocamldep -package lwt.unix -package cohttp.lwt -modules cohttp_lwt_bench.ml > cohttp_lwt_bench.ml.depends
ocamlfind: Package `cohttp.lwt' not found
Command exited with code 2.
Makefile:6: recipe for target 'all' failed
make: *** [all] Error 10
make: Leaving directory '/home/louis/.opam/4.07.1+clambda+bench/.opam-switch/build/cohttp-bench.1.0/cohttp'
Close

Error on chameneos-bench.1.0 (4.07.1+flambda+bench)

Command:

/usr/bin/make -C chameneos-redux

Output

make: Entering directory '/home/louis/.opam/4.07.1+flambda+bench/.opam-switch/build/chameneos-bench.1.0/chameneos-redux'
ocamlopt -bin-annot -thread unix.cmxa threads.cmxa chameneos_redux_th.ml -o chameneos_redux_th
ocamlopt -bin-annot -thread unix.cmxa threads.cmxa chameneos_redux_evtchn.ml -o chameneos_redux_evtchn
ocamlfind ocamlopt -bin-annot -package lwt.unix -linkpkg chameneos_redux_lwt.ml -o chameneos_redux_lwt
ocamlfind: [WARNING] Package `threads': Linking problems may arise because of the missing -thread or -vmthread switch
File "chameneos_redux_lwt.ml", line 1:
Error: No implementations provided for the following modules:
         Mutex referenced from /home/louis/.opam/4.07.1+flambda+bench/lib/lwt/unix/lwt_unix.cmxa(Lwt_main)
Makefile:6: recipe for target 'chameneos_redux_lwt' failed
make: *** [chameneos_redux_lwt] Error 2
make: Leaving directory '/home/louis/.opam/4.07.1+flambda+bench/.opam-switch/build/chameneos-bench.1.0/chameneos-redux'
Close

Error on chameneos-bench.1.0 (4.07.1+clambda+bench)

Command:

/usr/bin/make -C chameneos-redux

Output

make: Entering directory '/home/louis/.opam/4.07.1+clambda+bench/.opam-switch/build/chameneos-bench.1.0/chameneos-redux'
ocamlopt -bin-annot -thread unix.cmxa threads.cmxa chameneos_redux_th.ml -o chameneos_redux_th
ocamlopt -bin-annot -thread unix.cmxa threads.cmxa chameneos_redux_evtchn.ml -o chameneos_redux_evtchn
ocamlfind ocamlopt -bin-annot -package lwt.unix -linkpkg chameneos_redux_lwt.ml -o chameneos_redux_lwt
ocamlfind: [WARNING] Package `threads': Linking problems may arise because of the missing -thread or -vmthread switch
File "chameneos_redux_lwt.ml", line 1:
Error: No implementations provided for the following modules:
         Mutex referenced from /home/louis/.opam/4.07.1+clambda+bench/lib/lwt/unix/lwt_unix.cmxa(Lwt_main)
Makefile:6: recipe for target 'chameneos_redux_lwt' failed
make: *** [chameneos_redux_lwt] Error 2
make: Leaving directory '/home/louis/.opam/4.07.1+clambda+bench/.opam-switch/build/chameneos-bench.1.0/chameneos-redux'
Close

Error on async-rpc-bench.1.0 (4.07.1+flambda+bench)

Command:

/usr/bin/make -C async_rpc

Output

make: Entering directory '/home/louis/.opam/4.07.1+flambda+bench/.opam-switch/build/async-rpc-bench.1.0/async_rpc'
ocamlfind ocamlopt -thread -syntax camlp4o -package async -package bin_prot.syntax -package core -c rpc_common.ml
ocamlfind: Package `bin_prot.syntax' not found
Makefile:12: recipe for target 'rpc_common.cmx' failed
make: *** [rpc_common.cmx] Error 2
make: Leaving directory '/home/louis/.opam/4.07.1+flambda+bench/.opam-switch/build/async-rpc-bench.1.0/async_rpc'
Close

Error on async-rpc-bench.1.0 (4.07.1+clambda+bench)

Command:

/usr/bin/make -C async_rpc

Output

make: Entering directory '/home/louis/.opam/4.07.1+clambda+bench/.opam-switch/build/async-rpc-bench.1.0/async_rpc'
ocamlfind ocamlopt -thread -syntax camlp4o -package async -package bin_prot.syntax -package core -c rpc_common.ml
ocamlfind: Package `bin_prot.syntax' not found
Makefile:12: recipe for target 'rpc_common.cmx' failed
make: *** [rpc_common.cmx] Error 2
make: Leaving directory '/home/louis/.opam/4.07.1+clambda+bench/.opam-switch/build/async-rpc-bench.1.0/async_rpc'
Close

Error on async-echo-bench.1.0 (4.07.1+flambda+bench)

Command:

/usr/bin/make -C async_echo

Output

make: Entering directory '/home/louis/.opam/4.07.1+flambda+bench/.opam-switch/build/async-echo-bench.1.0/async_echo'
ocamlfind ocamlopt -thread -syntax camlp4o -package async -package bin_prot.syntax -package core -c echo_common.ml
ocamlfind: Package `bin_prot.syntax' not found
Makefile:20: recipe for target 'echo_common.cmx' failed
make: *** [echo_common.cmx] Error 2
make: Leaving directory '/home/louis/.opam/4.07.1+flambda+bench/.opam-switch/build/async-echo-bench.1.0/async_echo'
Close

Error on async-echo-bench.1.0 (4.07.1+clambda+bench)

Command:

/usr/bin/make -C async_echo

Output

make: Entering directory '/home/louis/.opam/4.07.1+clambda+bench/.opam-switch/build/async-echo-bench.1.0/async_echo'
ocamlfind ocamlopt -thread -syntax camlp4o -package async -package bin_prot.syntax -package core -c echo_common.ml
ocamlfind: Package `bin_prot.syntax' not found
Makefile:20: recipe for target 'echo_common.cmx' failed
make: *** [echo_common.cmx] Error 2
make: Leaving directory '/home/louis/.opam/4.07.1+clambda+bench/.opam-switch/build/async-echo-bench.1.0/async_echo'