Package4.03.1+bench4.05.0+flambda+opt+bench4.06.1+flambda+bench4.06.1+flambda+opt+bench4.07.1+clambda+bench4.07.1+flambda+bench4.07.1+oclassic+bench4.08.0+gpr2165+bench4.08.0+mutmatch+bench4.08.0+trunk+bench4.08.0+trunk+flambda+bench4.08.0+trunk+flambda+oclassic+bench4.08.0+trunk+flambda+opt+bench4.03.1+bench time (s)4.05.0+flambda+opt+bench time (s)4.06.1+flambda+bench time (s)4.06.1+flambda+opt+bench time (s)4.07.1+clambda+bench time (s)4.07.1+flambda+bench time (s)4.07.1+oclassic+bench time (s)4.08.0+gpr2165+bench time (s)4.08.0+mutmatch+bench time (s)4.08.0+trunk+bench time (s)4.08.0+trunk+flambda+bench time (s)4.08.0+trunk+flambda+oclassic+bench time (s)4.08.0+trunk+flambda+opt+bench time (s)
almabench-bench.1.0-----------AbortedAborted-----------0.0000.000
alt-ergo.2.3.2----OKOK-----AbortedAborted----16.7903.776-----0.0000.000
alt-ergo-lib.2.3.2----OKOK-----AbortedAborted----43.48055.454-----0.0000.000
alt-ergo-parsers.2.3.2----OKOK-----AbortedAborted----9.8039.275-----0.0000.000
async.v0.12.0----OKOK-----------2.7513.518-------
async.v0.13.0--------AbortedAborted-AbortedAborted--------0.0000.000-0.0000.000
async-echo-bench.1.0----Failure (2)Failure (2)--AbortedAborted-AbortedAborted----2.0950.638--0.0000.000-0.0000.000
async-rpc-bench.1.0----Failure (2)Failure (2)--AbortedAborted-AbortedAborted----2.0060.544--0.0000.000-0.0000.000
async_extra.v0.12.0----OKOK-----------5.1185.049-------
async_kernel.v0.12.0----OKOK-----------16.62920.114-------
async_kernel.v0.13.0--------AbortedAborted-AbortedAborted--------0.0000.000-0.0000.000
async_rpc_kernel.v0.12.0----OKOK-----------9.45212.307-------
async_rpc_kernel.v0.13.0--------AbortedAborted-AbortedAborted--------0.0000.000-0.0000.000
async_unix.v0.12.0----OKOK-----------13.60517.860-------
async_unix.v0.13.0--------AbortedAborted-AbortedAborted--------0.0000.000-0.0000.000
base.v0.12.2----OKOK-----------14.21414.746-------
base.v0.13.2--------AbortedOK-AbortedAborted--------0.00010.445-0.0000.000
base-bytes.base-----------AbortedAborted-----------0.0000.000
base64.3.4.0----OKOK--AbortedOK-AbortedAborted----38.3736.445--0.0002.465-0.0000.000
base_bigstring.v0.12.0----OKOK-----------5.2604.283-------
base_bigstring.v0.13.0--------AbortedAborted-AbortedAborted--------0.0000.000-0.0000.000
base_quickcheck.v0.12.1----OKOK-----------5.1256.017-------
base_quickcheck.v0.13.0--------AbortedAborted-AbortedAborted--------0.0000.000-0.0000.000
bdd-bench.1.0-----------AbortedAborted-----------0.0000.000
bin_prot.v0.12.0----OKOK-----------7.47313.984-------
bin_prot.v0.13.0--------AbortedAborted-AbortedAborted--------0.0000.000-0.0000.000
biniou.1.2.1----OKOK--AbortedOK-AbortedAborted----26.57828.881--0.00022.014-0.0000.000
camlimages.5.0.1--------Aborted--AbortedAborted--------0.000--0.0000.000
camlpdf.2.3-----------AbortedAborted-----------0.0000.000
camlzip.1.10-----------AbortedAborted-----------0.0000.000
chameneos-bench.1.0----Failure (2)Failure (2)--AbortedAborted-AbortedAborted----1.9260.520--0.0000.000-0.0000.000
cohttp.2.4.0----OKOK-----------5.2728.754-------
cohttp.2.5.1--------AbortedAborted-AbortedAborted--------0.0000.000-0.0000.000
cohttp-bench.1.0----Failure (2)Failure (2)--AbortedAborted-AbortedAborted----1.7960.318--0.0000.000-0.0000.000
conf-graphviz.0.1----Failure (1)Failure (1)-----------0.1770.182-------
configurator.v0.11.0----OKOK--AbortedOK-AbortedAborted----6.6002.598--0.0002.853-0.0000.000
core.v0.12.4----OKOK-----------27.01034.362-------
core.v0.13.0--------AbortedAborted-AbortedAborted--------0.0000.000-0.0000.000
core-micro-bench.1.0----Failure (2)Failure (2)--AbortedAborted-AbortedAborted----1.5625.920--0.0000.000-0.0000.000
core-sequence-bench.1.0----OKOK--AbortedAborted-AbortedAborted----0.0610.064--0.0000.000-0.0000.000
core_bench.v0.12.0----OKOK-----------8.9135.428-------
core_bench.v0.13.0--------AbortedAborted-AbortedAborted--------0.0000.000-0.0000.000
core_extended.v0.12.0----OKOK-----------6.2008.526-------
core_kernel.v0.12.3----OKOK-----------55.04765.905-------
core_kernel.v0.13.1--------AbortedAborted-AbortedAborted--------0.0000.000-0.0000.000
cpdf.2.3-----------AbortedAborted-----------0.0000.000
cpdf-bench.1.0-----------AbortedAborted-----------0.0000.000
cppo.1.6.6----OKOK--AbortedOK-AbortedAborted----0.8762.142--0.0001.317-0.0000.000
dune.2.5.1----OKOK--Failure (2)OK-AbortedAborted----12.98318.955--0.90413.094-0.0000.000
dune-configurator.2.5.1----OKOK--AbortedOK-AbortedAborted----13.74613.492--0.0009.342-0.0000.000
dune-private-libs.2.5.1----OKOK--AbortedOK-AbortedAborted----5.61116.271--0.0006.075-0.0000.000
easy-format.1.3.2----OKOK--AbortedOK-AbortedAborted----0.3561.478--0.0000.326-0.0000.000
expect_test_helpers.v0.12.0----OKOK-----------2.1752.240-------
expect_test_helpers_kernel.v0.12.0----OKOK-----------7.9519.229-------
fieldslib.v0.12.0----OKOK-----------0.3490.794-------
fieldslib.v0.13.0--------AbortedOK-AbortedAborted--------0.0000.326-0.0000.000
frama-c.19.1----OKOK-----------109.871179.107-------
frama-c-bench.1.0----OKOK-----------0.3870.335-------
jane-street-headers.v0.12.0----OKOK-----------0.2381.375-------
jane-street-headers.v0.13.0--------AbortedOK-AbortedAborted--------0.0000.332-0.0000.000
jbuilder.1.0+beta20.2-----------AbortedAborted-----------0.0000.000
json-bench-data.1.0-----------AbortedAborted-----------0.0000.000
jsonm.1.0.1-----------AbortedAborted-----------0.0000.000
jsonm-bench.1.0-----------AbortedAborted-----------0.0000.000
jst-config.v0.12.0----OKOK-----------8.14315.271-------
jst-config.v0.13.0--------AbortedAborted-AbortedAborted--------0.0000.000-0.0000.000
kb-bench.1.0-----------AbortedAborted-----------0.0000.000
lexifi-g2pp-bench.1.0-----------AbortedAborted-----------0.0000.000
lwt.5.3.0----OKOK--AbortedOK-AbortedAborted----48.66642.956--0.0007.595-0.0000.000
menhir.20200211----OKOK--AbortedOK-AbortedAborted----26.11728.555--0.00020.962-0.0000.000
menhir-bench.1.0----OKOK--AbortedOK-AbortedAborted----0.4260.294--0.0000.226-0.0000.000
menhirLib.20200211----OKOK--AbortedOK-AbortedAborted----1.1492.128--0.0001.383-0.0000.000
menhirSdk.20200211----OKOK--AbortedOK-AbortedAborted----0.6641.635--0.0000.794-0.0000.000
minilight.1.6-----------AbortedAborted-----------0.0000.000
minilight-bench.1.0-----------AbortedAborted-----------0.0000.000
mmap.1.1.0----OKOK--AbortedOK-AbortedAborted----0.3101.337--0.0000.620-0.0000.000
nbcodec.1.0-----------AbortedAborted-----------0.0000.000
nbcodec-bench.1.0-----------AbortedAborted-----------0.0000.000
num.1.3-----------AbortedAborted-----------0.0000.000
numerical-analysis-bench.1.0---------Failure (2)-AbortedAborted---------9.466-0.0000.000
ocaml.4.08.0-----------AbortedAborted-----------0.0000.000
ocaml-compiler-libs.v0.12.1----OKOK--AbortedOK-AbortedAborted----1.5232.119--0.0002.565-0.0000.000
ocaml-migrate-parsetree.1.7.3----OKOK--AbortedFailure (1)-AbortedAborted----8.86320.375--0.0005.518-0.0000.000
ocaml-syntax-shims.1.0.0----OKOK-----------1.5581.948-------
ocaml-variants.4.08.0+trunk+flambda+oclassic-----------Failure (1)------------0.289-
ocaml-variants.4.08.0+trunk+flambda+opt------------Failure (1)------------0.314
ocamlbuild.0.14.0-----------AbortedAborted-----------0.0000.000
ocamlfind.1.8.1-----------AbortedAborted-----------0.0000.000
ocplib-endian.1.1----OKOK--AbortedOK-AbortedAborted----25.50129.181--0.00022.088-0.0000.000
ocplib-simplex.0.4-----------AbortedAborted-----------0.0000.000
octavius.1.2.2----OKOK--AbortedOK-AbortedAborted----2.1012.557--0.0003.392-0.0000.000
parsexp.v0.12.0----OKOK-----------11.61313.810-------
parsexp.v0.13.0--------AbortedOK-AbortedAborted--------0.0001.754-0.0000.000
patdiff.v0.12.1----OKOK-----------4.9467.602-------
patdiff.v0.13.0--------AbortedAborted-AbortedAborted--------0.0000.000-0.0000.000
patdiff-bench.1.0----OKOK--AbortedAborted-AbortedAborted----0.1950.165--0.0000.000-0.0000.000
patience_diff.v0.12.0----OKOK-----------4.6966.688-------
patience_diff.v0.13.0--------AbortedAborted-AbortedAborted--------0.0000.000-0.0000.000
pcre.7.4.1----OKOK-----------17.42613.700-------
pcre.7.4.3--------AbortedOK-AbortedAborted--------0.0002.669-0.0000.000
ppx_assert.v0.12.0----OKOK-----------5.52813.930-------
ppx_assert.v0.13.0--------AbortedAborted-AbortedAborted--------0.0000.000-0.0000.000
ppx_base.v0.12.0----OKOK-----------9.48617.555-------
ppx_base.v0.13.0--------AbortedAborted-AbortedAborted--------0.0000.000-0.0000.000
ppx_bench.v0.12.0----OKOK-----------3.5007.804-------
ppx_bench.v0.13.0--------AbortedAborted-AbortedAborted--------0.0000.000-0.0000.000
ppx_bin_prot.v0.12.1----OKOK-----------3.7616.136-------
ppx_bin_prot.v0.13.0--------AbortedAborted-AbortedAborted--------0.0000.000-0.0000.000
ppx_cold.v0.13.0--------AbortedAborted-AbortedAborted--------0.0000.000-0.0000.000
ppx_compare.v0.12.0----OKOK-----------2.3045.100-------
ppx_compare.v0.13.0--------AbortedAborted-AbortedAborted--------0.0000.000-0.0000.000
ppx_custom_printf.v0.12.1----OKOK-----------6.33815.835-------
ppx_custom_printf.v0.13.0--------AbortedAborted-AbortedAborted--------0.0000.000-0.0000.000
ppx_derivers.1.2.1----OKOK--AbortedOK-AbortedAborted----0.4950.529--0.0000.463-0.0000.000
ppx_enumerate.v0.12.0----OKOK-----------2.1944.950-------
ppx_enumerate.v0.13.0--------AbortedAborted-AbortedAborted--------0.0000.000-0.0000.000
ppx_expect.v0.12.0----OKOK-----------9.11416.141-------
ppx_expect.v0.13.1--------AbortedAborted-AbortedAborted--------0.0000.000-0.0000.000
ppx_fail.v0.12.0----OKOK-----------5.11811.196-------
ppx_fail.v0.13.0--------AbortedAborted-AbortedAborted--------0.0000.000-0.0000.000
ppx_fields_conv.v0.12.0----OKOK-----------2.2995.094-------
ppx_fields_conv.v0.13.0--------AbortedAborted-AbortedAborted--------0.0000.000-0.0000.000
ppx_hash.v0.12.0----OKOK-----------7.27017.416-------
ppx_hash.v0.13.0--------AbortedAborted-AbortedAborted--------0.0000.000-0.0000.000
ppx_here.v0.12.0----OKOK-----------2.0124.429-------
ppx_here.v0.13.0--------AbortedAborted-AbortedAborted--------0.0000.000-0.0000.000
ppx_inline_test.v0.12.0----OKOK-----------2.8376.264-------
ppx_inline_test.v0.13.1--------AbortedAborted-AbortedAborted--------0.0000.000-0.0000.000
ppx_jane.v0.12.0----OKOK-----------1.9542.247-------
ppx_jane.v0.13.0--------AbortedAborted-AbortedAborted--------0.0000.000-0.0000.000
ppx_js_style.v0.12.0----OKOK-----------3.1546.315-------
ppx_js_style.v0.13.0--------AbortedAborted-AbortedAborted--------0.0000.000-0.0000.000
ppx_let.v0.12.0----OKOK-----------2.1782.569-------
ppx_let.v0.13.0--------AbortedAborted-AbortedAborted--------0.0000.000-0.0000.000
ppx_module_timer.v0.12.0----OKOK-----------7.6434.304-------
ppx_module_timer.v0.13.0--------AbortedAborted-AbortedAborted--------0.0000.000-0.0000.000
ppx_optcomp.v0.12.0----OKOK-----------1.6361.710-------
ppx_optcomp.v0.13.0--------AbortedAborted-AbortedAborted--------0.0000.000-0.0000.000
ppx_optional.v0.12.0----OKOK-----------2.9622.267-------
ppx_optional.v0.13.0--------AbortedAborted-AbortedAborted--------0.0000.000-0.0000.000
ppx_pipebang.v0.12.0----OKOK-----------5.0026.050-------
ppx_pipebang.v0.13.0--------AbortedAborted-AbortedAborted--------0.0000.000-0.0000.000
ppx_sexp_conv.v0.12.0----OKOK-----------6.6148.452-------
ppx_sexp_conv.v0.13.0--------AbortedAborted-AbortedAborted--------0.0000.000-0.0000.000
ppx_sexp_message.v0.12.0----OKOK-----------7.29217.330-------
ppx_sexp_message.v0.13.0--------AbortedAborted-AbortedAborted--------0.0000.000-0.0000.000
ppx_sexp_value.v0.12.0----OKOK-----------10.19219.564-------
ppx_sexp_value.v0.13.0--------AbortedAborted-AbortedAborted--------0.0000.000-0.0000.000
ppx_stable.v0.12.0----OKOK-----------9.80815.459-------
ppx_stable.v0.13.0--------AbortedAborted-AbortedAborted--------0.0000.000-0.0000.000
ppx_typerep_conv.v0.12.0----OKOK-----------9.31015.353-------
ppx_typerep_conv.v0.13.0--------AbortedAborted-AbortedAborted--------0.0000.000-0.0000.000
ppx_variants_conv.v0.12.0----OKOK-----------8.97215.114-------
ppx_variants_conv.v0.13.0--------AbortedAborted-AbortedAborted--------0.0000.000-0.0000.000
ppxlib.0.13.0--------AbortedAborted-AbortedAborted--------0.0000.000-0.0000.000
ppxlib.0.8.1----OKOK-----------12.44714.140-------
protocol_version_header.v0.12.0----OKOK-----------3.7715.567-------
protocol_version_header.v0.13.0--------AbortedAborted-AbortedAborted--------0.0000.000-0.0000.000
psmt2-frontend.0.2----OKOK--Aborted--AbortedAborted----56.05852.204--0.000--0.0000.000
re.1.9.0----OKOK--AbortedOK-AbortedAborted----2.6263.252--0.00017.603-0.0000.000
re2.v0.12.1----OKOK-----------66.38167.665-------
result.1.5----OKOK--AbortedOK-AbortedAborted----0.5650.795--0.0000.638-0.0000.000
sauvola-bench.1.0--------Aborted--AbortedAborted--------0.000--0.0000.000
seq.base-----------AbortedAborted-----------0.0000.000
sequence-bench.1.0-----------AbortedAborted-----------0.0000.000
sexp_pretty.v0.12.0----OKOK-----------1.6606.131-------
sexplib.v0.12.0----OKOK-----------0.8533.840-------
sexplib.v0.13.0--------AbortedOK-AbortedAborted--------0.0002.164-0.0000.000
sexplib0.v0.12.0----OKOK-----------17.8321.321-------
sexplib0.v0.13.0--------AbortedOK-AbortedAborted--------0.0000.988-0.0000.000
shell.v0.12.0----OKOK-----------2.9614.033-------
spawn.v0.13.0----OKOK--AbortedOK-AbortedAborted----0.4864.046--0.0000.972-0.0000.000
splittable_random.v0.12.0----OKOK-----------8.88216.681-------
splittable_random.v0.13.0--------AbortedAborted-AbortedAborted--------0.0000.000-0.0000.000
stdio.v0.12.0----OKOK-----------0.98913.569-------
stdio.v0.13.0--------AbortedOK-AbortedAborted--------0.0000.961-0.0000.000
stdlib-shims.0.1.0----OKOK--AbortedOK-AbortedAborted----22.74527.977--0.00021.206-0.0000.000
stringext.1.6.0----OKOK--AbortedOK-AbortedAborted----25.00029.331--0.00022.255-0.0000.000
textutils.v0.12.0----OKOK-----------9.0667.030-------
textutils.v0.13.0--------AbortedAborted-AbortedAborted--------0.0000.000-0.0000.000
textutils_kernel.v0.12.0----OKOK-----------3.9044.798-------
thread-bench.1.0----Failure (2)Failure (2)--AbortedAborted-AbortedAborted----1.6440.211--0.0000.000-0.0000.000
time_now.v0.12.0----OKOK-----------2.7154.560-------
time_now.v0.13.0--------AbortedAborted-AbortedAborted--------0.0000.000-0.0000.000
topkg.1.0.1-----------AbortedAborted-----------0.0000.000
typerep.v0.12.0----OKOK-----------17.79513.457-------
typerep.v0.13.0--------AbortedOK-AbortedAborted--------0.0003.072-0.0000.000
uchar.0.0.2-----------AbortedAborted-----------0.0000.000
uri.3.1.0----OKOK--AbortedOK-AbortedAborted----5.41712.261--0.0003.553-0.0000.000
uri-sexp.3.1.0----OKOK--AbortedAborted-AbortedAborted----2.1405.317--0.0000.000-0.0000.000
uutf.1.0.2-----------AbortedAborted-----------0.0000.000
variantslib.v0.12.0----OKOK-----------16.91813.390-------
variantslib.v0.13.0--------AbortedOK-AbortedAborted--------0.0004.124-0.0000.000
why3.1.3.1----OKOK-----------38.10765.549-------
yojson.1.7.0----OKOK--AbortedOK-AbortedAborted----2.0039.965--0.0002.601-0.0000.000
yojson-bench.1.0----Failure (2)Failure (2)--AbortedFailure (2)-AbortedAborted----23.0391.755--0.0000.173-0.0000.000
zarith.1.9.1-----------AbortedAborted-----------0.0000.000
Close

Error on yojson-bench.1.0 (4.08.0+trunk+bench)

Command:

/usr/bin/make -C yojson

Output

make: Entering directory '/home/louis/.opam/4.08.0+trunk+bench/.opam-switch/build/yojson-bench.1.0/yojson'
ocamlfind ocamlopt -I `ocamlfind query yojson` -o ydump_bench -package easy-format,biniou -linkpkg yojson.cmx yojson_biniou.cmx ydump.ml
gcc: error: /home/louis/.opam/4.08.0+trunk+bench/lib/yojson/yojson_biniou.o: No such file or directory
gcc: error: /home/louis/.opam/4.08.0+trunk+bench/lib/yojson/yojson.o: No such file or directory
File "caml_startup", line 1:
Error: Error during linking (exit code 1)
Makefile:6: recipe for target 'all' failed
make: *** [all] Error 2
make: Leaving directory '/home/louis/.opam/4.08.0+trunk+bench/.opam-switch/build/yojson-bench.1.0/yojson'
Close

Error on yojson-bench.1.0 (4.07.1+flambda+bench)

Command:

/usr/bin/make -C yojson

Output

make: Entering directory '/home/louis/.opam/4.07.1+flambda+bench/.opam-switch/build/yojson-bench.1.0/yojson'
ocamlfind ocamlopt -I `ocamlfind query yojson` -o ydump_bench -package easy-format,biniou -linkpkg yojson.cmx yojson_biniou.cmx ydump.ml
gcc: error: /home/louis/.opam/4.07.1+flambda+bench/lib/yojson/yojson_biniou.o: No such file or directory
gcc: error: /home/louis/.opam/4.07.1+flambda+bench/lib/yojson/yojson.o: No such file or directory
File "caml_startup", line 1:
Error: Error during linking
Makefile:6: recipe for target 'all' failed
make: *** [all] Error 2
make: Leaving directory '/home/louis/.opam/4.07.1+flambda+bench/.opam-switch/build/yojson-bench.1.0/yojson'
Close

Error on yojson-bench.1.0 (4.07.1+clambda+bench)

Command:

/usr/bin/make -C yojson

Output

make: Entering directory '/home/louis/.opam/4.07.1+clambda+bench/.opam-switch/build/yojson-bench.1.0/yojson'
ocamlfind ocamlopt -I `ocamlfind query yojson` -o ydump_bench -package easy-format,biniou -linkpkg yojson.cmx yojson_biniou.cmx ydump.ml
gcc: error: /home/louis/.opam/4.07.1+clambda+bench/lib/yojson/yojson_biniou.o: No such file or directory
gcc: error: /home/louis/.opam/4.07.1+clambda+bench/lib/yojson/yojson.o: No such file or directory
File "caml_startup", line 1:
Error: Error during linking
Makefile:6: recipe for target 'all' failed
make: *** [all] Error 2
make: Leaving directory '/home/louis/.opam/4.07.1+clambda+bench/.opam-switch/build/yojson-bench.1.0/yojson'
Close

Error on thread-bench.1.0 (4.07.1+flambda+bench)

Command:

/usr/bin/make -C thread

Output

make: Entering directory '/home/louis/.opam/4.07.1+flambda+bench/.opam-switch/build/thread-bench.1.0/thread'
ocamlfind ocamlopt -package lwt.unix -linkpkg -o thread_sleep_lwt thread_sleep_lwt.ml
ocamlfind: [WARNING] Package `threads': Linking problems may arise because of the missing -thread or -vmthread switch
File "thread_sleep_lwt.ml", line 1:
Error: No implementations provided for the following modules:
         Mutex referenced from /home/louis/.opam/4.07.1+flambda+bench/lib/lwt/unix/lwt_unix.cmxa(Lwt_main)
Makefile:7: recipe for target 'thread_sleep_lwt' failed
make: *** [thread_sleep_lwt] Error 2
make: Leaving directory '/home/louis/.opam/4.07.1+flambda+bench/.opam-switch/build/thread-bench.1.0/thread'
Close

Error on thread-bench.1.0 (4.07.1+clambda+bench)

Command:

/usr/bin/make -C thread

Output

make: Entering directory '/home/louis/.opam/4.07.1+clambda+bench/.opam-switch/build/thread-bench.1.0/thread'
ocamlfind ocamlopt -package lwt.unix -linkpkg -o thread_sleep_lwt thread_sleep_lwt.ml
ocamlfind: [WARNING] Package `threads': Linking problems may arise because of the missing -thread or -vmthread switch
File "thread_sleep_lwt.ml", line 1:
Error: No implementations provided for the following modules:
         Mutex referenced from /home/louis/.opam/4.07.1+clambda+bench/lib/lwt/unix/lwt_unix.cmxa(Lwt_main)
Makefile:7: recipe for target 'thread_sleep_lwt' failed
make: *** [thread_sleep_lwt] Error 2
make: Leaving directory '/home/louis/.opam/4.07.1+clambda+bench/.opam-switch/build/thread-bench.1.0/thread'
Close

Error on ocaml-variants.4.08.0+trunk+flambda+opt (4.08.0+trunk+flambda+opt+bench)

Command:

~/.opam/4.08.0+trunk+flambda+opt+bench/.opam-switch/build/ocaml-variants.4.08.0+trunk+flambda+opt/./configure -prefix /home/louis/.opam/4.08.0+trunk+flambda+opt+bench -flambda -with-debug-runtime

Output

configure: error: unrecognized option: `-flambda'
Try `/home/louis/.opam/4.08.0+trunk+flambda+opt+bench/.opam-switch/build/ocaml-variants.4.08.0+trunk+flambda+opt/./configure --help' for more information
Close

Error on ocaml-variants.4.08.0+trunk+flambda+oclassic (4.08.0+trunk+flambda+oclassic+bench)

Command:

~/.opam/4.08.0+trunk+flambda+oclassic+bench/.opam-switch/build/ocaml-variants.4.08.0+trunk+flambda+oclassic/./configure -prefix /home/louis/.opam/4.08.0+trunk+flambda+oclassic+bench -flambda -with-debug-runtime

Output

configure: error: unrecognized option: `-flambda'
Try `/home/louis/.opam/4.08.0+trunk+flambda+oclassic+bench/.opam-switch/build/ocaml-variants.4.08.0+trunk+flambda+oclassic/./configure --help' for more information
Close

Error on ocaml-migrate-parsetree.1.7.3 (4.08.0+trunk+bench)

Command:

~/.opam/4.08.0+trunk+bench/bin/dune build -p ocaml-migrate-parsetree -j 7

Output

       ocaml src/ast-version,src/compiler-functions-file (exit 1)
(cd _build/default/src && /home/louis/.opam/4.08.0+trunk+bench/bin/ocaml config/gen.ml 4.12.0+dev0-2020-04-22)
Unkown OCaml version 4.12.0+dev0-2020-04-22
Close

Error on numerical-analysis-bench.1.0 (4.08.0+trunk+bench)

Command:

/usr/bin/make

Output

ulimit -s 98304; ocamlopt.opt  -I simple_access `ocamldep.opt -sort simple_access/*.ml` main_nogcstats.ml -o simple_access.opt
ulimit -s 98304; ocamlopt.opt  -I lu-decomposition `ocamldep.opt -sort lu-decomposition/*.ml` main_nogcstats.ml -o lu-decomposition.opt
ulimit -s 98304; ocamlopt.opt  -I fft `ocamldep.opt -sort fft/*.ml` main_nogcstats.ml -o fft.opt
ulimit -s 98304; ocamlopt.opt  -I rnd_access `ocamldep.opt -sort rnd_access/*.ml` main_nogcstats.ml -o rnd_access.opt
ulimit -s 98304; ocamlopt.opt  -I k-means `ocamldep.opt -sort k-means/*.ml` main_nogcstats.ml -o k-means.opt
Fatal error: exception Stack overflow
Makefile:20: recipe for target 'k-means.opt' failed
make: *** [k-means.opt] Error 2
Close

Error on dune.2.5.1 (4.08.0+mutmatch+bench)

Command:

~/.opam/4.08.0+mutmatch+bench/bin/ocaml bootstrap.ml -j 7

Output

ocamlc -custom -w -24 -g -o .duneboot.exe -I boot unix.cma boot/libs.ml boot/duneboot.ml
./.duneboot.exe -j 7
cd _boot && /home/louis/.opam/4.08.0+mutmatch+bench/bin/ocamldep.opt -modules -map main__.ml -map build_info__.ml -map dune.ml -map dune_action_plugin__.ml -map jbuild_support.ml -map dune_glob__.ml -map dune_re__.ml -map cache_daemon__.ml -map cache__.ml -map dune_util.ml -map memo__.ml -map dag__.ml -map incremental_cycles__.ml -map dune_lang__.ml -map stdune__.ml -map dune_csexp.ml -args source_files
File "src/stdune/result.ml", line 67, characters 8-11:
Error: Syntax error: operator expected.
File "src/stdune/daemonize.ml", line 90, characters 11-13:
Error: Syntax error: operator expected.
File "src/stdune/loc.ml", line 75, characters 7-8:
Error: Syntax error
File "src/stdune/applicative.ml", line 5, characters 10-13:
Error: Syntax error: operator expected.
File "src/stdune/monad.ml", line 5, characters 10-13:
Error: Syntax error: operator expected.
File "src/stdune/monad_intf.ml", line 13, characters 10-13:
Error: Syntax error: operator expected.
File "src/stdune/applicative_intf.ml", line 17, characters 10-13:
Error: Syntax error: operator expected.
File "src/stdune/option.mli", line 12, characters 8-11:
Error: Syntax error: operator expected.
File "src/stdune/result.mli", line 31, characters 8-11:
Error: Syntax error: operator expected.
File "src/stdune/option.ml", line 16, characters 8-11:
Error: Syntax error: operator expected.
File "src/dune_lang/syntax.ml", line 97, characters 9-10:
Error: Syntax error
File "src/dune_lang/decoder.mli", line 239, characters 6-9:
Error: Syntax error: operator expected.
File "src/dune_lang/versioned_file.ml", line 110, characters 7-8:
Error: Syntax error
File "src/dune_lang/decoder.ml", line 98, characters 6-9:
Error: Syntax error: operator expected.
File "src/fiber/fiber.ml", line 198, characters 8-11:
Error: Syntax error: operator expected.
File "src/fiber/fiber.mli", line 37, characters 8-11:
Error: Syntax error: operator expected.
File "src/memo/memo.ml", line 117, characters 13-16:
Error: Syntax error: operator expected.
File "src/cache/local.ml", line 146, characters 11-16:
Error: Syntax error
File "src/cache/client.ml", line 24, characters 5-6:
Error: Syntax error
File "src/cache/messages.ml", line 98, characters 13-18:
Error: Syntax error
File "src/cache_daemon/cache_daemon.ml", line 135, characters 9-10:
Error: Syntax error
File "src/ocaml-config/ocaml_config.ml", line 307, characters 7-8:
Error: Syntax error
File "otherlibs/action-plugin/src/dune_action_plugin.ml", line 189, characters 10-13:
Error: Syntax error: operator expected.
File "otherlibs/action-plugin/src/protocol.ml", line 106, characters 11-12:
Error: Syntax error
File "otherlibs/action-plugin/src/dune_action_plugin.mli", line 52, characters 10-13:
Error: Syntax error: operator expected.
File "otherlibs/action-plugin/src/serializable_intf.ml", line 40, characters 7-8:
Error: Syntax error
File "src/dune/coq_rules.ml", line 138, characters 9-10:
Error: Syntax error
File "src/dune/stringlike.ml", line 49, characters 13-14:
Error: Syntax error: operator expected.
File "src/dune/dep_conf.ml", line 28, characters 7-8:
Error: Syntax error
File "src/dune/dune_init.ml", line 86, characters 9-10:
Error: Syntax error: operator expected.
File "src/dune/obj_dir.ml", line 64, characters 12-23:
Error: Syntax error: operator expected.
File "src/dune/ocamldep.ml", line 106, characters 11-16:
Error: Syntax error
File "src/dune/ordered_set_lang.ml", line 90, characters 13-22:
Error: Syntax error
File "src/dune/super_context.ml", line 86, characters 7-8:
Error: Syntax error
File "src/dune/module.ml", line 274, characters 10-14:
Error: Syntax error: operator expected.
File "src/dune/lib_info.ml", line 25, characters 12-15:
Error: Syntax error: operator expected.
File "src/dune/vcs.ml", line 47, characters 12-16:
Error: Syntax error: operator expected.
File "src/dune/dialect.ml", line 42, characters 9-12:
Error: Syntax error
File "src/dune/sub_system.ml", line 40, characters 7-8:
Error: Syntax error
File "src/dune/simple_rules.ml", line 202, characters 17-18:
Error: Syntax error: operator expected.
File "src/dune/findlib/findlib.ml", line 427, characters 11-12:
Error: Syntax error: operator expected.
File "src/dune/format_config.ml", line 58, characters 9-17:
Error: Syntax error
File "src/dune/dune_load.ml", line 193, characters 11-12:
Error: Syntax error: operator expected.
File "src/dune/predicate_lang.ml", line 38, characters 9-10:
Error: Syntax error
File "src/dune/ocaml_stdlib.ml", line 21, characters 10-31:
Error: Syntax error: operator expected.
File "src/dune/stats.ml", line 62, characters 9-15:
Error: Syntax error
File "src/dune/lib.ml", line 416, characters 9-13:
Error: Syntax error: operator expected.
File "src/dune/context.ml", line 198, characters 7-8:
Error: Syntax error
File "src/dune/file_tree.ml", line 487, characters 9-10:
Error: Syntax error
File "src/dune/dep_graph.ml", line 25, characters 7-17:
Error: Syntax error
File "src/dune/expander.ml", line 136, characters 9-22:
Error: Syntax error: operator expected.
File "src/dune/case_lang.ml", line 12, characters 10-11:
Error: Syntax error: operator expected.
File "src/dune/module_compilation.ml", line 27, characters 7-11:
Error: Syntax error
File "src/dune/mode.ml", line 129, characters 14-18:
Error: Syntax error: operator expected.
File "src/dune/install_rules.ml", line 240, characters 13-14:
Error: Syntax error: operator expected.
File "src/dune/artifact_substitution.ml", line 357, characters 11-12:
Error: Syntax error: operator expected.
File "src/dune/dune_file.ml", line 35, characters 8-9:
Error: Syntax error: operator expected.
File "src/dune/lib_kind.ml", line 17, characters 9-10:
Error: Syntax error
File "src/dune/pform.ml", line 382, characters 7-8:
Error: Syntax error
File "src/dune/action_exec.ml", line 138, characters 7-8:
Error: Syntax error
File "src/dune/workspace.ml", line 25, characters 11-23:
Error: Syntax error
File "src/dune/stanza_common.ml", line 84, characters 9-10:
Error: Syntax error
File "src/dune/string_with_vars.ml", line 40, characters 7-21:
Error: Syntax error
File "src/dune/coq_lib.ml", line 137, characters 7-8:
Error: Syntax error
File "src/dune/coq_stanza.ml", line 13, characters 12-19:
Error: Syntax error: operator expected.
File "src/dune/wrapped.ml", line 14, characters 17-18:
Error: Syntax error: operator expected.
File "src/dune/foreign.ml", line 94, characters 5-6:
Error: Syntax error
File "src/dune/build.mli", line 40, characters 10-13:
Error: Syntax error: operator expected.
File "src/dune/preprocessing.ml", line 150, characters 16-19:
Error: Syntax error: operator expected.
File "src/dune/process.ml", line 448, characters 5-6:
Error: Syntax error
File "src/dune/config.ml", line 248, characters 7-14:
Error: Syntax error
File "src/dune/targets.ml", line 44, characters 7-21:
Error: Syntax error
File "src/dune/gen_rules.ml", line 236, characters 11-18:
Error: Syntax error
File "src/dune/action_dune_lang.ml", line 96, characters 8-11:
Error: Syntax error: operator expected.
File "src/dune/file_binding.ml", line 65, characters 13-20:
Error: Syntax error
File "src/dune/odoc.ml", line 157, characters 10-14:
Error: Syntax error: operator expected.
File "src/dune/dpath.ml", line 153, characters 9-18:
Error: Syntax error
File "src/dune/dune_env.ml", line 13, characters 9-10:
Error: Syntax error
File "src/dune/dune_package.ml", line 111, characters 10-11:
Error: Syntax error: operator expected.
File "src/dune/action_unexpanded.ml", line 613, characters 14-20:
Error: Syntax error: operator expected.
File "src/dune/modules.ml", line 48, characters 12-28:
Error: Syntax error: operator expected.
File "src/dune/foreign_rules.ml", line 166, characters 16-17:
Error: Syntax error: operator expected.
File "src/dune/sub_dirs.ml", line 224, characters 7-12:
Error: Syntax error
File "src/dune/cinaps.ml", line 27, characters 10-13:
Error: Syntax error: operator expected.
File "src/dune/diff.ml", line 22, characters 7-12:
Error: Syntax error
File "src/dune/alias.ml", line 68, characters 7-8:
Error: Syntax error
File "src/dune/opam_create.ml", line 157, characters 10-18:
Error: Syntax error: operator expected.
File "src/dune/dune_project.ml", line 369, characters 11-12:
Error: Syntax error
File "src/dune/print_diff.ml", line 45, characters 7-8:
Error: Syntax error
File "src/dune/mdx.ml", line 27, characters 9-10:
Error: Syntax error
File "src/dune/ml_sources.ml", line 257, characters 13-14:
Error: Syntax error: operator expected.
File "src/dune/merlin.ml", line 140, characters 9-10:
Error: Syntax error: operator expected.
File "src/dune/utop.ml", line 26, characters 5-6:
Error: Syntax error: operator expected.
File "src/dune/link_time_code_gen.ml", line 174, characters 7-15:
Error: Syntax error
File "src/dune/dep_rules.ml", line 29, characters 12-13:
Error: Syntax error: operator expected.
File "src/dune/bindings.ml", line 40, characters 7-8:
Error: Syntax error
File "src/dune/build.ml", line 50, characters 8-11:
Error: Syntax error: operator expected.
File "src/dune/format_rules.ml", line 49, characters 11-12:
Error: Syntax error
File "src/dune/scheduler.ml", line 618, characters 7-8:
Error: Syntax error
File "src/dune/lib_dep.ml", line 14, characters 12-13:
Error: Syntax error: operator expected.
File "src/dune/module_name.ml", line 95, characters 9-10:
Error: Syntax error
File "src/dune/action_ast.ml", line 57, characters 19-23:
Error: Syntax error: operator expected.
File "src/dune/package.ml", line 44, characters 7-8:
Error: Syntax error
File "src/dune/main.ml", line 62, characters 7-15:
Error: Syntax error
File "src/dune/foreign_sources.ml", line 91, characters 13-14:
Error: Syntax error: operator expected.
File "src/dune/artifacts.ml", line 63, characters 9-12:
Error: Syntax error
File "src/dune/watermarks.ml", line 167, characters 15-18:
Error: Syntax error
File "src/dune/ocaml_flags.ml", line 81, characters 9-15:
Error: Syntax error
File "src/dune/exe_rules.ml", line 99, characters 9-14:
Error: Syntax error
File "src/dune/blang.ml", line 77, characters 15-16:
Error: Syntax error: operator expected.
File "src/dune/build_system.ml", line 125, characters 11-19:
Error: Syntax error
File "src/dune/inline_tests.ml", line 34, characters 16-19:
Error: Syntax error: operator expected.
File "bin/external_lib_deps.ml", line 117, characters 7-13:
Error: Syntax error
File "bin/install_uninstall.ml", line 18, characters 7-8:
Error: Syntax error
File "bin/format_dune_file.ml", line 19, characters 7-15:
Error: Syntax error
File "bin/init.ml", line 41, characters 5-6:
Error: Syntax error
File "bin/help.ml", line 109, characters 10-20:
Error: Syntax error
File "bin/installed_libraries.ml", line 9, characters 7-13:
Error: Syntax error
File "bin/printenv.ml", line 16, characters 7-10:
Error: Syntax error
File "bin/describe.ml", line 149, characters 12-13:
Error: Syntax error
File "bin/common.ml", line 11, characters 8-11:
Error: Syntax error: operator expected.
File "bin/exec.ml", line 36, characters 7-13:
Error: Syntax error
File "bin/subst.ml", line 61, characters 7-8:
Error: Syntax error
File "bin/compute.ml", line 19, characters 10-16:
Error: Syntax error
File "bin/caching.ml", line 61, characters 7-8:
Error: Syntax error
File "bin/utop.ml", line 17, characters 7-13:
Error: Syntax error
File "bin/print_rules.ml", line 77, characters 9-17:
Error: Syntax error
File "bin/import.ml", line 84, characters 7-8:
Error: Syntax error
File "bin/upgrade.ml", line 17, characters 7-13:
Error: Syntax error
File "bin/main.ml", line 7, characters 7-8:
Error: Syntax error
File "bin/common.mli", line 69, characters 8-11:
Error: Syntax error: operator expected.
File "bin/top.ml", line 25, characters 7-13:
Error: Syntax error


Close

Error on core-micro-bench.1.0 (4.07.1+flambda+bench)

Command:

/usr/bin/make -C core_micro

Output

make: Entering directory '/home/louis/.opam/4.07.1+flambda+bench/.opam-switch/build/core-micro-bench.1.0/core_micro'
ocamlbuild -use-ocamlfind runner.native
ocamlfind ocamldep -package str -package core -package core_bench.inline_benchmarks -modules runner.ml > runner.ml.depends
ocamlfind ocamlc -c -thread -package str -package core -package core_bench.inline_benchmarks -o runner.cmo runner.ml
+ ocamlfind ocamlc -c -thread -package str -package core -package core_bench.inline_benchmarks -o runner.cmo runner.ml
File "runner.ml", line 1, characters 5-13:
Error: Unbound module Core.Std
Command exited with code 2.
Makefile:4: recipe for target 'all' failed
make: *** [all] Error 10
make: Leaving directory '/home/louis/.opam/4.07.1+flambda+bench/.opam-switch/build/core-micro-bench.1.0/core_micro'
Close

Error on core-micro-bench.1.0 (4.07.1+clambda+bench)

Command:

/usr/bin/make -C core_micro

Output

make: Entering directory '/home/louis/.opam/4.07.1+clambda+bench/.opam-switch/build/core-micro-bench.1.0/core_micro'
ocamlbuild -use-ocamlfind runner.native
ocamlfind ocamldep -package str -package core -package core_bench.inline_benchmarks -modules runner.ml > runner.ml.depends
ocamlfind ocamlc -c -thread -package str -package core -package core_bench.inline_benchmarks -o runner.cmo runner.ml
+ ocamlfind ocamlc -c -thread -package str -package core -package core_bench.inline_benchmarks -o runner.cmo runner.ml
File "runner.ml", line 1, characters 5-13:
Error: Unbound module Core.Std
Command exited with code 2.
Makefile:4: recipe for target 'all' failed
make: *** [all] Error 10
make: Leaving directory '/home/louis/.opam/4.07.1+clambda+bench/.opam-switch/build/core-micro-bench.1.0/core_micro'
Close

Error on conf-graphviz.0.1 (4.07.1+flambda+bench)

Command:

/usr/bin/which dot

Output


Close

Error on conf-graphviz.0.1 (4.07.1+clambda+bench)

Command:

/usr/bin/which dot

Output


Close

Error on cohttp-bench.1.0 (4.07.1+flambda+bench)

Command:

/usr/bin/make -C cohttp

Output

make: Entering directory '/home/louis/.opam/4.07.1+flambda+bench/.opam-switch/build/cohttp-bench.1.0/cohttp'
ocamlbuild -use-ocamlfind cohttp_lwt_bench.native cohttp_async_bench.native
ocamlfind ocamldep -package lwt.unix -package cohttp.lwt -modules cohttp_lwt_bench.ml > cohttp_lwt_bench.ml.depends
+ ocamlfind ocamldep -package lwt.unix -package cohttp.lwt -modules cohttp_lwt_bench.ml > cohttp_lwt_bench.ml.depends
ocamlfind: Package `cohttp.lwt' not found
Command exited with code 2.
Makefile:6: recipe for target 'all' failed
make: *** [all] Error 10
make: Leaving directory '/home/louis/.opam/4.07.1+flambda+bench/.opam-switch/build/cohttp-bench.1.0/cohttp'
Close

Error on cohttp-bench.1.0 (4.07.1+clambda+bench)

Command:

/usr/bin/make -C cohttp

Output

make: Entering directory '/home/louis/.opam/4.07.1+clambda+bench/.opam-switch/build/cohttp-bench.1.0/cohttp'
ocamlbuild -use-ocamlfind cohttp_lwt_bench.native cohttp_async_bench.native
ocamlfind ocamldep -package lwt.unix -package cohttp.lwt -modules cohttp_lwt_bench.ml > cohttp_lwt_bench.ml.depends
+ ocamlfind ocamldep -package lwt.unix -package cohttp.lwt -modules cohttp_lwt_bench.ml > cohttp_lwt_bench.ml.depends
ocamlfind: Package `cohttp.lwt' not found
Command exited with code 2.
Makefile:6: recipe for target 'all' failed
make: *** [all] Error 10
make: Leaving directory '/home/louis/.opam/4.07.1+clambda+bench/.opam-switch/build/cohttp-bench.1.0/cohttp'
Close

Error on chameneos-bench.1.0 (4.07.1+flambda+bench)

Command:

/usr/bin/make -C chameneos-redux

Output

make: Entering directory '/home/louis/.opam/4.07.1+flambda+bench/.opam-switch/build/chameneos-bench.1.0/chameneos-redux'
ocamlopt -bin-annot -thread unix.cmxa threads.cmxa chameneos_redux_th.ml -o chameneos_redux_th
ocamlopt -bin-annot -thread unix.cmxa threads.cmxa chameneos_redux_evtchn.ml -o chameneos_redux_evtchn
ocamlfind ocamlopt -bin-annot -package lwt.unix -linkpkg chameneos_redux_lwt.ml -o chameneos_redux_lwt
ocamlfind: [WARNING] Package `threads': Linking problems may arise because of the missing -thread or -vmthread switch
File "chameneos_redux_lwt.ml", line 1:
Error: No implementations provided for the following modules:
         Mutex referenced from /home/louis/.opam/4.07.1+flambda+bench/lib/lwt/unix/lwt_unix.cmxa(Lwt_main)
Makefile:6: recipe for target 'chameneos_redux_lwt' failed
make: *** [chameneos_redux_lwt] Error 2
make: Leaving directory '/home/louis/.opam/4.07.1+flambda+bench/.opam-switch/build/chameneos-bench.1.0/chameneos-redux'
Close

Error on chameneos-bench.1.0 (4.07.1+clambda+bench)

Command:

/usr/bin/make -C chameneos-redux

Output

make: Entering directory '/home/louis/.opam/4.07.1+clambda+bench/.opam-switch/build/chameneos-bench.1.0/chameneos-redux'
ocamlopt -bin-annot -thread unix.cmxa threads.cmxa chameneos_redux_th.ml -o chameneos_redux_th
ocamlopt -bin-annot -thread unix.cmxa threads.cmxa chameneos_redux_evtchn.ml -o chameneos_redux_evtchn
ocamlfind ocamlopt -bin-annot -package lwt.unix -linkpkg chameneos_redux_lwt.ml -o chameneos_redux_lwt
ocamlfind: [WARNING] Package `threads': Linking problems may arise because of the missing -thread or -vmthread switch
File "chameneos_redux_lwt.ml", line 1:
Error: No implementations provided for the following modules:
         Mutex referenced from /home/louis/.opam/4.07.1+clambda+bench/lib/lwt/unix/lwt_unix.cmxa(Lwt_main)
Makefile:6: recipe for target 'chameneos_redux_lwt' failed
make: *** [chameneos_redux_lwt] Error 2
make: Leaving directory '/home/louis/.opam/4.07.1+clambda+bench/.opam-switch/build/chameneos-bench.1.0/chameneos-redux'
Close

Error on async-rpc-bench.1.0 (4.07.1+flambda+bench)

Command:

/usr/bin/make -C async_rpc

Output

make: Entering directory '/home/louis/.opam/4.07.1+flambda+bench/.opam-switch/build/async-rpc-bench.1.0/async_rpc'
ocamlfind ocamlopt -thread -syntax camlp4o -package async -package bin_prot.syntax -package core -c rpc_common.ml
ocamlfind: Package `bin_prot.syntax' not found
Makefile:12: recipe for target 'rpc_common.cmx' failed
make: *** [rpc_common.cmx] Error 2
make: Leaving directory '/home/louis/.opam/4.07.1+flambda+bench/.opam-switch/build/async-rpc-bench.1.0/async_rpc'
Close

Error on async-rpc-bench.1.0 (4.07.1+clambda+bench)

Command:

/usr/bin/make -C async_rpc

Output

make: Entering directory '/home/louis/.opam/4.07.1+clambda+bench/.opam-switch/build/async-rpc-bench.1.0/async_rpc'
ocamlfind ocamlopt -thread -syntax camlp4o -package async -package bin_prot.syntax -package core -c rpc_common.ml
ocamlfind: Package `bin_prot.syntax' not found
Makefile:12: recipe for target 'rpc_common.cmx' failed
make: *** [rpc_common.cmx] Error 2
make: Leaving directory '/home/louis/.opam/4.07.1+clambda+bench/.opam-switch/build/async-rpc-bench.1.0/async_rpc'
Close

Error on async-echo-bench.1.0 (4.07.1+flambda+bench)

Command:

/usr/bin/make -C async_echo

Output

make: Entering directory '/home/louis/.opam/4.07.1+flambda+bench/.opam-switch/build/async-echo-bench.1.0/async_echo'
ocamlfind ocamlopt -thread -syntax camlp4o -package async -package bin_prot.syntax -package core -c echo_common.ml
ocamlfind: Package `bin_prot.syntax' not found
Makefile:20: recipe for target 'echo_common.cmx' failed
make: *** [echo_common.cmx] Error 2
make: Leaving directory '/home/louis/.opam/4.07.1+flambda+bench/.opam-switch/build/async-echo-bench.1.0/async_echo'
Close

Error on async-echo-bench.1.0 (4.07.1+clambda+bench)

Command:

/usr/bin/make -C async_echo

Output

make: Entering directory '/home/louis/.opam/4.07.1+clambda+bench/.opam-switch/build/async-echo-bench.1.0/async_echo'
ocamlfind ocamlopt -thread -syntax camlp4o -package async -package bin_prot.syntax -package core -c echo_common.ml
ocamlfind: Package `bin_prot.syntax' not found
Makefile:20: recipe for target 'echo_common.cmx' failed
make: *** [echo_common.cmx] Error 2
make: Leaving directory '/home/louis/.opam/4.07.1+clambda+bench/.opam-switch/build/async-echo-bench.1.0/async_echo'