Package4.03.1+bench4.05.0+flambda+opt+bench4.06.1+flambda+bench4.06.1+flambda+opt+bench4.07.1+clambda+bench4.07.1+flambda+bench4.07.1+oclassic+bench4.08.0+gpr2165+bench4.08.0+mutmatch+bench4.08.0+trunk+bench4.08.0+trunk+flambda+bench4.08.0+trunk+flambda+oclassic+bench4.08.0+trunk+flambda+opt+bench4.03.1+bench time (s)4.05.0+flambda+opt+bench time (s)4.06.1+flambda+bench time (s)4.06.1+flambda+opt+bench time (s)4.07.1+clambda+bench time (s)4.07.1+flambda+bench time (s)4.07.1+oclassic+bench time (s)4.08.0+gpr2165+bench time (s)4.08.0+mutmatch+bench time (s)4.08.0+trunk+bench time (s)4.08.0+trunk+flambda+bench time (s)4.08.0+trunk+flambda+oclassic+bench time (s)4.08.0+trunk+flambda+opt+bench time (s)
almabench-bench.1.0----------Aborted-Aborted----------0.000-0.000
alt-ergo.2.3.2----OK-----Aborted-Aborted----16.868-----0.000-0.000
alt-ergo-lib.2.3.2----OK-----Aborted-Aborted----41.848-----0.000-0.000
alt-ergo-parsers.2.3.2----OK-----Aborted-Aborted----15.769-----0.000-0.000
async.v0.12.0----OK------------2.909--------
async.v0.13.0----------Aborted-Aborted----------0.000-0.000
async-echo-bench.1.0----Failure (2)-----Aborted-Aborted----2.744-----0.000-0.000
async-rpc-bench.1.0----Failure (2)-----Aborted-Aborted----2.657-----0.000-0.000
async_extra.v0.12.0----OK------------4.147--------
async_kernel.v0.12.0----OK------------17.855--------
async_kernel.v0.13.0----------Aborted-Aborted----------0.000-0.000
async_rpc_kernel.v0.12.0----OK------------10.322--------
async_rpc_kernel.v0.13.0----------Aborted-Aborted----------0.000-0.000
async_unix.v0.12.0----OK------------16.595--------
async_unix.v0.13.1----------Aborted-Aborted----------0.000-0.000
base.v0.12.2----OK------------13.361--------
base.v0.13.2----------Aborted-Aborted----------0.000-0.000
base-bytes.base----------Aborted-Aborted----------0.000-0.000
base64.3.4.0----OK-----Aborted-Aborted----36.579-----0.000-0.000
base_bigstring.v0.12.0----OK------------4.193--------
base_bigstring.v0.13.0----------Aborted-Aborted----------0.000-0.000
base_quickcheck.v0.12.1----OK------------4.366--------
base_quickcheck.v0.13.0----------Aborted-Aborted----------0.000-0.000
bdd-bench.1.0----------Aborted-Aborted----------0.000-0.000
bin_prot.v0.12.0----OK------------6.769--------
bin_prot.v0.13.0----------Aborted-Aborted----------0.000-0.000
biniou.1.2.1----OK-----Aborted-Aborted----26.829-----0.000-0.000
camlimages.5.0.2----OK-----Aborted-Aborted----5.424-----0.000-0.000
camlpdf.2.3----------Aborted-Aborted----------0.000-0.000
camlzip.1.10----------Aborted-Aborted----------0.000-0.000
chameneos-bench.1.0----Failure (2)-----Aborted-Aborted----2.215-----0.000-0.000
cohttp.2.4.0----OK------------5.241--------
cohttp.2.5.1----------Aborted-Aborted----------0.000-0.000
cohttp-bench.1.0----Failure (2)-----Aborted-Aborted----2.053-----0.000-0.000
conf-graphviz.0.1----Failure (1)------------0.185--------
configurator.v0.11.0----OK-----Aborted-Aborted----6.325-----0.000-0.000
core.v0.12.4----OK------------27.977--------
core.v0.13.0----------Aborted-Aborted----------0.000-0.000
core-micro-bench.1.0----Failure (2)-----Aborted-Aborted----5.639-----0.000-0.000
core-sequence-bench.1.0----OK-----Aborted-Aborted----0.062-----0.000-0.000
core_bench.v0.12.0----OK------------3.747--------
core_bench.v0.13.0----------Aborted-Aborted----------0.000-0.000
core_extended.v0.12.0----OK------------5.877--------
core_kernel.v0.12.3----OK------------56.636--------
core_kernel.v0.13.1----------Aborted-Aborted----------0.000-0.000
cpdf.2.3----------Aborted-Aborted----------0.000-0.000
cpdf-bench.1.0----------Aborted-Aborted----------0.000-0.000
cppo.1.6.6----OK-----Aborted-Aborted----0.844-----0.000-0.000
dune.2.5.1----OK-----Aborted-Aborted----15.027-----0.000-0.000
dune-configurator.2.5.1----OK-----Aborted-Aborted----14.268-----0.000-0.000
dune-private-libs.2.5.1----OK-----Aborted-Aborted----5.685-----0.000-0.000
easy-format.1.3.2----OK-----Aborted-Aborted----0.312-----0.000-0.000
expect_test_helpers.v0.12.0----OK------------1.939--------
expect_test_helpers_kernel.v0.12.0----OK------------7.605--------
fieldslib.v0.12.0----OK------------0.321--------
fieldslib.v0.13.0----------Aborted-Aborted----------0.000-0.000
frama-c.19.1----OK------------108.374--------
frama-c-bench.1.0----OK------------0.588--------
jane-street-headers.v0.12.0----OK------------0.327--------
jane-street-headers.v0.13.0----------Aborted-Aborted----------0.000-0.000
jbuilder.1.0+beta20.2----------Aborted-Aborted----------0.000-0.000
json-bench-data.1.0----------Aborted-Aborted----------0.000-0.000
jsonm.1.0.1----------Aborted-Aborted----------0.000-0.000
jsonm-bench.1.0----------Aborted-Aborted----------0.000-0.000
jst-config.v0.12.0----OK------------7.402--------
jst-config.v0.13.0----------Aborted-Aborted----------0.000-0.000
kb-bench.1.0----------Aborted-Aborted----------0.000-0.000
lexifi-g2pp-bench.1.0----------Aborted-Aborted----------0.000-0.000
lwt.5.3.0----OK-----Aborted-Aborted----46.688-----0.000-0.000
menhir.20200211----OK-----Aborted-Aborted----26.644-----0.000-0.000
menhir-bench.1.0----OK-----Aborted-Aborted----0.297-----0.000-0.000
menhirLib.20200211----OK-----Aborted-Aborted----1.084-----0.000-0.000
menhirSdk.20200211----OK-----Aborted-Aborted----0.606-----0.000-0.000
minilight.1.6----------Aborted-Aborted----------0.000-0.000
minilight-bench.1.0----------Aborted-Aborted----------0.000-0.000
mmap.1.1.0----OK-----Aborted-Aborted----0.665-----0.000-0.000
nbcodec.1.0----------Aborted-Aborted----------0.000-0.000
nbcodec-bench.1.0----------Aborted-Aborted----------0.000-0.000
num.1.3----------Aborted-Aborted----------0.000-0.000
numerical-analysis-bench.1.0----------Aborted-Aborted----------0.000-0.000
ocaml.4.08.0----------Aborted-Aborted----------0.000-0.000
ocaml-compiler-libs.v0.12.1----OK-----Aborted-Aborted----1.587-----0.000-0.000
ocaml-migrate-parsetree.1.7.3----OK-----Aborted-Aborted----9.029-----0.000-0.000
ocaml-syntax-shims.1.0.0----OK------------1.402--------
ocaml-variants.4.08.0+trunk+flambda----------Failure (1)------------0.343--
ocaml-variants.4.08.0+trunk+flambda+opt------------Failure (1)------------0.292
ocamlbuild.0.14.0----------Aborted-Aborted----------0.000-0.000
ocamlfind.1.8.1----------Aborted-Aborted----------0.000-0.000
ocplib-endian.1.1----OK-----Aborted-Aborted----25.659-----0.000-0.000
ocplib-simplex.0.4----------Aborted-Aborted----------0.000-0.000
octavius.1.2.2----OK-----Aborted-Aborted----2.109-----0.000-0.000
parsexp.v0.12.0----OK------------11.332--------
parsexp.v0.13.0----------Aborted-Aborted----------0.000-0.000
patdiff.v0.12.1----OK------------5.356--------
patdiff.v0.13.0----------Aborted-Aborted----------0.000-0.000
patdiff-bench.1.0----OK-----Aborted-Aborted----0.200-----0.000-0.000
patience_diff.v0.12.0----OK------------4.835--------
patience_diff.v0.13.0----------Aborted-Aborted----------0.000-0.000
pcre.7.4.1----OK------------16.407--------
pcre.7.4.3----------Aborted-Aborted----------0.000-0.000
ppx_assert.v0.12.0----OK------------6.001--------
ppx_assert.v0.13.0----------Aborted-Aborted----------0.000-0.000
ppx_base.v0.12.0----OK------------9.827--------
ppx_base.v0.13.0----------Aborted-Aborted----------0.000-0.000
ppx_bench.v0.12.0----OK------------3.536--------
ppx_bench.v0.13.0----------Aborted-Aborted----------0.000-0.000
ppx_bin_prot.v0.12.1----OK------------3.922--------
ppx_bin_prot.v0.13.0----------Aborted-Aborted----------0.000-0.000
ppx_cold.v0.13.0----------Aborted-Aborted----------0.000-0.000
ppx_compare.v0.12.0----OK------------2.071--------
ppx_compare.v0.13.0----------Aborted-Aborted----------0.000-0.000
ppx_custom_printf.v0.12.1----OK------------6.732--------
ppx_custom_printf.v0.13.0----------Aborted-Aborted----------0.000-0.000
ppx_derivers.1.2.1----OK-----Aborted-Aborted----0.511-----0.000-0.000
ppx_enumerate.v0.12.0----OK------------2.124--------
ppx_enumerate.v0.13.0----------Aborted-Aborted----------0.000-0.000
ppx_expect.v0.12.0----OK------------8.980--------
ppx_expect.v0.13.1----------Aborted-Aborted----------0.000-0.000
ppx_fail.v0.12.0----OK------------5.193--------
ppx_fail.v0.13.0----------Aborted-Aborted----------0.000-0.000
ppx_fields_conv.v0.12.0----OK------------2.193--------
ppx_fields_conv.v0.13.0----------Aborted-Aborted----------0.000-0.000
ppx_hash.v0.12.0----OK------------7.647--------
ppx_hash.v0.13.0----------Aborted-Aborted----------0.000-0.000
ppx_here.v0.12.0----OK------------1.879--------
ppx_here.v0.13.0----------Aborted-Aborted----------0.000-0.000
ppx_inline_test.v0.12.0----OK------------3.062--------
ppx_inline_test.v0.13.1----------Aborted-Aborted----------0.000-0.000
ppx_jane.v0.12.0----OK------------2.055--------
ppx_jane.v0.13.0----------Aborted-Aborted----------0.000-0.000
ppx_js_style.v0.12.0----OK------------3.179--------
ppx_js_style.v0.13.0----------Aborted-Aborted----------0.000-0.000
ppx_let.v0.12.0----OK------------2.089--------
ppx_let.v0.13.0----------Aborted-Aborted----------0.000-0.000
ppx_module_timer.v0.12.0----OK------------6.515--------
ppx_module_timer.v0.13.0----------Aborted-Aborted----------0.000-0.000
ppx_optcomp.v0.12.0----OK------------1.711--------
ppx_optcomp.v0.13.0----------Aborted-Aborted----------0.000-0.000
ppx_optional.v0.12.0----OK------------3.089--------
ppx_optional.v0.13.0----------Aborted-Aborted----------0.000-0.000
ppx_pipebang.v0.12.0----OK------------5.115--------
ppx_pipebang.v0.13.0----------Aborted-Aborted----------0.000-0.000
ppx_sexp_conv.v0.12.0----OK------------6.710--------
ppx_sexp_conv.v0.13.0----------Aborted-Aborted----------0.000-0.000
ppx_sexp_message.v0.12.0----OK------------7.646--------
ppx_sexp_message.v0.13.0----------Aborted-Aborted----------0.000-0.000
ppx_sexp_value.v0.12.0----OK------------10.500--------
ppx_sexp_value.v0.13.0----------Aborted-Aborted----------0.000-0.000
ppx_stable.v0.12.0----OK------------9.913--------
ppx_stable.v0.13.0----------Aborted-Aborted----------0.000-0.000
ppx_typerep_conv.v0.12.0----OK------------9.133--------
ppx_typerep_conv.v0.13.0----------Aborted-Aborted----------0.000-0.000
ppx_variants_conv.v0.12.0----OK------------8.984--------
ppx_variants_conv.v0.13.0----------Aborted-Aborted----------0.000-0.000
ppxlib.0.13.0----------Aborted-Aborted----------0.000-0.000
ppxlib.0.8.1----OK------------18.235--------
protocol_version_header.v0.12.0----OK------------3.414--------
protocol_version_header.v0.13.0----------Aborted-Aborted----------0.000-0.000
psmt2-frontend.0.2----OK-----Aborted-Aborted----53.882-----0.000-0.000
re.1.9.0----OK-----Aborted-Aborted----2.630-----0.000-0.000
re2.v0.12.1----OK------------65.423--------
result.1.5----OK-----Aborted-Aborted----0.841-----0.000-0.000
sauvola-bench.1.0----OK-----Aborted-Aborted----4.750-----0.000-0.000
seq.base----------Aborted-Aborted----------0.000-0.000
sequence-bench.1.0----------Aborted-Aborted----------0.000-0.000
sexp_pretty.v0.12.0----OK------------1.617--------
sexplib.v0.12.0----OK------------1.253--------
sexplib.v0.13.0----------Aborted-Aborted----------0.000-0.000
sexplib0.v0.12.0----OK------------17.648--------
sexplib0.v0.13.0----------Aborted-Aborted----------0.000-0.000
shell.v0.12.0----OK------------3.566--------
spawn.v0.13.0----OK-----Aborted-Aborted----23.004-----0.000-0.000
splittable_random.v0.12.0----OK------------8.970--------
splittable_random.v0.13.0----------Aborted-Aborted----------0.000-0.000
stdio.v0.12.0----OK------------0.781--------
stdio.v0.13.0----------Aborted-Aborted----------0.000-0.000
stdlib-shims.0.1.0----OK-----Aborted-Aborted----0.409-----0.000-0.000
stringext.1.6.0----OK-----Aborted-Aborted----25.356-----0.000-0.000
textutils.v0.12.0----OK------------8.733--------
textutils.v0.13.0----------Aborted-Aborted----------0.000-0.000
textutils_kernel.v0.12.0----OK------------3.617--------
thread-bench.1.0----Failure (2)-----Aborted-Aborted----2.507-----0.000-0.000
time_now.v0.12.0----OK------------2.657--------
time_now.v0.13.0----------Aborted-Aborted----------0.000-0.000
topkg.1.0.1----------Aborted-Aborted----------0.000-0.000
typerep.v0.12.0----OK------------17.353--------
typerep.v0.13.0----------Aborted-Aborted----------0.000-0.000
uchar.0.0.2----------Aborted-Aborted----------0.000-0.000
uri.3.1.0----OK-----Aborted-Aborted----5.596-----0.000-0.000
uri-sexp.3.1.0----OK-----Aborted-Aborted----2.394-----0.000-0.000
uutf.1.0.2----------Aborted-Aborted----------0.000-0.000
variantslib.v0.12.0----OK------------16.675--------
variantslib.v0.13.0----------Aborted-Aborted----------0.000-0.000
why3.1.3.1----OK------------36.386--------
yojson.1.7.0----OK-----Aborted-Aborted----1.854-----0.000-0.000
yojson-bench.1.0----Failure (2)-----Aborted-Aborted----22.214-----0.000-0.000
zarith.1.9.1----------Aborted-Aborted----------0.000-0.000
Close

Error on yojson-bench.1.0 (4.07.1+clambda+bench)

Command:

/usr/bin/make -C yojson

Output

make: Entering directory '/home/louis/.opam/4.07.1+clambda+bench/.opam-switch/build/yojson-bench.1.0/yojson'
ocamlfind ocamlopt -I `ocamlfind query yojson` -o ydump_bench -package easy-format,biniou -linkpkg yojson.cmx yojson_biniou.cmx ydump.ml
gcc: error: /home/louis/.opam/4.07.1+clambda+bench/lib/yojson/yojson_biniou.o: No such file or directory
gcc: error: /home/louis/.opam/4.07.1+clambda+bench/lib/yojson/yojson.o: No such file or directory
File "caml_startup", line 1:
Error: Error during linking
Makefile:6: recipe for target 'all' failed
make: *** [all] Error 2
make: Leaving directory '/home/louis/.opam/4.07.1+clambda+bench/.opam-switch/build/yojson-bench.1.0/yojson'
Close

Error on thread-bench.1.0 (4.07.1+clambda+bench)

Command:

/usr/bin/make -C thread

Output

make: Entering directory '/home/louis/.opam/4.07.1+clambda+bench/.opam-switch/build/thread-bench.1.0/thread'
ocamlfind ocamlopt -package lwt.unix -linkpkg -o thread_sleep_lwt thread_sleep_lwt.ml
ocamlfind: [WARNING] Package `threads': Linking problems may arise because of the missing -thread or -vmthread switch
File "thread_sleep_lwt.ml", line 1:
Error: No implementations provided for the following modules:
         Mutex referenced from /home/louis/.opam/4.07.1+clambda+bench/lib/lwt/unix/lwt_unix.cmxa(Lwt_main)
Makefile:7: recipe for target 'thread_sleep_lwt' failed
make: *** [thread_sleep_lwt] Error 2
make: Leaving directory '/home/louis/.opam/4.07.1+clambda+bench/.opam-switch/build/thread-bench.1.0/thread'
Close

Error on ocaml-variants.4.08.0+trunk+flambda+opt (4.08.0+trunk+flambda+opt+bench)

Command:

~/.opam/4.08.0+trunk+flambda+opt+bench/.opam-switch/build/ocaml-variants.4.08.0+trunk+flambda+opt/./configure -prefix /home/louis/.opam/4.08.0+trunk+flambda+opt+bench -flambda -with-debug-runtime

Output

configure: error: unrecognized option: `-flambda'
Try `/home/louis/.opam/4.08.0+trunk+flambda+opt+bench/.opam-switch/build/ocaml-variants.4.08.0+trunk+flambda+opt/./configure --help' for more information
Close

Error on ocaml-variants.4.08.0+trunk+flambda (4.08.0+trunk+flambda+bench)

Command:

~/.opam/4.08.0+trunk+flambda+bench/.opam-switch/build/ocaml-variants.4.08.0+trunk+flambda/./configure -prefix /home/louis/.opam/4.08.0+trunk+flambda+bench -flambda -with-debug-runtime

Output

configure: error: unrecognized option: `-flambda'
Try `/home/louis/.opam/4.08.0+trunk+flambda+bench/.opam-switch/build/ocaml-variants.4.08.0+trunk+flambda/./configure --help' for more information
Close

Error on core-micro-bench.1.0 (4.07.1+clambda+bench)

Command:

/usr/bin/make -C core_micro

Output

make: Entering directory '/home/louis/.opam/4.07.1+clambda+bench/.opam-switch/build/core-micro-bench.1.0/core_micro'
ocamlbuild -use-ocamlfind runner.native
ocamlfind ocamldep -package str -package core -package core_bench.inline_benchmarks -modules runner.ml > runner.ml.depends
ocamlfind ocamlc -c -thread -package str -package core -package core_bench.inline_benchmarks -o runner.cmo runner.ml
+ ocamlfind ocamlc -c -thread -package str -package core -package core_bench.inline_benchmarks -o runner.cmo runner.ml
File "runner.ml", line 1, characters 5-13:
Error: Unbound module Core.Std
Command exited with code 2.
Makefile:4: recipe for target 'all' failed
make: *** [all] Error 10
make: Leaving directory '/home/louis/.opam/4.07.1+clambda+bench/.opam-switch/build/core-micro-bench.1.0/core_micro'
Close

Error on conf-graphviz.0.1 (4.07.1+clambda+bench)

Command:

/usr/bin/which dot

Output


Close

Error on cohttp-bench.1.0 (4.07.1+clambda+bench)

Command:

/usr/bin/make -C cohttp

Output

make: Entering directory '/home/louis/.opam/4.07.1+clambda+bench/.opam-switch/build/cohttp-bench.1.0/cohttp'
ocamlbuild -use-ocamlfind cohttp_lwt_bench.native cohttp_async_bench.native
ocamlfind ocamldep -package lwt.unix -package cohttp.lwt -modules cohttp_lwt_bench.ml > cohttp_lwt_bench.ml.depends
+ ocamlfind ocamldep -package lwt.unix -package cohttp.lwt -modules cohttp_lwt_bench.ml > cohttp_lwt_bench.ml.depends
ocamlfind: Package `cohttp.lwt' not found
Command exited with code 2.
Makefile:6: recipe for target 'all' failed
make: *** [all] Error 10
make: Leaving directory '/home/louis/.opam/4.07.1+clambda+bench/.opam-switch/build/cohttp-bench.1.0/cohttp'
Close

Error on chameneos-bench.1.0 (4.07.1+clambda+bench)

Command:

/usr/bin/make -C chameneos-redux

Output

make: Entering directory '/home/louis/.opam/4.07.1+clambda+bench/.opam-switch/build/chameneos-bench.1.0/chameneos-redux'
ocamlopt -bin-annot -thread unix.cmxa threads.cmxa chameneos_redux_th.ml -o chameneos_redux_th
ocamlopt -bin-annot -thread unix.cmxa threads.cmxa chameneos_redux_evtchn.ml -o chameneos_redux_evtchn
ocamlfind ocamlopt -bin-annot -package lwt.unix -linkpkg chameneos_redux_lwt.ml -o chameneos_redux_lwt
ocamlfind: [WARNING] Package `threads': Linking problems may arise because of the missing -thread or -vmthread switch
File "chameneos_redux_lwt.ml", line 1:
Error: No implementations provided for the following modules:
         Mutex referenced from /home/louis/.opam/4.07.1+clambda+bench/lib/lwt/unix/lwt_unix.cmxa(Lwt_main)
Makefile:6: recipe for target 'chameneos_redux_lwt' failed
make: *** [chameneos_redux_lwt] Error 2
make: Leaving directory '/home/louis/.opam/4.07.1+clambda+bench/.opam-switch/build/chameneos-bench.1.0/chameneos-redux'
Close

Error on async-rpc-bench.1.0 (4.07.1+clambda+bench)

Command:

/usr/bin/make -C async_rpc

Output

make: Entering directory '/home/louis/.opam/4.07.1+clambda+bench/.opam-switch/build/async-rpc-bench.1.0/async_rpc'
ocamlfind ocamlopt -thread -syntax camlp4o -package async -package bin_prot.syntax -package core -c rpc_common.ml
ocamlfind: Package `bin_prot.syntax' not found
Makefile:12: recipe for target 'rpc_common.cmx' failed
make: *** [rpc_common.cmx] Error 2
make: Leaving directory '/home/louis/.opam/4.07.1+clambda+bench/.opam-switch/build/async-rpc-bench.1.0/async_rpc'
Close

Error on async-echo-bench.1.0 (4.07.1+clambda+bench)

Command:

/usr/bin/make -C async_echo

Output

make: Entering directory '/home/louis/.opam/4.07.1+clambda+bench/.opam-switch/build/async-echo-bench.1.0/async_echo'
ocamlfind ocamlopt -thread -syntax camlp4o -package async -package bin_prot.syntax -package core -c echo_common.ml
ocamlfind: Package `bin_prot.syntax' not found
Makefile:20: recipe for target 'echo_common.cmx' failed
make: *** [echo_common.cmx] Error 2
make: Leaving directory '/home/louis/.opam/4.07.1+clambda+bench/.opam-switch/build/async-echo-bench.1.0/async_echo'