Package4.03.1+bench4.05.0+flambda+opt+bench4.06.1+flambda+bench4.06.1+flambda+opt+bench4.07.1+clambda+bench4.07.1+flambda+bench4.07.1+oclassic+bench4.08.0+gpr2165+bench4.08.0+mutmatch+bench4.08.0+trunk+bench4.08.0+trunk+flambda+bench4.08.0+trunk+flambda+oclassic+bench4.08.0+trunk+flambda+opt+bench4.03.1+bench time (s)4.05.0+flambda+opt+bench time (s)4.06.1+flambda+bench time (s)4.06.1+flambda+opt+bench time (s)4.07.1+clambda+bench time (s)4.07.1+flambda+bench time (s)4.07.1+oclassic+bench time (s)4.08.0+gpr2165+bench time (s)4.08.0+mutmatch+bench time (s)4.08.0+trunk+bench time (s)4.08.0+trunk+flambda+bench time (s)4.08.0+trunk+flambda+oclassic+bench time (s)4.08.0+trunk+flambda+opt+bench time (s)
almabench-bench.1.0----------Aborted-Aborted----------0.000-0.000
alt-ergo.2.3.2----------Aborted-Aborted----------0.000-0.000
alt-ergo-lib.2.3.2----------Aborted-Aborted----------0.000-0.000
alt-ergo-parsers.2.3.2----------Aborted-Aborted----------0.000-0.000
async.v0.13.0---------AbortedAborted-Aborted---------0.0000.000-0.000
async-echo-bench.1.0---------AbortedAborted-Aborted---------0.0000.000-0.000
async-rpc-bench.1.0---------AbortedAborted-Aborted---------0.0000.000-0.000
async_kernel.v0.13.0---------AbortedAborted-Aborted---------0.0000.000-0.000
async_rpc_kernel.v0.13.0---------AbortedAborted-Aborted---------0.0000.000-0.000
async_unix.v0.13.1---------AbortedAborted-Aborted---------0.0000.000-0.000
base.v0.13.2---------OKAborted-Aborted---------10.3020.000-0.000
base-bytes.base----------Aborted-Aborted----------0.000-0.000
base64.3.4.0---------OKAborted-Aborted---------3.4540.000-0.000
base_bigstring.v0.13.0---------AbortedAborted-Aborted---------0.0000.000-0.000
base_quickcheck.v0.13.0---------AbortedAborted-Aborted---------0.0000.000-0.000
bdd-bench.1.0----------Aborted-Aborted----------0.000-0.000
bin_prot.v0.13.0---------AbortedAborted-Aborted---------0.0000.000-0.000
biniou.1.2.1---------OKAborted-Aborted---------21.8520.000-0.000
camlimages.5.0.2---------OKAborted-Aborted---------2.8560.000-0.000
camlpdf.2.3----------Aborted-Aborted----------0.000-0.000
camlzip.1.10----------Aborted-Aborted----------0.000-0.000
chameneos-bench.1.0---------AbortedAborted-Aborted---------0.0000.000-0.000
cohttp.2.5.1---------AbortedAborted-Aborted---------0.0000.000-0.000
cohttp-bench.1.0---------AbortedAborted-Aborted---------0.0000.000-0.000
configurator.v0.11.0---------OKAborted-Aborted---------2.9840.000-0.000
core.v0.13.0---------AbortedAborted-Aborted---------0.0000.000-0.000
core-micro-bench.1.0---------AbortedAborted-Aborted---------0.0000.000-0.000
core-sequence-bench.1.0---------AbortedAborted-Aborted---------0.0000.000-0.000
core_bench.v0.13.0---------AbortedAborted-Aborted---------0.0000.000-0.000
core_kernel.v0.13.1---------AbortedAborted-Aborted---------0.0000.000-0.000
cpdf.2.3----------Aborted-Aborted----------0.000-0.000
cpdf-bench.1.0----------Aborted-Aborted----------0.000-0.000
cppo.1.6.6---------OKAborted-Aborted---------1.1390.000-0.000
dune.2.6.0---------OKAborted-Aborted---------12.6420.000-0.000
dune-configurator.2.6.0---------OKAborted-Aborted---------9.0110.000-0.000
dune-private-libs.2.6.0---------OKAborted-Aborted---------5.9560.000-0.000
easy-format.1.3.2---------OKAborted-Aborted---------0.3780.000-0.000
fieldslib.v0.13.0---------OKAborted-Aborted---------0.3100.000-0.000
jane-street-headers.v0.13.0---------OKAborted-Aborted---------0.2640.000-0.000
jbuilder.1.0+beta20.2----------Aborted-Aborted----------0.000-0.000
json-bench-data.1.0----------Aborted-Aborted----------0.000-0.000
jsonm.1.0.1----------Aborted-Aborted----------0.000-0.000
jsonm-bench.1.0----------Aborted-Aborted----------0.000-0.000
jst-config.v0.13.0---------AbortedAborted-Aborted---------0.0000.000-0.000
kb-bench.1.0----------Aborted-Aborted----------0.000-0.000
lexifi-g2pp-bench.1.0----------Aborted-Aborted----------0.000-0.000
lwt.5.3.0---------OKAborted-Aborted---------7.7390.000-0.000
menhir.20200612---------OKAborted-Aborted---------21.1110.000-0.000
menhir-bench.1.0---------OKAborted-Aborted---------0.2370.000-0.000
menhirLib.20200612---------OKAborted-Aborted---------1.3000.000-0.000
menhirSdk.20200612---------OKAborted-Aborted---------0.6830.000-0.000
minilight.1.6----------Aborted-Aborted----------0.000-0.000
minilight-bench.1.0----------Aborted-Aborted----------0.000-0.000
mmap.1.1.0---------OKAborted-Aborted---------0.4090.000-0.000
nbcodec.1.0----------Aborted-Aborted----------0.000-0.000
nbcodec-bench.1.0----------Aborted-Aborted----------0.000-0.000
num.1.3----------Aborted-Aborted----------0.000-0.000
numerical-analysis-bench.1.0---------Failure (2)Aborted-Aborted---------8.8820.000-0.000
ocaml.4.08.0----------Aborted-Aborted----------0.000-0.000
ocaml-compiler-libs.v0.12.1---------OKAborted-Aborted---------2.6620.000-0.000
ocaml-migrate-parsetree.1.7.3---------Failure (1)Aborted-Aborted---------5.2630.000-0.000
ocaml-variants.4.08.0+trunk+flambda----------Failure (1)------------0.335--
ocaml-variants.4.08.0+trunk+flambda+opt------------Failure (1)------------0.337
ocamlbuild.0.14.0----------Aborted-Aborted----------0.000-0.000
ocamlfind.1.8.1----------Aborted-Aborted----------0.000-0.000
ocplib-endian.1.1---------OKAborted-Aborted---------22.2680.000-0.000
ocplib-simplex.0.4----------Aborted-Aborted----------0.000-0.000
octavius.1.2.2---------OKAborted-Aborted---------3.5170.000-0.000
parsexp.v0.13.0---------OKAborted-Aborted---------1.7990.000-0.000
patdiff.v0.13.0---------AbortedAborted-Aborted---------0.0000.000-0.000
patdiff-bench.1.0---------AbortedAborted-Aborted---------0.0000.000-0.000
patience_diff.v0.13.0---------AbortedAborted-Aborted---------0.0000.000-0.000
pcre.7.4.3---------OKAborted-Aborted---------2.6920.000-0.000
ppx_assert.v0.13.0---------AbortedAborted-Aborted---------0.0000.000-0.000
ppx_base.v0.13.0---------AbortedAborted-Aborted---------0.0000.000-0.000
ppx_bench.v0.13.0---------AbortedAborted-Aborted---------0.0000.000-0.000
ppx_bin_prot.v0.13.0---------AbortedAborted-Aborted---------0.0000.000-0.000
ppx_cold.v0.13.0---------AbortedAborted-Aborted---------0.0000.000-0.000
ppx_compare.v0.13.0---------AbortedAborted-Aborted---------0.0000.000-0.000
ppx_custom_printf.v0.13.0---------AbortedAborted-Aborted---------0.0000.000-0.000
ppx_derivers.1.2.1---------OKAborted-Aborted---------0.4970.000-0.000
ppx_enumerate.v0.13.0---------AbortedAborted-Aborted---------0.0000.000-0.000
ppx_expect.v0.13.1---------AbortedAborted-Aborted---------0.0000.000-0.000
ppx_fail.v0.13.0---------AbortedAborted-Aborted---------0.0000.000-0.000
ppx_fields_conv.v0.13.0---------AbortedAborted-Aborted---------0.0000.000-0.000
ppx_hash.v0.13.0---------AbortedAborted-Aborted---------0.0000.000-0.000
ppx_here.v0.13.0---------AbortedAborted-Aborted---------0.0000.000-0.000
ppx_inline_test.v0.13.1---------AbortedAborted-Aborted---------0.0000.000-0.000
ppx_jane.v0.13.0---------AbortedAborted-Aborted---------0.0000.000-0.000
ppx_js_style.v0.13.0---------AbortedAborted-Aborted---------0.0000.000-0.000
ppx_let.v0.13.0---------AbortedAborted-Aborted---------0.0000.000-0.000
ppx_module_timer.v0.13.0---------AbortedAborted-Aborted---------0.0000.000-0.000
ppx_optcomp.v0.13.0---------AbortedAborted-Aborted---------0.0000.000-0.000
ppx_optional.v0.13.0---------AbortedAborted-Aborted---------0.0000.000-0.000
ppx_pipebang.v0.13.0---------AbortedAborted-Aborted---------0.0000.000-0.000
ppx_sexp_conv.v0.13.0---------AbortedAborted-Aborted---------0.0000.000-0.000
ppx_sexp_message.v0.13.0---------AbortedAborted-Aborted---------0.0000.000-0.000
ppx_sexp_value.v0.13.0---------AbortedAborted-Aborted---------0.0000.000-0.000
ppx_stable.v0.13.0---------AbortedAborted-Aborted---------0.0000.000-0.000
ppx_typerep_conv.v0.13.0---------AbortedAborted-Aborted---------0.0000.000-0.000
ppx_variants_conv.v0.13.0---------AbortedAborted-Aborted---------0.0000.000-0.000
ppxlib.0.13.0---------AbortedAborted-Aborted---------0.0000.000-0.000
protocol_version_header.v0.13.0---------AbortedAborted-Aborted---------0.0000.000-0.000
psmt2-frontend.0.2----------Aborted-Aborted----------0.000-0.000
re.1.9.0---------OKAborted-Aborted---------18.1010.000-0.000
result.1.5---------OKAborted-Aborted---------0.6540.000-0.000
sauvola-bench.1.0---------OKAborted-Aborted---------0.3610.000-0.000
seq.base----------Aborted-Aborted----------0.000-0.000
sequence-bench.1.0----------Aborted-Aborted----------0.000-0.000
sexplib.v0.13.0---------OKAborted-Aborted---------2.3330.000-0.000
sexplib0.v0.13.0---------OKAborted-Aborted---------22.3810.000-0.000
spawn.v0.13.0---------OKAborted-Aborted---------0.7250.000-0.000
splittable_random.v0.13.0---------AbortedAborted-Aborted---------0.0000.000-0.000
stdio.v0.13.0---------OKAborted-Aborted---------0.9600.000-0.000
stdlib-shims.0.1.0---------OKAborted-Aborted---------0.6280.000-0.000
stringext.1.6.0---------OKAborted-Aborted---------22.5700.000-0.000
textutils.v0.13.0---------AbortedAborted-Aborted---------0.0000.000-0.000
thread-bench.1.0---------AbortedAborted-Aborted---------0.0000.000-0.000
time_now.v0.13.0---------AbortedAborted-Aborted---------0.0000.000-0.000
topkg.1.0.1----------Aborted-Aborted----------0.000-0.000
typerep.v0.13.0---------OKAborted-Aborted---------3.1180.000-0.000
uchar.0.0.2----------Aborted-Aborted----------0.000-0.000
uri.3.1.0---------OKAborted-Aborted---------3.7750.000-0.000
uri-sexp.3.1.0---------AbortedAborted-Aborted---------0.0000.000-0.000
uutf.1.0.2----------Aborted-Aborted----------0.000-0.000
variantslib.v0.13.0---------OKAborted-Aborted---------4.3310.000-0.000
yojson.1.7.0---------OKAborted-Aborted---------2.9080.000-0.000
yojson-bench.1.0---------Failure (2)Aborted-Aborted---------0.1820.000-0.000
zarith.1.9.1----------Aborted-Aborted----------0.000-0.000
Close

Error on yojson-bench.1.0 (4.08.0+trunk+bench)

Command:

/usr/bin/make -C yojson

Output

make: Entering directory '/home/louis/.opam/4.08.0+trunk+bench/.opam-switch/build/yojson-bench.1.0/yojson'
ocamlfind ocamlopt -I `ocamlfind query yojson` -o ydump_bench -package easy-format,biniou -linkpkg yojson.cmx yojson_biniou.cmx ydump.ml
gcc: error: /home/louis/.opam/4.08.0+trunk+bench/lib/yojson/yojson_biniou.o: No such file or directory
gcc: error: /home/louis/.opam/4.08.0+trunk+bench/lib/yojson/yojson.o: No such file or directory
File "caml_startup", line 1:
Error: Error during linking (exit code 1)
Makefile:6: recipe for target 'all' failed
make: *** [all] Error 2
make: Leaving directory '/home/louis/.opam/4.08.0+trunk+bench/.opam-switch/build/yojson-bench.1.0/yojson'
Close

Error on ocaml-variants.4.08.0+trunk+flambda+opt (4.08.0+trunk+flambda+opt+bench)

Command:

~/.opam/4.08.0+trunk+flambda+opt+bench/.opam-switch/build/ocaml-variants.4.08.0+trunk+flambda+opt/./configure -prefix /home/louis/.opam/4.08.0+trunk+flambda+opt+bench -flambda -with-debug-runtime

Output

configure: error: unrecognized option: `-flambda'
Try `/home/louis/.opam/4.08.0+trunk+flambda+opt+bench/.opam-switch/build/ocaml-variants.4.08.0+trunk+flambda+opt/./configure --help' for more information
Close

Error on ocaml-variants.4.08.0+trunk+flambda (4.08.0+trunk+flambda+bench)

Command:

~/.opam/4.08.0+trunk+flambda+bench/.opam-switch/build/ocaml-variants.4.08.0+trunk+flambda/./configure -prefix /home/louis/.opam/4.08.0+trunk+flambda+bench -flambda -with-debug-runtime

Output

configure: error: unrecognized option: `-flambda'
Try `/home/louis/.opam/4.08.0+trunk+flambda+bench/.opam-switch/build/ocaml-variants.4.08.0+trunk+flambda/./configure --help' for more information
Close

Error on ocaml-migrate-parsetree.1.7.3 (4.08.0+trunk+bench)

Command:

~/.opam/4.08.0+trunk+bench/bin/dune build -p ocaml-migrate-parsetree -j 7

Output

       ocaml src/ast-version,src/compiler-functions-file (exit 1)
(cd _build/default/src && /home/louis/.opam/4.08.0+trunk+bench/bin/ocaml config/gen.ml 4.12.0+dev0-2020-04-22)
Unkown OCaml version 4.12.0+dev0-2020-04-22
Close

Error on numerical-analysis-bench.1.0 (4.08.0+trunk+bench)

Command:

/usr/bin/make

Output

ulimit -s 98304; ocamlopt.opt  -I simple_access `ocamldep.opt -sort simple_access/*.ml` main_nogcstats.ml -o simple_access.opt
ulimit -s 98304; ocamlopt.opt  -I lu-decomposition `ocamldep.opt -sort lu-decomposition/*.ml` main_nogcstats.ml -o lu-decomposition.opt
ulimit -s 98304; ocamlopt.opt  -I fft `ocamldep.opt -sort fft/*.ml` main_nogcstats.ml -o fft.opt
ulimit -s 98304; ocamlopt.opt  -I rnd_access `ocamldep.opt -sort rnd_access/*.ml` main_nogcstats.ml -o rnd_access.opt
ulimit -s 98304; ocamlopt.opt  -I k-means `ocamldep.opt -sort k-means/*.ml` main_nogcstats.ml -o k-means.opt
Fatal error: exception Stack overflow
Makefile:20: recipe for target 'k-means.opt' failed
make: *** [k-means.opt] Error 2